lucene-dev mailing list archives

Site index · List index
Message view « Date » · « Thread »
Top « Date » · « Thread »
From Michael McCandless <luc...@mikemccandless.com>
Subject Re: [JENKINS] Lucene-Solr-trunk-Windows-Java6-64 - Build # 582 - Failure!
Date Wed, 20 Jun 2012 15:57:05 GMT
I committed a fix.

Mike McCandless

http://blog.mikemccandless.com

On Wed, Jun 20, 2012 at 11:25 AM, Policeman Jenkins Server
<jenkins@sd-datasolutions.de> wrote:
> Build: http://jenkins.sd-datasolutions.de/job/Lucene-Solr-trunk-Windows-Java6-64/582/
>
> 1 tests failed.
> REGRESSION:  org.apache.lucene.index.TestDeletionPolicy.testExpirationTimeDeletionPolicy
>
> Error Message:
> no commits were deleted
>
> Stack Trace:
> java.lang.AssertionError: no commits were deleted
>        at __randomizedtesting.SeedInfo.seed([6AC7006FA19D3856:9C0DC44F22324CE3]:0)
>        at org.junit.Assert.fail(Assert.java:93)
>        at org.junit.Assert.assertTrue(Assert.java:43)
>        at org.apache.lucene.index.TestDeletionPolicy.testExpirationTimeDeletionPolicy(TestDeletionPolicy.java:248)
>        at sun.reflect.NativeMethodAccessorImpl.invoke0(Native Method)
>        at sun.reflect.NativeMethodAccessorImpl.invoke(NativeMethodAccessorImpl.java:39)
>        at sun.reflect.DelegatingMethodAccessorImpl.invoke(DelegatingMethodAccessorImpl.java:25)
>        at java.lang.reflect.Method.invoke(Method.java:597)
>        at com.carrotsearch.randomizedtesting.RandomizedRunner.invoke(RandomizedRunner.java:1969)
>        at com.carrotsearch.randomizedtesting.RandomizedRunner.access$1100(RandomizedRunner.java:132)
>        at com.carrotsearch.randomizedtesting.RandomizedRunner$6.evaluate(RandomizedRunner.java:814)
>        at com.carrotsearch.randomizedtesting.RandomizedRunner$7.evaluate(RandomizedRunner.java:875)
>        at com.carrotsearch.randomizedtesting.RandomizedRunner$8.evaluate(RandomizedRunner.java:889)
>        at org.apache.lucene.util.TestRuleSetupTeardownChained$1.evaluate(TestRuleSetupTeardownChained.java:50)
>        at org.apache.lucene.util.TestRuleFieldCacheSanity$1.evaluate(TestRuleFieldCacheSanity.java:32)
>        at org.apache.lucene.util.AbstractBeforeAfterRule$1.evaluate(AbstractBeforeAfterRule.java:45)
>        at com.carrotsearch.randomizedtesting.rules.SystemPropertiesInvariantRule$1.evaluate(SystemPropertiesInvariantRule.java:55)
>        at org.apache.lucene.util.TestRuleReportUncaughtExceptions$1.evaluate(TestRuleReportUncaughtExceptions.java:68)
>        at org.apache.lucene.util.TestRuleThreadAndTestName$1.evaluate(TestRuleThreadAndTestName.java:48)
>        at org.apache.lucene.util.TestRuleMarkFailure$1.evaluate(TestRuleMarkFailure.java:48)
>        at com.carrotsearch.randomizedtesting.RandomizedRunner.runSingleTest(RandomizedRunner.java:821)
>        at com.carrotsearch.randomizedtesting.RandomizedRunner.access$700(RandomizedRunner.java:132)
>        at com.carrotsearch.randomizedtesting.RandomizedRunner$3$1.run(RandomizedRunner.java:669)
>        at com.carrotsearch.randomizedtesting.RandomizedRunner$3.evaluate(RandomizedRunner.java:695)
>        at com.carrotsearch.randomizedtesting.RandomizedRunner$4.evaluate(RandomizedRunner.java:734)
>        at com.carrotsearch.randomizedtesting.RandomizedRunner$5.evaluate(RandomizedRunner.java:745)
>        at org.apache.lucene.util.AbstractBeforeAfterRule$1.evaluate(AbstractBeforeAfterRule.java:45)
>        at org.apache.lucene.util.TestRuleReportUncaughtExceptions$1.evaluate(TestRuleReportUncaughtExceptions.java:68)
>        at org.apache.lucene.util.TestRuleStoreClassName$1.evaluate(TestRuleStoreClassName.java:38)
>        at org.apache.lucene.util.TestRuleIcuHack$1.evaluate(TestRuleIcuHack.java:51)
>        at com.carrotsearch.randomizedtesting.rules.SystemPropertiesInvariantRule$1.evaluate(SystemPropertiesInvariantRule.java:55)
>        at org.apache.lucene.util.TestRuleNoInstanceHooksOverrides$1.evaluate(TestRuleNoInstanceHooksOverrides.java:53)
>        at org.apache.lucene.util.TestRuleNoStaticHooksShadowing$1.evaluate(TestRuleNoStaticHooksShadowing.java:52)
>        at org.apache.lucene.util.TestRuleAssertionsRequired$1.evaluate(TestRuleAssertionsRequired.java:36)
>        at org.apache.lucene.util.TestRuleMarkFailure$1.evaluate(TestRuleMarkFailure.java:48)
>        at org.apache.lucene.util.TestRuleIgnoreTestSuites$1.evaluate(TestRuleIgnoreTestSuites.java:56)
>        at com.carrotsearch.randomizedtesting.RandomizedRunner.runSuite(RandomizedRunner.java:605)
>        at com.carrotsearch.randomizedtesting.RandomizedRunner.access$400(RandomizedRunner.java:132)
>        at com.carrotsearch.randomizedtesting.RandomizedRunner$2.run(RandomizedRunner.java:551)
>
>
>
>
> Build Log:
> [...truncated 1027 lines...]
>   [junit4] Suite: org.apache.lucene.index.TestDeletionPolicy
>   [junit4] FAILURE 1.98s | TestDeletionPolicy.testExpirationTimeDeletionPolicy
>   [junit4]    > Throwable #1: java.lang.AssertionError: no commits were deleted
>   [junit4]    >        at __randomizedtesting.SeedInfo.seed([6AC7006FA19D3856:9C0DC44F22324CE3]:0)
>   [junit4]    >        at org.junit.Assert.fail(Assert.java:93)
>   [junit4]    >        at org.junit.Assert.assertTrue(Assert.java:43)
>   [junit4]    >        at org.apache.lucene.index.TestDeletionPolicy.testExpirationTimeDeletionPolicy(TestDeletionPolicy.java:248)
>   [junit4]    >        at sun.reflect.NativeMethodAccessorImpl.invoke0(Native
Method)
>   [junit4]    >        at sun.reflect.NativeMethodAccessorImpl.invoke(NativeMethodAccessorImpl.java:39)
>   [junit4]    >        at sun.reflect.DelegatingMethodAccessorImpl.invoke(DelegatingMethodAccessorImpl.java:25)
>   [junit4]    >        at java.lang.reflect.Method.invoke(Method.java:597)
>   [junit4]    >        at com.carrotsearch.randomizedtesting.RandomizedRunner.invoke(RandomizedRunner.java:1969)
>   [junit4]    >        at com.carrotsearch.randomizedtesting.RandomizedRunner.access$1100(RandomizedRunner.java:132)
>   [junit4]    >        at com.carrotsearch.randomizedtesting.RandomizedRunner$6.evaluate(RandomizedRunner.java:814)
>   [junit4]    >        at com.carrotsearch.randomizedtesting.RandomizedRunner$7.evaluate(RandomizedRunner.java:875)
>   [junit4]    >        at com.carrotsearch.randomizedtesting.RandomizedRunner$8.evaluate(RandomizedRunner.java:889)
>   [junit4]    >        at org.apache.lucene.util.TestRuleSetupTeardownChained$1.evaluate(TestRuleSetupTeardownChained.java:50)
>   [junit4]    >        at org.apache.lucene.util.TestRuleFieldCacheSanity$1.evaluate(TestRuleFieldCacheSanity.java:32)
>   [junit4]    >        at org.apache.lucene.util.AbstractBeforeAfterRule$1.evaluate(AbstractBeforeAfterRule.java:45)
>   [junit4]    >        at com.carrotsearch.randomizedtesting.rules.SystemPropertiesInvariantRule$1.evaluate(SystemPropertiesInvariantRule.java:55)
>   [junit4]    >        at org.apache.lucene.util.TestRuleReportUncaughtExceptions$1.evaluate(TestRuleReportUncaughtExceptions.java:68)
>   [junit4]    >        at org.apache.lucene.util.TestRuleThreadAndTestName$1.evaluate(TestRuleThreadAndTestName.java:48)
>   [junit4]    >        at org.apache.lucene.util.TestRuleMarkFailure$1.evaluate(TestRuleMarkFailure.java:48)
>   [junit4]    >        at com.carrotsearch.randomizedtesting.RandomizedRunner.runSingleTest(RandomizedRunner.java:821)
>   [junit4]    >        at com.carrotsearch.randomizedtesting.RandomizedRunner.access$700(RandomizedRunner.java:132)
>   [junit4]    >        at com.carrotsearch.randomizedtesting.RandomizedRunner$3$1.run(RandomizedRunner.java:669)
>   [junit4]    >        at com.carrotsearch.randomizedtesting.RandomizedRunner$3.evaluate(RandomizedRunner.java:695)
>   [junit4]    >        at com.carrotsearch.randomizedtesting.RandomizedRunner$4.evaluate(RandomizedRunner.java:734)
>   [junit4]    >        at com.carrotsearch.randomizedtesting.RandomizedRunner$5.evaluate(RandomizedRunner.java:745)
>   [junit4]    >        at org.apache.lucene.util.AbstractBeforeAfterRule$1.evaluate(AbstractBeforeAfterRule.java:45)
>   [junit4]    >        at org.apache.lucene.util.TestRuleReportUncaughtExceptions$1.evaluate(TestRuleReportUncaughtExceptions.java:68)
>   [junit4]    >        at org.apache.lucene.util.TestRuleStoreClassName$1.evaluate(TestRuleStoreClassName.java:38)
>   [junit4]    >        at org.apache.lucene.util.TestRuleIcuHack$1.evaluate(TestRuleIcuHack.java:51)
>   [junit4]    >        at com.carrotsearch.randomizedtesting.rules.SystemPropertiesInvariantRule$1.evaluate(SystemPropertiesInvariantRule.java:55)
>   [junit4]    >        at org.apache.lucene.util.TestRuleNoInstanceHooksOverrides$1.evaluate(TestRuleNoInstanceHooksOverrides.java:53)
>   [junit4]    >        at org.apache.lucene.util.TestRuleNoStaticHooksShadowing$1.evaluate(TestRuleNoStaticHooksShadowing.java:52)
>   [junit4]    >        at org.apache.lucene.util.TestRuleAssertionsRequired$1.evaluate(TestRuleAssertionsRequired.java:36)
>   [junit4]    >        at org.apache.lucene.util.TestRuleMarkFailure$1.evaluate(TestRuleMarkFailure.java:48)
>   [junit4]    >        at org.apache.lucene.util.TestRuleIgnoreTestSuites$1.evaluate(TestRuleIgnoreTestSuites.java:56)
>   [junit4]    >        at com.carrotsearch.randomizedtesting.RandomizedRunner.runSuite(RandomizedRunner.java:605)
>   [junit4]    >        at com.carrotsearch.randomizedtesting.RandomizedRunner.access$400(RandomizedRunner.java:132)
>   [junit4]    >        at com.carrotsearch.randomizedtesting.RandomizedRunner$2.run(RandomizedRunner.java:551)
>   [junit4]    >
>   [junit4]   2> NOTE: reproduce with: ant test  -Dtestcase=TestDeletionPolicy -Dtests.method=testExpirationTimeDeletionPolicy
-Dtests.seed=6AC7006FA19D3856 -Dtests.locale=fr_LU -Dtests.timezone=Etc/GMT+2 -Dargs="-Dfile.encoding=Cp1252"
>   [junit4]   2>
>   [junit4]    > (@AfterClass output)
>   [junit4]   2> NOTE: test params are: codec=Lucene40: {id=MockFixedIntBlock(blockSize=545),
content=PostingsFormat(name=NestedPulsing)}, sim=DefaultSimilarity, locale=fr_LU, timezone=Etc/GMT+2
>   [junit4]   2> NOTE: Windows 7 6.1 amd64/Sun Microsystems Inc. 1.6.0_32 (64-bit)/cpus=2,threads=1,free=343604536,total=490536960
>   [junit4]   2> NOTE: All tests run in this JVM: [TestMergeSchedulerExternal, TestRegexpQuery,
TestMultiPhraseQuery, MultiCollectorTest, TestParallelTermEnum, TestSumDocFreq, TestLucene40PostingsReader,
TestBufferedIndexInput, TestMatchAllDocsQuery, TestForTooMuchCloning, TestBitUtil, TestPrefixFilter,
TestLock, TestBinaryDocument, TestIndexWriter, TestAssertions, TestIndexWriterReader, TestSmallFloat,
TestByteArrayDataInput, TestExplanations, TestIndexWriterOnDiskFull, TestComplexExplanationsOfNonMatches,
TestSimpleExplanationsOfNonMatches, TestBackwardsCompatibility, TestFieldCacheSanityChecker,
TestBytesRefHash, TestDirectory, TestPayloadProcessorProvider, TestTermdocPerf, TestSpecialOperations,
TestCompoundFile, TestCustomNorms, TestWildcardRandom, TestDocTermOrds, TestRegexpRandom,
TestSimilarityProvider, Nested1, Nested2, Nested3, TestBoolean2, TestRecyclingByteBlockAllocator,
TestAutomatonQueryUnicode, TestDateSort, TestIndexWriterForceMerge, TestConcurrentMergeScheduler,
TestOpenBitSet, TestSortedVIntList, TestQueryWrapperFilter, TestPriorityQueue, TestSimpleExplanations,
TestRollback, TestReuseDocsEnum, TestRollingBuffer, TestNoMergePolicy, TestElevationComparator,
TestMultiTermQueryRewrites, TestComplexExplanations, TestSpanFirstQuery, TestIdentityHashSet,
Nested, Nested, Nested, Nested, Nested, Nested, Nested, Nested, Nested, Nested, Nested, Nested,
Nested, Nested, Nested, Nested, Nested, Nested, Nested, Nested, Nested, TestAutomatonQuery,
TestNamedSPILoader, TestPhraseQuery, TestTermVectorsReader, TestSimilarityBase, TestSimpleSearchEquivalence,
TestSentinelIntSet, TestVirtualMethod, TestPerSegmentDeletes, TestSnapshotDeletionPolicy,
TestTermsEnum, TestBasicOperations, TestIndexWriterLockRelease, Test2BDocs, TestNRTManager,
TestPositiveScoresOnlyCollector, TestFilterAtomicReader, TestVersionComparator, TestDirectoryReader,
TestIntsRef, TestTopDocsCollector, TestDocsAndPositions, TestDateTools, TestNumericUtils,
TestNRTThreads, TestBitVector, TestParallelCompositeReader, TestToken, TestForceMergeForever,
TestSpansAdvanced2, TestBytesRef, TestCachingTokenFilter, Test10KPulsings, TestSegmentTermEnum,
TestMaxTermFrequency, TestPersistentSnapshotDeletionPolicy, TestDocumentsWriterStallControl,
TestMultiThreadTermVectors, TestIndexFileDeleter, TestNewestSegment, TestSearcherManager,
TestFilteredQuery, TestGraphTokenizers, TestAddIndexes, TestNorms, TestBasics, TestPrefixRandom,
TestBinaryTerms, TestStressIndexing, InBeforeClass, InAfterClass, InTestMethod, NonStringProperties,
TestPulsingReuse, TestMultiTermConstantScore, TestReaderClosed, TestMultiValuedNumericRangeQuery,
TestDateFilter, TestCustomSearcherSort, TestDocBoost, TestFilteredSearch, TestSegmentTermDocs,
TestFlushByRamOrCountsPolicy, TestDocCount, TestPostingsOffsets, TestSpans, TestTerm, TestTwoPhaseCommitTool,
TestNoDeletionPolicy, TestThreadedForceMerge, TestDemo, TestWildcard, TestUniqueTermCount,
TestHugeRamFile, TestPayloadNearQuery, TestPhrasePrefixQuery, TestTermsEnum2, TestAttributeSource,
TestNGramPhraseQuery, TestSearch, TestCrash, TestSpanSearchEquivalence, TestSetOnce, TestDoubleBarrelLRUCache,
TestFieldsReader, TestBooleanMinShouldMatch, TestCharsRef, TestDocValues, TestMultiMMap, TestDocValuesScoring,
TestLookaheadTokenFilter, TestShardSearching, TestPayloads, TestPositionIncrement, TestDuelingCodecs,
TestIndexableField, TestFileSwitchDirectory, TestIndexInput, TestRandomStoredFields, TestCollectionUtil,
TestStressIndexing2, TestSimilarity, TestFixedBitSet, TestFieldMaskingSpanQuery, TestDeterminizeLexicon,
TestWindowsMMap, TestByteBlockPool, TestFieldCacheRangeFilter, TestIndexWriterWithThreads,
TestRamUsageEstimator, TestUTF32ToUTF8, TestDeterminism, TestPackedInts, TestSearchAfter,
TestExternalCodecs, TestRAMDirectory, TestIndexWriterExceptions, TestPrefixCodedTerms, TestSpanExplanationsOfNonMatches,
TestMultiFields, TestSegmentReader, TestByteSlices, TestBooleanOr, TestIsCurrent, TestCompiledAutomaton,
TestIndexWriterDelete, TestPrefixQuery, TestDocument, TestSloppyPhraseQuery2, TestCharTermAttributeImpl,
TestConstantScoreQuery, TestWeakIdentityMap, TestLazyProxSkipping, TestNearSpansOrdered, TestOmitPositions,
TestMinimize, TestUnicodeUtil, TestTermScorer, TestBooleanScorer, TestSearchForDuplicates,
TestCachingWrapperFilter, TestRamUsageEstimatorOnWildAnimals, TestFieldCacheTermsFilter, TestNot,
TestTypePromotion, TestTimeLimitingCollector, TestTieredMergePolicy, TestPayloadTermQuery,
TestBooleanQuery, TestSpansAdvanced, TestSizeBoundedForceMerge, TestCrashCausesCorruptIndex,
TestParallelAtomicReader, TestDisjunctionMaxQuery, TestStressNRT, TestSimilarity2, TestSearchWithThreads,
TestTermVectorsWriter, TestIndexWriterMerging, Nested1, TestSpanMultiTermQueryWrapper, TestParallelReaderEmptyIndex,
TestIndexWriterNRTIsCurrent, TestAllFilesHaveCodecHeader, TestMockCharFilter, TestTermVectors,
TestTransactionRollback, TestNRTCachingDirectory, TestAppendingCodec, TestScoreCachingWrappingScorer,
TestNumericRangeQuery64, TestFSTs, TestNumericRangeQuery32, TestRegexpRandom2, TestDeletionPolicy]
>   [junit4]   2>
>   [junit4] Completed in 2.19s, 6 tests, 1 failure <<< FAILURES!
>
> [...truncated 224 lines...]
> BUILD FAILED
> C:\Jenkins\workspace\Lucene-Solr-trunk-Windows-Java6-64\build.xml:29: The following error
occurred while executing this line:
> C:\Jenkins\workspace\Lucene-Solr-trunk-Windows-Java6-64\lucene\build.xml:50: The following
error occurred while executing this line:
> C:\Jenkins\workspace\Lucene-Solr-trunk-Windows-Java6-64\lucene\common-build.xml:1019:
The following error occurred while executing this line:
> C:\Jenkins\workspace\Lucene-Solr-trunk-Windows-Java6-64\lucene\common-build.xml:745:
There were test failures: 300 suites, 1705 tests, 1 failure, 11 ignored (10 assumptions)
>
> Total time: 6 minutes 38 seconds
> Build step 'Invoke Ant' marked build as failure
> Recording test results
> Email was triggered for: Failure
> Sending email for trigger: Failure
>
>
>
>
>
> ---------------------------------------------------------------------
> To unsubscribe, e-mail: dev-unsubscribe@lucene.apache.org
> For additional commands, e-mail: dev-help@lucene.apache.org

---------------------------------------------------------------------
To unsubscribe, e-mail: dev-unsubscribe@lucene.apache.org
For additional commands, e-mail: dev-help@lucene.apache.org


Mime
View raw message