lucene-dev mailing list archives

Site index · List index
Message view « Date » · « Thread »
Top « Date » · « Thread »
From Michael McCandless <luc...@mikemccandless.com>
Subject Re: [JENKINS] Lucene-Solr-tests-only-trunk-java7 - Build # 2776 - Failure
Date Tue, 05 Jun 2012 18:47:49 GMT
I committed a fix.

Mike McCandless

http://blog.mikemccandless.com


On Tue, Jun 5, 2012 at 1:27 PM, Apache Jenkins Server
<jenkins@builds.apache.org> wrote:
> Build: https://builds.apache.org/job/Lucene-Solr-tests-only-trunk-java7/2776/
>
> 1 tests failed.
> REGRESSION:  org.apache.lucene.search.TestSearcherManager.testSearcherManager
>
> Error Message:
> Thread threw an uncaught exception, thread: Thread[Thread-555,5,]
>
> Stack Trace:
> java.lang.RuntimeException: Thread threw an uncaught exception, thread: Thread[Thread-555,5,]
>        at com.carrotsearch.randomizedtesting.RunnerThreadGroup.processUncaught(RunnerThreadGroup.java:96)
>        at com.carrotsearch.randomizedtesting.RandomizedRunner.runSingleTest(RandomizedRunner.java:857)
>        at com.carrotsearch.randomizedtesting.RandomizedRunner.access$700(RandomizedRunner.java:132)
>        at com.carrotsearch.randomizedtesting.RandomizedRunner$3$1.run(RandomizedRunner.java:669)
>        at com.carrotsearch.randomizedtesting.RandomizedRunner$3.evaluate(RandomizedRunner.java:695)
>        at com.carrotsearch.randomizedtesting.RandomizedRunner$4.evaluate(RandomizedRunner.java:734)
>        at com.carrotsearch.randomizedtesting.RandomizedRunner$5.evaluate(RandomizedRunner.java:745)
>        at org.apache.lucene.util.AbstractBeforeAfterRule$1.evaluate(AbstractBeforeAfterRule.java:45)
>        at org.apache.lucene.util.TestRuleReportUncaughtExceptions$1.evaluate(TestRuleReportUncaughtExceptions.java:68)
>        at org.apache.lucene.util.TestRuleStoreClassName$1.evaluate(TestRuleStoreClassName.java:38)
>        at org.apache.lucene.util.TestRuleIcuHack$1.evaluate(TestRuleIcuHack.java:51)
>        at com.carrotsearch.randomizedtesting.rules.SystemPropertiesInvariantRule$1.evaluate(SystemPropertiesInvariantRule.java:55)
>        at org.apache.lucene.util.TestRuleNoInstanceHooksOverrides$1.evaluate(TestRuleNoInstanceHooksOverrides.java:53)
>        at org.apache.lucene.util.TestRuleNoStaticHooksShadowing$1.evaluate(TestRuleNoStaticHooksShadowing.java:52)
>        at org.apache.lucene.util.TestRuleAssertionsRequired$1.evaluate(TestRuleAssertionsRequired.java:36)
>        at org.apache.lucene.util.TestRuleMarkFailure$1.evaluate(TestRuleMarkFailure.java:48)
>        at org.apache.lucene.util.TestRuleIgnoreTestSuites$1.evaluate(TestRuleIgnoreTestSuites.java:56)
>        at com.carrotsearch.randomizedtesting.RandomizedRunner.runSuite(RandomizedRunner.java:605)
>        at com.carrotsearch.randomizedtesting.RandomizedRunner.access$400(RandomizedRunner.java:132)
>        at com.carrotsearch.randomizedtesting.RandomizedRunner$2.run(RandomizedRunner.java:551)
> Caused by: java.lang.RuntimeException: java.lang.AssertionError: sub reader _8(5.0):c287/19
wasn't warmed
>        at __randomizedtesting.SeedInfo.seed([B15FA718B900587D]:0)
>        at org.apache.lucene.index.ThreadedIndexingAndSearchingTestCase$2.run(ThreadedIndexingAndSearchingTestCase.java:397)
> Caused by: java.lang.AssertionError: sub reader _8(5.0):c287/19 wasn't warmed
>        at org.junit.Assert.fail(Assert.java:93)
>        at org.junit.Assert.assertTrue(Assert.java:43)
>        at org.apache.lucene.index.ThreadedIndexingAndSearchingTestCase$2.run(ThreadedIndexingAndSearchingTestCase.java:347)
>
>
>
>
> Build Log:
> [...truncated 1288 lines...]
>   [junit4]    >        at com.carrotsearch.randomizedtesting.RandomizedRunner.runSuite(RandomizedRunner.java:605)
>   [junit4]    >        at com.carrotsearch.randomizedtesting.RandomizedRunner.access$400(RandomizedRunner.java:132)
>   [junit4]    >        at com.carrotsearch.randomizedtesting.RandomizedRunner$2.run(RandomizedRunner.java:551)
>   [junit4]    > Caused by: java.lang.RuntimeException: java.lang.AssertionError:
sub reader _8(5.0):c287/19 wasn't warmed
>   [junit4]    >        at __randomizedtesting.SeedInfo.seed([B15FA718B900587D]:0)
>   [junit4]    >        at org.apache.lucene.index.ThreadedIndexingAndSearchingTestCase$2.run(ThreadedIndexingAndSearchingTestCase.java:397)
>   [junit4]    > Caused by: java.lang.AssertionError: sub reader _8(5.0):c287/19
wasn't warmed
>   [junit4]    >        at org.junit.Assert.fail(Assert.java:93)
>   [junit4]    >        at org.junit.Assert.assertTrue(Assert.java:43)
>   [junit4]    >        at org.apache.lucene.index.ThreadedIndexingAndSearchingTestCase$2.run(ThreadedIndexingAndSearchingTestCase.java:347)
>   [junit4]    > Throwable #5: java.lang.RuntimeException: Thread threw an uncaught
exception, thread: Thread[Thread-554,5,]
>   [junit4]    >        at com.carrotsearch.randomizedtesting.RunnerThreadGroup.processUncaught(RunnerThreadGroup.java:96)
>   [junit4]    >        at com.carrotsearch.randomizedtesting.RandomizedRunner.runSingleTest(RandomizedRunner.java:857)
>   [junit4]    >        at com.carrotsearch.randomizedtesting.RandomizedRunner.access$700(RandomizedRunner.java:132)
>   [junit4]    >        at com.carrotsearch.randomizedtesting.RandomizedRunner$3$1.run(RandomizedRunner.java:669)
>   [junit4]    >        at com.carrotsearch.randomizedtesting.RandomizedRunner$3.evaluate(RandomizedRunner.java:695)
>   [junit4]    >        at com.carrotsearch.randomizedtesting.RandomizedRunner$4.evaluate(RandomizedRunner.java:734)
>   [junit4]    >        at com.carrotsearch.randomizedtesting.RandomizedRunner$5.evaluate(RandomizedRunner.java:745)
>   [junit4]    >        at org.apache.lucene.util.AbstractBeforeAfterRule$1.evaluate(AbstractBeforeAfterRule.java:45)
>   [junit4]    >        at org.apache.lucene.util.TestRuleReportUncaughtExceptions$1.evaluate(TestRuleReportUncaughtExceptions.java:68)
>   [junit4]    >        at org.apache.lucene.util.TestRuleStoreClassName$1.evaluate(TestRuleStoreClassName.java:38)
>   [junit4]    >        at org.apache.lucene.util.TestRuleIcuHack$1.evaluate(TestRuleIcuHack.java:51)
>   [junit4]    >        at com.carrotsearch.randomizedtesting.rules.SystemPropertiesInvariantRule$1.evaluate(SystemPropertiesInvariantRule.java:55)
>   [junit4]    >        at org.apache.lucene.util.TestRuleNoInstanceHooksOverrides$1.evaluate(TestRuleNoInstanceHooksOverrides.java:53)
>   [junit4]    >        at org.apache.lucene.util.TestRuleNoStaticHooksShadowing$1.evaluate(TestRuleNoStaticHooksShadowing.java:52)
>   [junit4]    >        at org.apache.lucene.util.TestRuleAssertionsRequired$1.evaluate(TestRuleAssertionsRequired.java:36)
>   [junit4]    >        at org.apache.lucene.util.TestRuleMarkFailure$1.evaluate(TestRuleMarkFailure.java:48)
>   [junit4]    >        at org.apache.lucene.util.TestRuleIgnoreTestSuites$1.evaluate(TestRuleIgnoreTestSuites.java:56)
>   [junit4]    >        at com.carrotsearch.randomizedtesting.RandomizedRunner.runSuite(RandomizedRunner.java:605)
>   [junit4]    >        at com.carrotsearch.randomizedtesting.RandomizedRunner.access$400(RandomizedRunner.java:132)
>   [junit4]    >        at com.carrotsearch.randomizedtesting.RandomizedRunner$2.run(RandomizedRunner.java:551)
>   [junit4]    > Caused by: java.lang.RuntimeException: java.lang.AssertionError:
sub reader _8(5.0):c287/19 wasn't warmed
>   [junit4]    >        at __randomizedtesting.SeedInfo.seed([B15FA718B900587D]:0)
>   [junit4]    >        at org.apache.lucene.index.ThreadedIndexingAndSearchingTestCase$2.run(ThreadedIndexingAndSearchingTestCase.java:397)
>   [junit4]    > Caused by: java.lang.AssertionError: sub reader _8(5.0):c287/19
wasn't warmed
>   [junit4]    >        at org.junit.Assert.fail(Assert.java:93)
>   [junit4]    >        at org.junit.Assert.assertTrue(Assert.java:43)
>   [junit4]    >        at org.apache.lucene.index.ThreadedIndexingAndSearchingTestCase$2.run(ThreadedIndexingAndSearchingTestCase.java:347)
>   [junit4]    > Throwable #6: java.lang.RuntimeException: Thread threw an uncaught
exception, thread: Thread[Thread-557,5,]
>   [junit4]    >        at com.carrotsearch.randomizedtesting.RunnerThreadGroup.processUncaught(RunnerThreadGroup.java:96)
>   [junit4]    >        at com.carrotsearch.randomizedtesting.RandomizedRunner.runSingleTest(RandomizedRunner.java:857)
>   [junit4]    >        at com.carrotsearch.randomizedtesting.RandomizedRunner.access$700(RandomizedRunner.java:132)
>   [junit4]    >        at com.carrotsearch.randomizedtesting.RandomizedRunner$3$1.run(RandomizedRunner.java:669)
>   [junit4]    >        at com.carrotsearch.randomizedtesting.RandomizedRunner$3.evaluate(RandomizedRunner.java:695)
>   [junit4]    >        at com.carrotsearch.randomizedtesting.RandomizedRunner$4.evaluate(RandomizedRunner.java:734)
>   [junit4]    >        at com.carrotsearch.randomizedtesting.RandomizedRunner$5.evaluate(RandomizedRunner.java:745)
>   [junit4]    >        at org.apache.lucene.util.AbstractBeforeAfterRule$1.evaluate(AbstractBeforeAfterRule.java:45)
>   [junit4]    >        at org.apache.lucene.util.TestRuleReportUncaughtExceptions$1.evaluate(TestRuleReportUncaughtExceptions.java:68)
>   [junit4]    >        at org.apache.lucene.util.TestRuleStoreClassName$1.evaluate(TestRuleStoreClassName.java:38)
>   [junit4]    >        at org.apache.lucene.util.TestRuleIcuHack$1.evaluate(TestRuleIcuHack.java:51)
>   [junit4]    >        at com.carrotsearch.randomizedtesting.rules.SystemPropertiesInvariantRule$1.evaluate(SystemPropertiesInvariantRule.java:55)
>   [junit4]    >        at org.apache.lucene.util.TestRuleNoInstanceHooksOverrides$1.evaluate(TestRuleNoInstanceHooksOverrides.java:53)
>   [junit4]    >        at org.apache.lucene.util.TestRuleNoStaticHooksShadowing$1.evaluate(TestRuleNoStaticHooksShadowing.java:52)
>   [junit4]    >        at org.apache.lucene.util.TestRuleAssertionsRequired$1.evaluate(TestRuleAssertionsRequired.java:36)
>   [junit4]    >        at org.apache.lucene.util.TestRuleMarkFailure$1.evaluate(TestRuleMarkFailure.java:48)
>   [junit4]    >        at org.apache.lucene.util.TestRuleIgnoreTestSuites$1.evaluate(TestRuleIgnoreTestSuites.java:56)
>   [junit4]    >        at com.carrotsearch.randomizedtesting.RandomizedRunner.runSuite(RandomizedRunner.java:605)
>   [junit4]    >        at com.carrotsearch.randomizedtesting.RandomizedRunner.access$400(RandomizedRunner.java:132)
>   [junit4]    >        at com.carrotsearch.randomizedtesting.RandomizedRunner$2.run(RandomizedRunner.java:551)
>   [junit4]    > Caused by: java.lang.RuntimeException: java.lang.AssertionError:
sub reader _8(5.0):c287/19 wasn't warmed
>   [junit4]    >        at __randomizedtesting.SeedInfo.seed([B15FA718B900587D]:0)
>   [junit4]    >        at org.apache.lucene.index.ThreadedIndexingAndSearchingTestCase$2.run(ThreadedIndexingAndSearchingTestCase.java:397)
>   [junit4]    > Caused by: java.lang.AssertionError: sub reader _8(5.0):c287/19
wasn't warmed
>   [junit4]    >        at org.junit.Assert.fail(Assert.java:93)
>   [junit4]    >        at org.junit.Assert.assertTrue(Assert.java:43)
>   [junit4]    >        at org.apache.lucene.index.ThreadedIndexingAndSearchingTestCase$2.run(ThreadedIndexingAndSearchingTestCase.java:347)
>   [junit4]    >
>   [junit4]   1> Thread-555: hit exc
>   [junit4]   1> java.lang.AssertionError: sub reader _8(5.0):c287/19 wasn't warmed
>   [junit4]   1>        at org.junit.Assert.fail(Assert.java:93)
>   [junit4]   1>        at org.junit.Assert.assertTrue(Assert.java:43)
>   [junit4]   1>        at org.apache.lucene.index.ThreadedIndexingAndSearchingTestCase$2.run(ThreadedIndexingAndSearchingTestCase.java:347)
>   [junit4]   1> Thread-558: hit exc
>   [junit4]   1> java.lang.AssertionError: sub reader _8(5.0):c287/19 wasn't warmed
>   [junit4]   1>        at org.junit.Assert.fail(Assert.java:93)
>   [junit4]   1>        at org.junit.Assert.assertTrue(Assert.java:43)
>   [junit4]   1>        at org.apache.lucene.index.ThreadedIndexingAndSearchingTestCase$2.run(ThreadedIndexingAndSearchingTestCase.java:347)
>   [junit4]   1> Thread-556: hit exc
>   [junit4]   1> java.lang.AssertionError: sub reader _8(5.0):c287/19 wasn't warmed
>   [junit4]   1>        at org.junit.Assert.fail(Assert.java:93)
>   [junit4]   1>        at org.junit.Assert.assertTrue(Assert.java:43)
>   [junit4]   1>        at org.apache.lucene.index.ThreadedIndexingAndSearchingTestCase$2.run(ThreadedIndexingAndSearchingTestCase.java:347)
>   [junit4]   1> Thread-554: hit exc
>   [junit4]   1> java.lang.AssertionError: sub reader _8(5.0):c287/19 wasn't warmed
>   [junit4]   1>        at org.junit.Assert.fail(Assert.java:93)
>   [junit4]   1>        at org.junit.Assert.assertTrue(Assert.java:43)
>   [junit4]   1>        at org.apache.lucene.index.ThreadedIndexingAndSearchingTestCase$2.run(ThreadedIndexingAndSearchingTestCase.java:347)
>   [junit4]   1> Thread-557: hit exc
>   [junit4]   1> java.lang.AssertionError: sub reader _8(5.0):c287/19 wasn't warmed
>   [junit4]   1>        at org.junit.Assert.fail(Assert.java:93)
>   [junit4]   1>        at org.junit.Assert.assertTrue(Assert.java:43)
>   [junit4]   1>        at org.apache.lucene.index.ThreadedIndexingAndSearchingTestCase$2.run(ThreadedIndexingAndSearchingTestCase.java:347)
>   [junit4]   2> NOTE: reproduce with: ant test  -Dtestcase=TestSearcherManager
-Dtests.method=testSearcherManager -Dtests.seed=B15FA718B900587D -Dtests.multiplier=3 -Dtests.locale=ar_SY
-Dtests.timezone=Africa/Lubumbashi -Dargs="-Dfile.encoding=US-ASCII"
>   [junit4]   1>
>   [junit4]   2>
>   [junit4]    > (@AfterClass output)
>   [junit4]   2> NOTE: test params are: codec=Lucene40: {extra29=PostingsFormat(name=NestedPulsing),
extra28=PostingsFormat(name=MockRandom), body=PostingsFormat(name=NestedPulsing), extra27=Pulsing40(freqCutoff=19
minBlockSize=18 maxBlockSize=76), extra26=MockVariableIntBlock(baseBlockSize=118), extra25=PostingsFormat(name=MockSep),
extra24=PostingsFormat(name=Lucene40WithOrds), extra23=Lucene40(minBlockSize=18 maxBlockSize=76),
extra22=Pulsing40(freqCutoff=3 minBlockSize=18 maxBlockSize=76), packID=PostingsFormat(name=Lucene40WithOrds),
date=PostingsFormat(name=MockSep), docid=MockVariableIntBlock(baseBlockSize=118), title=PostingsFormat(name=Lucene40WithOrds),
extra20=PostingsFormat(name=NestedPulsing), extra21=Pulsing40(freqCutoff=3 minBlockSize=18
maxBlockSize=76), extra38=PostingsFormat(name=Lucene40WithOrds), extra12=MockVariableIntBlock(baseBlockSize=118),
extra37=Lucene40(minBlockSize=18 maxBlockSize=76), extra9=PostingsFormat(name=NestedPulsing),
extra11=MockFixedIntBlock(blockSize=1650), extra14=PostingsFormat(name=MockRandom), extra39=PostingsFormat(name=MockSep),
extra13=Pulsing40(freqCutoff=19 minBlockSize=18 maxBlockSize=76), extra34=Pulsing40(freqCutoff=19
minBlockSize=18 maxBlockSize=76), extra16=Lucene40(minBlockSize=18 maxBlockSize=76), extra15=Pulsing40(freqCutoff=3
minBlockSize=18 maxBlockSize=76), extra33=MockVariableIntBlock(baseBlockSize=118), extra36=PostingsFormat(name=NestedPulsing),
extra18=PostingsFormat(name=MockSep), extra35=PostingsFormat(name=MockRandom), extra17=PostingsFormat(name=Lucene40WithOrds),
extra0=PostingsFormat(name=NestedPulsing), extra1=Pulsing40(freqCutoff=3 minBlockSize=18 maxBlockSize=76),
extra19=PostingsFormat(name=MockSep), extra2=Lucene40(minBlockSize=18 maxBlockSize=76), extra3=PostingsFormat(name=Lucene40WithOrds),
extra4=MockFixedIntBlock(blockSize=1650), extra5=MockVariableIntBlock(baseBlockSize=118),
extra6=Pulsing40(freqCutoff=19 minBlockSize=18 maxBlockSize=76), extra7=PostingsFormat(name=MockRandom),
titleTokenized=PostingsFormat(name=NestedPulsing), extra30=PostingsFormat(name=MockSep), extra31=MockFixedIntBlock(blockSize=1650),
extra32=MockVariableIntBlock(baseBlockSize=118), extra10=MockFixedIntBlock(blockSize=1650)},
sim=RandomSimilarityProvider(queryNorm=true,coord=true): {extra29=DFR I(F)1, extra28=DFR I(ne)B2,
body=BM25(k1=1.2,b=0.75), extra27=LM Jelinek-Mercer(0.700000), extra26=DFR I(n)L1, extra25=DFR
I(ne)Z(0.3), extra24=IB LL-L3(800.0), extra23=DFR GB1, extra22=DFR GL2, extra20=DFR I(ne)1,
extra21=DFR I(n)L3(800.0), extra12=DFR I(n)2, extra38=IB LL-L1, extra11=DFR I(ne)3(800.0),
extra9=IB SPL-D1, extra37=DFR I(F)2, extra14=IB LL-DZ(0.3), extra13=DFR I(F)L3(800.0), extra39=BM25(k1=1.2,b=0.75),
extra34=DFR I(n)LZ(0.3), extra16=DFR I(n)LZ(0.3), extra33=DFR I(ne)B1, extra15=DFR I(ne)B1,
extra18=DFR GL1, extra36=DFR GL1, extra35=DFR G2, extra17=DFR G2, extra0=DFR I(F)Z(0.3), extra1=LM
Jelinek-Mercer(0.100000), extra19=DFR I(ne)L3(800.0), extra2=DFR I(ne)L2, extra3=DFR I(n)BZ(0.3),
extra4=DFR I(ne)3(800.0), extra5=DFR I(n)2, extra6=DFR I(F)L3(800.0), extra7=IB LL-DZ(0.3),
titleTokenized=DFR I(n)BZ(0.3), extra30=IB SPL-L1, extra31=IB SPL-DZ(0.3), extra32=IB SPL-D3(800.0),
extra10=DFR I(F)3(800.0)}, locale=ar_SY, timezone=Africa/Lubumbashi
>   [junit4]   2> NOTE: FreeBSD 9.0-RELEASE amd64/Oracle Corporation 1.7.0_02 (64-bit)/cpus=16,threads=1,free=345130536,total=536870912
>   [junit4]   2> NOTE: All tests run in this JVM: [TestSumDocFreq, TestPrefixQuery,
ThrowInUncaught, TestNGramPhraseQuery, TestCopyBytes, TestReaderClosed, TestCloseableThreadLocal,
TestToken, TestRamUsageEstimatorOnWildAnimals, TestIOUtils, TestDocument, TestAssertions,
TestStressNRT, TestWildcard, TestComplexExplanations, TestFilteredSearch, TestSloppyPhraseQuery,
TestRegexpQuery, TestVirtualMethod, TestConsistentFieldNumbers, TestPostingsOffsets, TestNumericTokenStream,
TestUniqueTermCount, TestBoolean2, TestTermdocPerf, TestIntsRef, TestFieldCacheRangeFilter,
TestNoDeletionPolicy, TestRecyclingByteBlockAllocator, TestPayloadSpans, TestFieldCacheTermsFilter,
TestSnapshotDeletionPolicy, TestIsCurrent, TestUTF32ToUTF8, TestVersionComparator, TestForceMergeForever,
TestPayloadNearQuery, TestRollingBuffer, TestDirectory, TestBooleanScorer, TestTermVectorsWriter,
TestMultiValuedNumericRangeQuery, TestOmitNorms, TestBackwardsCompatibility, TestUnicodeUtil,
TestSpans, TestFixedBitSet, TestSpanExplanations, TestCharTermAttributeImpl, TestCodecs, TestSearchWithThreads,
Test10KPulsings, TestSimilarityProvider, TestDocBoost, TestWeakIdentityMap, Nested, Nested,
Nested, Nested, Nested, Nested, Nested, Nested, Nested, Nested, Nested, Nested, Nested, Nested,
Nested, Nested, Nested, Nested, Nested, Nested, Nested, TestBufferedIndexInput, TestDocTermOrds,
TestTermScorer, TestFilterAtomicReader, TestStressAdvance, TestThreadedForceMerge, TestLevenshteinAutomata,
TestCachingTokenFilter, TestExplanations, TestNumericRangeQuery64, TestAttributeSource, Nested,
TestSegmentTermEnum, TestSentinelIntSet, TestPrefixCodedTerms, TestRegexpRandom2, TestNot,
TestIndexWriterMerging, TestBasicOperations, TestSearchForDuplicates, TestSpansAdvanced2,
TestDoubleBarrelLRUCache, TestSegmentTermDocs, TestSmallFloat, TestIndexWriterReader, TestPersistentSnapshotDeletionPolicy,
TestPerSegmentDeletes, TestIndexWriterOnDiskFull, TestDocIdSet, TestSimpleSearchEquivalence,
TestMultiTermConstantScore, TestPositiveScoresOnlyCollector, TestSpanSearchEquivalence, TestScorerPerf,
TestNewestSegment, TestIndexWriterOnJRECrash, TestIndexWriterDelete, TestFieldCache, TestDateTools,
TestBitUtil, TestSizeBoundedForceMerge, TestPrefixFilter, TestBooleanMinShouldMatch, TestDuelingCodecs,
TestIndexWriterMergePolicy, Nested1, TestRollingUpdates, TestAddIndexes, TestMultiPhraseQuery,
TestSpanExplanationsOfNonMatches, TestNRTManager, TestNRTCachingDirectory, TestIndexWriterForceMerge,
TestPagedBytes, TestRollingCharBuffer, TestIndexWriter, TestSearcherManager]
>   [junit4]   2>
>   [junit4] Completed on J1 in 3.47s, 6 tests, 1 error <<< FAILURES!
> [...truncated 355 lines...]
>
> [...truncated 1744 lines...]
>
> [...truncated 1744 lines...]
>
> [...truncated 1744 lines...]
>
> [...truncated 1744 lines...]
>
> [...truncated 1744 lines...]
>
>
>
>
>
> ---------------------------------------------------------------------
> To unsubscribe, e-mail: dev-unsubscribe@lucene.apache.org
> For additional commands, e-mail: dev-help@lucene.apache.org

---------------------------------------------------------------------
To unsubscribe, e-mail: dev-unsubscribe@lucene.apache.org
For additional commands, e-mail: dev-help@lucene.apache.org


Mime
View raw message