lucene-dev mailing list archives

Site index · List index
Message view « Date » · « Thread »
Top « Date » · « Thread »
From Michael McCandless <luc...@mikemccandless.com>
Subject Re: [JENKINS] Lucene-Solr-trunk-Linux-Java6-64 - Build # 963 - Failure!
Date Tue, 19 Jun 2012 12:02:57 GMT
I think this is because we are getting MemoryPostingsFormat in
testRandomHugeStrings, when it does create a RandomIndexWriter for
indexing.

I added @Suppress({"Memory"}) and it no longer OOMEs; though, I'm
baffled why the other tests that also call checkRandomData don't also
sometimes OOME.  I looked at the heap dump and on quick inspection it
does look like the RAM is used up by the FSTs for MemoryPF....

To be sure it wasn't eg a memory leak of some kind w/ Kuromoji, I ran
with 50 multiplier and the tests still passes...

Mike McCandless

http://blog.mikemccandless.com

On Tue, Jun 19, 2012 at 7:00 AM, Michael McCandless
<lucene@mikemccandless.com> wrote:
> I'll dig.
>
> Mike McCandless
>
> http://blog.mikemccandless.com
>
>
> On Tue, Jun 19, 2012 at 3:24 AM, Dawid Weiss
> <dawid.weiss@cs.put.poznan.pl> wrote:
>> This is an OOM.
>>
>> Dawid
>>
>> On Tue, Jun 19, 2012 at 9:01 AM, Policeman Jenkins Server
>> <jenkins@sd-datasolutions.de> wrote:
>>> Build: http://jenkins.sd-datasolutions.de/job/Lucene-Solr-trunk-Linux-Java6-64/963/
>>>
>>> 1 tests failed.
>>> REGRESSION:  org.apache.lucene.analysis.ja.TestJapaneseTokenizer.testRandomHugeStrings
>>>
>>> Error Message:
>>> some thread(s) failed
>>>
>>> Stack Trace:
>>> java.lang.RuntimeException: some thread(s) failed
>>>        at __randomizedtesting.SeedInfo.seed([370A7DC6CEEB9088:AF291A05909D2CC0]:0)
>>>        at org.apache.lucene.analysis.BaseTokenStreamTestCase.checkRandomData(BaseTokenStreamTestCase.java:466)
>>>        at org.apache.lucene.analysis.BaseTokenStreamTestCase.checkRandomData(BaseTokenStreamTestCase.java:378)
>>>        at org.apache.lucene.analysis.ja.TestJapaneseTokenizer.testRandomHugeStrings(TestJapaneseTokenizer.java:193)
>>>        at sun.reflect.NativeMethodAccessorImpl.invoke0(Native Method)
>>>        at sun.reflect.NativeMethodAccessorImpl.invoke(NativeMethodAccessorImpl.java:39)
>>>        at sun.reflect.DelegatingMethodAccessorImpl.invoke(DelegatingMethodAccessorImpl.java:25)
>>>        at java.lang.reflect.Method.invoke(Method.java:597)
>>>        at com.carrotsearch.randomizedtesting.RandomizedRunner.invoke(RandomizedRunner.java:1969)
>>>        at com.carrotsearch.randomizedtesting.RandomizedRunner.access$1100(RandomizedRunner.java:132)
>>>        at com.carrotsearch.randomizedtesting.RandomizedRunner$6.evaluate(RandomizedRunner.java:814)
>>>        at com.carrotsearch.randomizedtesting.RandomizedRunner$7.evaluate(RandomizedRunner.java:875)
>>>        at com.carrotsearch.randomizedtesting.RandomizedRunner$8.evaluate(RandomizedRunner.java:889)
>>>        at org.apache.lucene.util.TestRuleSetupTeardownChained$1.evaluate(TestRuleSetupTeardownChained.java:50)
>>>        at org.apache.lucene.util.TestRuleFieldCacheSanity$1.evaluate(TestRuleFieldCacheSanity.java:32)
>>>        at org.apache.lucene.util.AbstractBeforeAfterRule$1.evaluate(AbstractBeforeAfterRule.java:45)
>>>        at com.carrotsearch.randomizedtesting.rules.SystemPropertiesInvariantRule$1.evaluate(SystemPropertiesInvariantRule.java:55)
>>>        at org.apache.lucene.util.TestRuleReportUncaughtExceptions$1.evaluate(TestRuleReportUncaughtExceptions.java:68)
>>>        at org.apache.lucene.util.TestRuleThreadAndTestName$1.evaluate(TestRuleThreadAndTestName.java:48)
>>>        at org.apache.lucene.util.TestRuleMarkFailure$1.evaluate(TestRuleMarkFailure.java:48)
>>>        at com.carrotsearch.randomizedtesting.RandomizedRunner.runSingleTest(RandomizedRunner.java:821)
>>>        at com.carrotsearch.randomizedtesting.RandomizedRunner.access$700(RandomizedRunner.java:132)
>>>        at com.carrotsearch.randomizedtesting.RandomizedRunner$3$1.run(RandomizedRunner.java:669)
>>>        at com.carrotsearch.randomizedtesting.RandomizedRunner$3.evaluate(RandomizedRunner.java:695)
>>>        at com.carrotsearch.randomizedtesting.RandomizedRunner$4.evaluate(RandomizedRunner.java:734)
>>>        at com.carrotsearch.randomizedtesting.RandomizedRunner$5.evaluate(RandomizedRunner.java:745)
>>>        at org.apache.lucene.util.AbstractBeforeAfterRule$1.evaluate(AbstractBeforeAfterRule.java:45)
>>>        at org.apache.lucene.util.TestRuleReportUncaughtExceptions$1.evaluate(TestRuleReportUncaughtExceptions.java:68)
>>>        at org.apache.lucene.util.TestRuleStoreClassName$1.evaluate(TestRuleStoreClassName.java:38)
>>>        at org.apache.lucene.util.TestRuleIcuHack$1.evaluate(TestRuleIcuHack.java:51)
>>>        at com.carrotsearch.randomizedtesting.rules.SystemPropertiesInvariantRule$1.evaluate(SystemPropertiesInvariantRule.java:55)
>>>        at org.apache.lucene.util.TestRuleNoInstanceHooksOverrides$1.evaluate(TestRuleNoInstanceHooksOverrides.java:53)
>>>        at org.apache.lucene.util.TestRuleNoStaticHooksShadowing$1.evaluate(TestRuleNoStaticHooksShadowing.java:52)
>>>        at org.apache.lucene.util.TestRuleAssertionsRequired$1.evaluate(TestRuleAssertionsRequired.java:36)
>>>        at org.apache.lucene.util.TestRuleMarkFailure$1.evaluate(TestRuleMarkFailure.java:48)
>>>        at org.apache.lucene.util.TestRuleIgnoreTestSuites$1.evaluate(TestRuleIgnoreTestSuites.java:56)
>>>        at com.carrotsearch.randomizedtesting.RandomizedRunner.runSuite(RandomizedRunner.java:605)
>>>        at com.carrotsearch.randomizedtesting.RandomizedRunner.access$400(RandomizedRunner.java:132)
>>>        at com.carrotsearch.randomizedtesting.RandomizedRunner$2.run(RandomizedRunner.java:551)
>>>
>>>
>>>
>>>
>>> Build Log:
>>> [...truncated 3791 lines...]
>>>   [junit4] Suite: org.apache.lucene.analysis.ja.TestJapaneseTokenizer
>>>   [junit4] ERROR   24.4s J0 | TestJapaneseTokenizer.testRandomHugeStrings
>>>   [junit4]    > Throwable #1: java.lang.RuntimeException: some thread(s)
failed
>>>   [junit4]    >        at __randomizedtesting.SeedInfo.seed([370A7DC6CEEB9088:AF291A05909D2CC0]:0)
>>>   [junit4]    >        at org.apache.lucene.analysis.BaseTokenStreamTestCase.checkRandomData(BaseTokenStreamTestCase.java:466)
>>>   [junit4]    >        at org.apache.lucene.analysis.BaseTokenStreamTestCase.checkRandomData(BaseTokenStreamTestCase.java:378)
>>>   [junit4]    >        at org.apache.lucene.analysis.ja.TestJapaneseTokenizer.testRandomHugeStrings(TestJapaneseTokenizer.java:193)
>>>   [junit4]    >        at sun.reflect.NativeMethodAccessorImpl.invoke0(Native
Method)
>>>   [junit4]    >        at sun.reflect.NativeMethodAccessorImpl.invoke(NativeMethodAccessorImpl.java:39)
>>>   [junit4]    >        at sun.reflect.DelegatingMethodAccessorImpl.invoke(DelegatingMethodAccessorImpl.java:25)
>>>   [junit4]    >        at java.lang.reflect.Method.invoke(Method.java:597)
>>>   [junit4]    >        at com.carrotsearch.randomizedtesting.RandomizedRunner.invoke(RandomizedRunner.java:1969)
>>>   [junit4]    >        at com.carrotsearch.randomizedtesting.RandomizedRunner.access$1100(RandomizedRunner.java:132)
>>>   [junit4]    >        at com.carrotsearch.randomizedtesting.RandomizedRunner$6.evaluate(RandomizedRunner.java:814)
>>>   [junit4]    >        at com.carrotsearch.randomizedtesting.RandomizedRunner$7.evaluate(RandomizedRunner.java:875)
>>>   [junit4]    >        at com.carrotsearch.randomizedtesting.RandomizedRunner$8.evaluate(RandomizedRunner.java:889)
>>>   [junit4]    >        at org.apache.lucene.util.TestRuleSetupTeardownChained$1.evaluate(TestRuleSetupTeardownChained.java:50)
>>>   [junit4]    >        at org.apache.lucene.util.TestRuleFieldCacheSanity$1.evaluate(TestRuleFieldCacheSanity.java:32)
>>>   [junit4]    >        at org.apache.lucene.util.AbstractBeforeAfterRule$1.evaluate(AbstractBeforeAfterRule.java:45)
>>>   [junit4]    >        at com.carrotsearch.randomizedtesting.rules.SystemPropertiesInvariantRule$1.evaluate(SystemPropertiesInvariantRule.java:55)
>>>   [junit4]    >        at org.apache.lucene.util.TestRuleReportUncaughtExceptions$1.evaluate(TestRuleReportUncaughtExceptions.java:68)
>>>   [junit4]    >        at org.apache.lucene.util.TestRuleThreadAndTestName$1.evaluate(TestRuleThreadAndTestName.java:48)
>>>   [junit4]    >        at org.apache.lucene.util.TestRuleMarkFailure$1.evaluate(TestRuleMarkFailure.java:48)
>>>   [junit4]    >        at com.carrotsearch.randomizedtesting.RandomizedRunner.runSingleTest(RandomizedRunner.java:821)
>>>   [junit4]    >        at com.carrotsearch.randomizedtesting.RandomizedRunner.access$700(RandomizedRunner.java:132)
>>>   [junit4]    >        at com.carrotsearch.randomizedtesting.RandomizedRunner$3$1.run(RandomizedRunner.java:669)
>>>   [junit4]    >        at com.carrotsearch.randomizedtesting.RandomizedRunner$3.evaluate(RandomizedRunner.java:695)
>>>   [junit4]    >        at com.carrotsearch.randomizedtesting.RandomizedRunner$4.evaluate(RandomizedRunner.java:734)
>>>   [junit4]    >        at com.carrotsearch.randomizedtesting.RandomizedRunner$5.evaluate(RandomizedRunner.java:745)
>>>   [junit4]    >        at org.apache.lucene.util.AbstractBeforeAfterRule$1.evaluate(AbstractBeforeAfterRule.java:45)
>>>   [junit4]    >        at org.apache.lucene.util.TestRuleReportUncaughtExceptions$1.evaluate(TestRuleReportUncaughtExceptions.java:68)
>>>   [junit4]    >        at org.apache.lucene.util.TestRuleStoreClassName$1.evaluate(TestRuleStoreClassName.java:38)
>>>   [junit4]    >        at org.apache.lucene.util.TestRuleIcuHack$1.evaluate(TestRuleIcuHack.java:51)
>>>   [junit4]    >        at com.carrotsearch.randomizedtesting.rules.SystemPropertiesInvariantRule$1.evaluate(SystemPropertiesInvariantRule.java:55)
>>>   [junit4]    >        at org.apache.lucene.util.TestRuleNoInstanceHooksOverrides$1.evaluate(TestRuleNoInstanceHooksOverrides.java:53)
>>>   [junit4]    >        at org.apache.lucene.util.TestRuleNoStaticHooksShadowing$1.evaluate(TestRuleNoStaticHooksShadowing.java:52)
>>>   [junit4]    >        at org.apache.lucene.util.TestRuleAssertionsRequired$1.evaluate(TestRuleAssertionsRequired.java:36)
>>>   [junit4]    >        at org.apache.lucene.util.TestRuleMarkFailure$1.evaluate(TestRuleMarkFailure.java:48)
>>>   [junit4]    >        at org.apache.lucene.util.TestRuleIgnoreTestSuites$1.evaluate(TestRuleIgnoreTestSuites.java:56)
>>>   [junit4]    >        at com.carrotsearch.randomizedtesting.RandomizedRunner.runSuite(RandomizedRunner.java:605)
>>>   [junit4]    >        at com.carrotsearch.randomizedtesting.RandomizedRunner.access$400(RandomizedRunner.java:132)
>>>   [junit4]    >        at com.carrotsearch.randomizedtesting.RandomizedRunner$2.run(RandomizedRunner.java:551)
>>>   [junit4]    > Throwable #2: java.lang.RuntimeException: Thread threw
an uncaught exception, thread: Thread[Thread-8,5,]
>>>   [junit4]    >        at com.carrotsearch.randomizedtesting.RunnerThreadGroup.processUncaught(RunnerThreadGroup.java:96)
>>>   [junit4]    >        at com.carrotsearch.randomizedtesting.RandomizedRunner.runSingleTest(RandomizedRunner.java:857)
>>>   [junit4]    >        at com.carrotsearch.randomizedtesting.RandomizedRunner.access$700(RandomizedRunner.java:132)
>>>   [junit4]    >        at com.carrotsearch.randomizedtesting.RandomizedRunner$3$1.run(RandomizedRunner.java:669)
>>>   [junit4]    >        at com.carrotsearch.randomizedtesting.RandomizedRunner$3.evaluate(RandomizedRunner.java:695)
>>>   [junit4]    >        at com.carrotsearch.randomizedtesting.RandomizedRunner$4.evaluate(RandomizedRunner.java:734)
>>>   [junit4]    >        at com.carrotsearch.randomizedtesting.RandomizedRunner$5.evaluate(RandomizedRunner.java:745)
>>>   [junit4]    >        at org.apache.lucene.util.AbstractBeforeAfterRule$1.evaluate(AbstractBeforeAfterRule.java:45)
>>>   [junit4]    >        at org.apache.lucene.util.TestRuleReportUncaughtExceptions$1.evaluate(TestRuleReportUncaughtExceptions.java:68)
>>>   [junit4]    >        at org.apache.lucene.util.TestRuleStoreClassName$1.evaluate(TestRuleStoreClassName.java:38)
>>>   [junit4]    >        at org.apache.lucene.util.TestRuleIcuHack$1.evaluate(TestRuleIcuHack.java:51)
>>>   [junit4]    >        at com.carrotsearch.randomizedtesting.rules.SystemPropertiesInvariantRule$1.evaluate(SystemPropertiesInvariantRule.java:55)
>>>   [junit4]    >        at org.apache.lucene.util.TestRuleNoInstanceHooksOverrides$1.evaluate(TestRuleNoInstanceHooksOverrides.java:53)
>>>   [junit4]    >        at org.apache.lucene.util.TestRuleNoStaticHooksShadowing$1.evaluate(TestRuleNoStaticHooksShadowing.java:52)
>>>   [junit4]    >        at org.apache.lucene.util.TestRuleAssertionsRequired$1.evaluate(TestRuleAssertionsRequired.java:36)
>>>   [junit4]    >        at org.apache.lucene.util.TestRuleMarkFailure$1.evaluate(TestRuleMarkFailure.java:48)
>>>   [junit4]    >        at org.apache.lucene.util.TestRuleIgnoreTestSuites$1.evaluate(TestRuleIgnoreTestSuites.java:56)
>>>   [junit4]    >        at com.carrotsearch.randomizedtesting.RandomizedRunner.runSuite(RandomizedRunner.java:605)
>>>   [junit4]    >        at com.carrotsearch.randomizedtesting.RandomizedRunner.access$400(RandomizedRunner.java:132)
>>>   [junit4]    >        at com.carrotsearch.randomizedtesting.RandomizedRunner$2.run(RandomizedRunner.java:551)
>>>   [junit4]    > Caused by: java.lang.IllegalStateException: this writer
hit an OutOfMemoryError; cannot commit
>>>   [junit4]    >        at __randomizedtesting.SeedInfo.seed([370A7DC6CEEB9088]:0)
>>>   [junit4]    >        at org.apache.lucene.index.IndexWriter.prepareCommit(IndexWriter.java:2491)
>>>   [junit4]    >        at org.apache.lucene.index.IndexWriter.commitInternal(IndexWriter.java:2645)
>>>   [junit4]    >        at org.apache.lucene.index.IndexWriter.commit(IndexWriter.java:2627)
>>>   [junit4]    >        at org.apache.lucene.index.IndexWriter.commit(IndexWriter.java:2611)
>>>   [junit4]    >        at org.apache.lucene.index.RandomIndexWriter.maybeCommit(RandomIndexWriter.java:266)
>>>   [junit4]    >        at org.apache.lucene.index.RandomIndexWriter.addDocument(RandomIndexWriter.java:189)
>>>   [junit4]    >        at org.apache.lucene.index.RandomIndexWriter.addDocument(RandomIndexWriter.java:145)
>>>   [junit4]    >        at org.apache.lucene.analysis.BaseTokenStreamTestCase.checkRandomData(BaseTokenStreamTestCase.java:558)
>>>   [junit4]    >        at org.apache.lucene.analysis.BaseTokenStreamTestCase.access$000(BaseTokenStreamTestCase.java:64)
>>>   [junit4]    >        at org.apache.lucene.analysis.BaseTokenStreamTestCase$AnalysisThread.run(BaseTokenStreamTestCase.java:421)
>>>   [junit4]    > Throwable #3: java.lang.RuntimeException: Thread threw
an uncaught exception, thread: Thread[Lucene Merge Thread #0,6,]
>>>   [junit4]    >        at com.carrotsearch.randomizedtesting.RunnerThreadGroup.processUncaught(RunnerThreadGroup.java:96)
>>>   [junit4]    >        at com.carrotsearch.randomizedtesting.RandomizedRunner.runSingleTest(RandomizedRunner.java:857)
>>>   [junit4]    >        at com.carrotsearch.randomizedtesting.RandomizedRunner.access$700(RandomizedRunner.java:132)
>>>   [junit4]    >        at com.carrotsearch.randomizedtesting.RandomizedRunner$3$1.run(RandomizedRunner.java:669)
>>>   [junit4]    >        at com.carrotsearch.randomizedtesting.RandomizedRunner$3.evaluate(RandomizedRunner.java:695)
>>>   [junit4]    >        at com.carrotsearch.randomizedtesting.RandomizedRunner$4.evaluate(RandomizedRunner.java:734)
>>>   [junit4]    >        at com.carrotsearch.randomizedtesting.RandomizedRunner$5.evaluate(RandomizedRunner.java:745)
>>>   [junit4]    >        at org.apache.lucene.util.AbstractBeforeAfterRule$1.evaluate(AbstractBeforeAfterRule.java:45)
>>>   [junit4]    >        at org.apache.lucene.util.TestRuleReportUncaughtExceptions$1.evaluate(TestRuleReportUncaughtExceptions.java:68)
>>>   [junit4]    >        at org.apache.lucene.util.TestRuleStoreClassName$1.evaluate(TestRuleStoreClassName.java:38)
>>>   [junit4]    >        at org.apache.lucene.util.TestRuleIcuHack$1.evaluate(TestRuleIcuHack.java:51)
>>>   [junit4]    >        at com.carrotsearch.randomizedtesting.rules.SystemPropertiesInvariantRule$1.evaluate(SystemPropertiesInvariantRule.java:55)
>>>   [junit4]    >        at org.apache.lucene.util.TestRuleNoInstanceHooksOverrides$1.evaluate(TestRuleNoInstanceHooksOverrides.java:53)
>>>   [junit4]    >        at org.apache.lucene.util.TestRuleNoStaticHooksShadowing$1.evaluate(TestRuleNoStaticHooksShadowing.java:52)
>>>   [junit4]    >        at org.apache.lucene.util.TestRuleAssertionsRequired$1.evaluate(TestRuleAssertionsRequired.java:36)
>>>   [junit4]    >        at org.apache.lucene.util.TestRuleMarkFailure$1.evaluate(TestRuleMarkFailure.java:48)
>>>   [junit4]    >        at org.apache.lucene.util.TestRuleIgnoreTestSuites$1.evaluate(TestRuleIgnoreTestSuites.java:56)
>>>   [junit4]    >        at com.carrotsearch.randomizedtesting.RandomizedRunner.runSuite(RandomizedRunner.java:605)
>>>   [junit4]    >        at com.carrotsearch.randomizedtesting.RandomizedRunner.access$400(RandomizedRunner.java:132)
>>>   [junit4]    >        at com.carrotsearch.randomizedtesting.RandomizedRunner$2.run(RandomizedRunner.java:551)
>>>   [junit4]    > Caused by: org.apache.lucene.index.MergePolicy$MergeException:
java.lang.OutOfMemoryError: Java heap space
>>>   [junit4]    >        at __randomizedtesting.SeedInfo.seed([370A7DC6CEEB9088]:0)
>>>   [junit4]    >        at org.apache.lucene.index.ConcurrentMergeScheduler.handleMergeException(ConcurrentMergeScheduler.java:507)
>>>   [junit4]    >        at org.apache.lucene.index.ConcurrentMergeScheduler$MergeThread.run(ConcurrentMergeScheduler.java:480)
>>>   [junit4]    > Caused by: java.lang.OutOfMemoryError: Java heap space
>>>   [junit4]    >        at org.apache.lucene.util.ArrayUtil.grow(ArrayUtil.java:338)
>>>   [junit4]    >        at org.apache.lucene.util.fst.FST.addNode(FST.java:672)
>>>   [junit4]    >        at org.apache.lucene.util.fst.NodeHash.add(NodeHash.java:122)
>>>   [junit4]    >        at org.apache.lucene.util.fst.Builder.compileNode(Builder.java:195)
>>>   [junit4]    >        at org.apache.lucene.util.fst.Builder.finish(Builder.java:473)
>>>   [junit4]    >        at org.apache.lucene.codecs.memory.MemoryPostingsFormat$TermsWriter.finish(MemoryPostingsFormat.java:271)
>>>   [junit4]    >        at org.apache.lucene.codecs.TermsConsumer.merge(TermsConsumer.java:208)
>>>   [junit4]    >        at org.apache.lucene.codecs.FieldsConsumer.merge(FieldsConsumer.java:65)
>>>   [junit4]    >        at org.apache.lucene.index.SegmentMerger.mergeTerms(SegmentMerger.java:332)
>>>   [junit4]    >        at org.apache.lucene.index.SegmentMerger.merge(SegmentMerger.java:118)
>>>   [junit4]    >        at org.apache.lucene.index.IndexWriter.mergeMiddle(IndexWriter.java:3466)
>>>   [junit4]    >        at org.apache.lucene.index.IndexWriter.merge(IndexWriter.java:3101)
>>>   [junit4]    >        at org.apache.lucene.index.ConcurrentMergeScheduler.doMerge(ConcurrentMergeScheduler.java:382)
>>>   [junit4]    >        at org.apache.lucene.index.ConcurrentMergeScheduler$MergeThread.run(ConcurrentMergeScheduler.java:451)
>>>   [junit4]    >
>>>   [junit4]   2> TEST FAIL: useCharFilter=false text='lgofpkp yenwlvwavvbm
><de  = z etywnbpfop vjk cnjkffl nsgkfxn naobhbkcvcw ptclrhcz fsmacbwis \u0005\u0217
] \ua3eb\ua0eb\ua3cd\ua3c0\ua0e1 busvem rUyVfnsUAUHs \u66f9\ueb9c\uec81\ufeba\u04d7\u0000
.\u047cbB\u3601\ued7f vimbpqpd \u1093e\u1093a \ud7b8\ud7f5\ud7f0\ud7f5\ud7eb\ud7ee\ud7c4 \u0332\u034e\u0303\u034f\u035b\u032d\u0342
\ue69d\u4bdd4\ue2ed\uba123\u04b4\u34dfN\uf986\ue32f\u3c30 \u10388\u10386\u1039c qsuezqa uyrykaaspxzyz
\u2c77\u2c75\u2c6c\u2c6f\u2c7c\u2c7d\u2c66 <!--#\" q){1, wbehwlfsdr gerkf \ua9ab\ua9d8\ua9cb\ua9de\ua9ce\ua9dc\ua9aa\ua9d3\ua98a\ua998\ua99d
ezukguxmw mnrzqgzjfyeo \u1051b8\u104a38\u101cc7 iujlrpg wgoryckdcpq \u10b31\u10b2d\u10b16\u10b3f
pd)w{ ;</scrip ecvnnml paqjsekt hnifiqb nqmuwrwb \uffe6\uff5f\uff26\uffe9\uff99 \ud50b2\u020e\u2891\ucca8b\u8a47
hdrwfb xpsdmeddpI \u618b\uc4339| irrwukn bauupxqfp  &#x  \u07b6]\ueebb\ufd6d\u001e fof
yfowzwwmyp zvznkpxtu jzfrbrhsvuem tcxni \uec51\u270ed\u6cb6b\uccce\u06bdx\u054f\u00a1\ua470d\ud4ce\u6212\u4797M
nztklqub otgka  \u030f\ub8ae\ue273bK\u4ff9e\u037e\ub93bf\u4168c rf-h \u1c33\u1c27\u1c3e\u1c2f\u1c18\u1c32\u1c3b
\uefb1-\u0250\u984d {1,5}p \u2072\u2079\u208f\u209a\u209f\u2092\u208e\u2092 qjjddrvgztpq \u1f060\u1f07e\u1f07d\u1f046
\u02cf\u3a6b3E\uec9b \uadb3\ue2a6\uaa850\u05c9\ue90f\ueebd\u341d9\u5fde \u9630 \u1043b\u1040b\u10410\u10422\u1042c
nktraote {0, \ue0125\ue016e lsjpnmjob \u10e65\u10e7c onzskm \u39bb9\u05d7\uea0a\u0172 $|w\u0001\u10e203y\ue43c\ue7d70\u057d
<!--;;\"'<!- qnmy gmybkpndyw \ufdf9a\ufedf7 \u102b7\u102d0 boeyflu cmwmlzzrsn \u3063\u3085\u3074\u3047\u305e\u305f\u308d\u3080\u305b\u305d\u3098\u3042\u3057
'</scri \u0001\u0399\u011b\u8eb60\u932e\uc4e9\u07ac=\u0428Q\u0011\ud47a \u01b2\u9b41\uc317f\u06a3\u0001\u16513
tsmdxbhvyutw \u2dcb\u2d85\u2d97\u2d94\u2dce\u2d82\u2d9b\u2db5\u2da2\u2d88\u2dc2 i wowoagx
pdzkygtrug amyhsmpvdnrzkxqe mmdrwo yiigwityl \u1965h\u54f0q\u17ecd\u0207 \uaac2\uaa8f\uaaaa\uaab6\uaac2\uaad7\uaa97\uaad1\uaa86
\u1d457\u1d7b2\u1d778\u1d4da \u3d46f\ube34\u021fd\ue331\ub41ff \ufdaa\uea3e\u2bd2\u6456\uf866\uf0b7\u077f
sigcahb sq \uabca\uabdb\uabd3\uabd3\uabe4\uabcd\uabea \u1f57\u1fa4\u1fe5\u1fcf\u1f42\u1f6a\u1f1f\u1f4c\u1fe3\u1fb1\u1f23
\u00ab\uf8d1\u08e8\u0670\u04a5\u748f \u09c4\u0998\u09fd\u09e1\u0990\u09cd\u09e6 \u2d1c\u2d00\u2d2b\u2d23\u2d0f\u2d28\u2d25
\u229e\u22e3\u2278\u22d1\u2297\u2211\u227e\u2235\u2271 eojcppf cesersdfh \u053f\u0280\uc502\u0003\u016e\u6700\u001d/\uf915
xhry cijaqcak \u07c2\u07c5 \u2403\u241b\u242b\u2409\u242a \u034c\ue844~i\ub424o\u05a3 \u4219+)\u065c
\ua4b1\ua4c9\ua4ca\ua494\ua4b3\ua4a2\ua4aa\ua4c1\ua494\ua4bf\ua495 \u1d8f/=\uf23d\ub79a!\udc585\u0698
gyx \u2312\u03fc\u6867\u0005\ufcc90,\u16f3c ]uw?d) \u211d\u2144\u2145\u2137\u2101\u214b\u213c
\ue4c9\u3a19\ubb5d\u02e9\u8806\u0599\ubc84\u31fc {1,5}|t \u104aa\u1049b\u10486\u10498\u1049b\u10493\u104a5
yltfubsll \u0427\uca4d\u4de0\ue77a\u21e20 \u27fb\u27f0\u27f4\u27f7\u27fd\u27fb\u27f8 \u2e64\u2e4b\u2e3f\u2e51\u2e14\u2e26\u2e72\u2e70\u2e73
ywqjfwcchff hhbvrxkofo \u1c18\u1c0e\u1c44\u1c1b\u1c49 sgts njr \u0926\u0943\u0964\u095b\u0942\u0943
\u2e3a\u2e1f\u2e54\u2e0d iazjmrbrp \u1fad\ue686\ue413\u3a65\u0150z ]c[xni mjucccmurdd \u10846\u1085c\u10844\u1085a
o| fy \u5bf80\ue54c9 eakdpld ` auodfxhjrwutf \ua199b\u040b\uf87e \u0523\u052c\u050d\u0504\u0529\u0513\u0525\u052a\u051e\u0506\u050f
luce iihco{0,5 \ua6d7\ua6eb\ua6e6\ua6c2\ua6c0\ua6d8\ua6f6 dglt \u32d5\u3216\u32a8\u32fa\u328d\u328e\u32fd\u32a4\u32ec
hgylvlql xumlcr \uec84\u036b\uecda\ub5f8\u4561e\u02be\u839bg\u0319\u066b\ubbb0  hqgslxi vfunslati
{M\uf7e4E\u1bfa0\u00cd\ue817\u4a91c vtmfzzx \u0640y\ub352\u2736\u10421d\ue2b3-\u4bc9. \u0015\u862c\u0001\u00db\ufca8\r
C\ue005\u034a\uf3ac6\u0282\u1a29\u05c5D\ued0f  \uf493h\ue3e3T mhge ofefonxihgtjlpefi \ueab0\u4082\uf87b-\u04b9\uf795\u01bd
\u0001\ue7dc\uae70\u7c18\u0506 zvul coeencz \u89f1v\u4403\uf1f2\u046c\uf971d u\u57dct\uff8d2\ue7b5\u0251S\uf6de
pspaofrovuwhz \u31d6\u31ed\u31ed\u31c0\u31da .gf)c-|fr[n zfyeisl \uf06f\ufc65a\u15a49\u0556\u44b2\ue3e9\u4df22\u035b\ue9ce\u0015
\u0aa0\u0a84\u0aa1\u0aa6\u0ab1\u0ab0\u0acf \u2441\u2443\u2443\u2443\u2447 iyjzklnnsgd \u068e\uf54c\uc7f0\u07ea\u565f1
cqaftebuuj \u20a2\u20b4\u20bf\u20a9\u20c4 yrzg tg{0,5}m]jk|v )(p.f dwup \u3134\u317b\u3168\u3179\u3144
[||d]) okvdgoirua vmlhlkmot \u1010a pjptiktoeka reucydayq  \ue68dfX\uc7e0\ufa00\u01851 pfwvngw
\ufd86c\uf6fd \u2ff6\u2ff1\u2ff5\u2ff8\u2ffb\u2ffa\u2ff1\u2ff6 cb \u1cff\u1ce7\u1cdf\u1cfd\u1cdc\u1ce7\u1cf0\u1cd2\u1cfa\u1cd6\u1cf7\u1cf1\u1cdd\u1cf0\u1cdb
zjzjet \u2684\u26dc\u260b\u26a5\u26ac\u264d\u2615\u2691\u26dc\u26c7\u2682\u26bb nuwytns \uc93e3\u02f3\u9bd8a\ua0d65\ubd4d\u31b90\u01de\ue5c1
\ue0023\ue0044\ue0062\ue0015 a hdbpi \u102b9\u102c9 ?{ \ufeceoO\u57c0m\u3b0e\ua203c\u009e
\ua5a7\ua61d\ua630\ua5fc\ua5ce \ufc458 \ua7a3\ua743\ua772\ua7b1\ua736\ua77f\ua787 \ufff2\ufff8\ufffb\ufff3\ufffb\ufff6\ufffb\ufff9
ihptqiue \u1f246\u1f2d3\u1f221\u1f237 \u10300 drcirf \u1d354\u1d33e zenslevd \u67f80\u00ec\u07f9\ufcd1{\ufdc7\uf7fa
j \u013d\u010c\u011f\u0133\u0163\u011f\u0148\u0101\u0164 \u0012\uf8814\n\ue15eJ\u02fa>\u000b
MyPER evdynjc \ud50e\ub475\ud45a\ucbb3\uc141\uc061\ud4f7\uc044  yaoaig jxvffiq \u050e\u050d\u051b\u051c\u0517\u0523\u0526\u0512\u0507
beaq ucracgt rzdluzw o){1,5}.qn{1 \u0017\r\u0018W    knwrds qyjokfna rukvuuvg zpecldiwray
\u10c0f\u10c01\u10c4c\u10c34 gzmjh \u10e3e6\ub97a5\u01e4r\uf6e3\u0294\u000bj \u10b48\u10b52\u10b4a\u10b46
\u053c\u9fc6bt\uf014 \u2ff9\u2ff6\u2ff6\u2ff3\u2ff7\u2ff5\u2ffa\u2ff4\u2ff1 &8468159 \u53f1c\uf057\u0470\u05b8\uafa7
\u0738\u0740\u074c\u0712\u0714\u071a\u074d \u130f3\u1319f \u2901M\ub90cN xwilvtga \u2489\u24f5\u24fd\u24ef\u248f\u24b2\u24f5\u24c1\u2489\u246a
\ue45b{\u0682\u05faz\u0345\u1369 \"< \ue1e1\uef55\u30eaf\u299f\u031e&z {1,5 \ud7f1\ud7d0\ud7b6\ud7f8\ud7fc\ud7ff\ud7c2\ud7e7\ud7ff\ud7c2\ud7c2\ud7c2\ud7b4
\u2142\u2110\u212f\u211c\u2135\u2144\u2145\u2103 eqzbehwwf jkpsgbqgwn uyzlwpm vipoakq \uee72M\ue6b0\uf2e5\u0006
wmqkicgd bgqodxticwyh dfmci sqqsjqrdc tmiqsmcrioq \uffe4\u4b69\u00d1\u48354\u0686\u00149s\u013f
\ua2c4\ua2a8\ua04a\ua00f\ua41b\ua02d sdywioaeahpx thqzqqfq |?m{0,5} krdrdwpyod seraubzunje
\u2a987\u2b244\u2a71b kyyzliwutvnd \u3c47\u05bf6 \ue425k\uf9a6\ufa5b \u2439\u2401\u240e\u242e\u2434\u2405\u243a\u241a
\u4cfebG hauctegecrgc atvpndcnkqo \ua5b0\ua57b\ua521\ua518\ua5f6\ua62b\ua58e\ua55e\ua572\ua57a
qtqg \u2df3\u0089 wecwxgnlqo lvf ispidit japfhwddfv vdpvezw \uff3b\uff82\uff2d\uffe5\uffd2\uffa1
aeehnce tdrtrqf poebpjils \u100e5\u100e6\u1009e\u10099\u100d9\u100fa iquxwytbuhl \u008e\u3a81\ue991e\ud60f
euidp \u52a5X\u0001~\uef3f\ued48\ufb54\ue0e0\u0108w wuhijlfgbk msgs \u10295\u10298\u10297\u10291\u10280
rshoemrjfg ybhdvkrlqagl qajfswod ecmvhu \ua359\u05f6Z\u000e\u4a734\ufc13 \u0317\u4249\u00fc\uabd7\u023e\uf7b8
jmyznftwj vckibgl \"?>\\\"<!- \u1d70\u1d23\u1d68\u1d48\u1d7b\u1d7b\u1d20\u1d6d\u1d6b\u1d22
\u0755\uc221c\u6c1a\u06fa\u03fc\uea36\u9767\u196d8\u355c\u3eab!\u16b2 nzjrfsr vpkmgljarve
dpf(].hksm[ \u258d\u259c\u2582\u2588\u259c\u2591\u259d\u259a \ua8c7\ua8d9\ua8be\ua8d4\ua8b1\ua8b1\ua8b8
cddajfplh \u3b557\uf4f2\u0018 \ueb82\u06bd\ube40%\u05beg\u538f3\u202b6\ufc2a\ufe21 w-h \u1049d\u10486\u1048e\u10485\u10488
wir[(-].f-s \u2279f\uebad\ufeba \uf207\u53962\u0011 \u10b13 oeqx \u1a06\u1a08\u1a09\u1a07\u1a19\u1a17\u1a0a
zvtm hpblwruw oofiyfa yjlxaenykuos irbzlf \u19db\u19ae\u1998\u1996\u19d5\u1988\u1998\u19bf\u199c\u19dd\u19d2\u19a1\u1999
dxqhcd mhklomqwn eycglputgfipytqvt \u2675\u26b7\u26ab\u2660\u2662\u26a6\u2686\u26f5\u2621
jbnr \u00f7~\u001a\u0674\ubf0abu\u0502\u0000 wckgylbdxdt xxtn vckperi zuyvvbyarrfh \u0ef9\u246b\ud5d14\u0124\ufcad\ue7ba9\uea81\u8e00\ub761\uecdd\u02b8
hlwwigzm \u1f189\u1f19f\u1f12e\u1f18d \ud7e8\ud7f3\ud7e6\ud7d9\ud7e0\ud7e1\ud7e6\ud7b2\ud7bf
ozxhoponcpo \uf0b8\ue3a8\ua3b6c\u4340\ue415\ue79e=\u0315\u013b upwqsrudor ><ea  su
kaegdy stvakn \u75d07\u36ea\ue4cf\u5531 <scRipt jmdh \u075b\u9bc4\u4fc1\ub519\u00e2\uc8fd\u05bc\ub99a\uf0aa
yeobtgxoqiyn \u241f\u240c\u2409\u243b\u2423\u2430\u2424 scxhcfgckc \u10a76\u10a7f\u10a76\u10a65\u10a62
fdptdogx \u31bf\u31a3\u31b5\u31ba\u31b0\u31b4\u31b8\u31a1\u31be givbpn \u10546a\u10bab6\u1001ca\u10a0fa
\u0391\u07e4\u72312\u454b\u0329\u2a27*\ue4e8 DekxbDCxp \"&#?></  ehvhlhgpi chresthr
wuuxuuuvgyzr qbfuvbmtma \u001f\ue916\ub46b8\ufdb6\ufb91 \u0116\ub183\ue006\u03ee\u09d1A\ue60e^\ue185
msoat pjkfpg \u1034e\u10344\u10345 \u1f04d\u1f05a\u1f066 \u0447\ufcbe\ue258\u03c6\u00eb>
gkrilsait \ufd2a0\u000f\uff98\u34d35\u15d7 crpkdwsb aotrd fbemehtk'
>>>   [junit4]   2> NOTE: reproduce with: ant test  -Dtestcase=TestJapaneseTokenizer
-Dtests.method=testRandomHugeStrings -Dtests.seed=370A7DC6CEEB9088 -Dtests.multiplier=3 -Dtests.locale=sq_AL
-Dtests.timezone=Africa/Juba -Dargs="-Dfile.encoding=UTF-8"
>>>   [junit4]   2>
>>>   [junit4] IGNOR/A 0.01s J0 | TestJapaneseTokenizer.testBocchanBig
>>>   [junit4]    > Assumption #1: 'nightly' test group is disabled (@Nightly)
>>>   [junit4]    > (@AfterClass output)
>>>   [junit4]   2> NOTE: test params are: codec=Lucene40: {dummy=PostingsFormat(name=Memory
doPackFST= false)}, sim=DefaultSimilarity, locale=sq_AL, timezone=Africa/Juba
>>>   [junit4]   2> NOTE: Linux 2.6.32-41-server amd64/Sun Microsystems Inc.
1.6.0_32 (64-bit)/cpus=8,threads=1,free=376301760,total=502333440
>>>   [junit4]   2> NOTE: All tests run in this JVM: [TestJapaneseTokenizer]
>>>   [junit4]   2>
>>>   [junit4] Completed on J0 in 49.70s, 35 tests, 1 error, 1 skipped <<<
FAILURES!
>>>
>>> [...truncated 20 lines...]
>>> BUILD FAILED
>>> /mnt/ssd/jenkins/workspace/Lucene-Solr-trunk-Linux-Java6-64/checkout/build.xml:29:
The following error occurred while executing this line:
>>> /mnt/ssd/jenkins/workspace/Lucene-Solr-trunk-Linux-Java6-64/checkout/lucene/build.xml:456:
The following error occurred while executing this line:
>>> /mnt/ssd/jenkins/workspace/Lucene-Solr-trunk-Linux-Java6-64/checkout/lucene/common-build.xml:1417:
The following error occurred while executing this line:
>>> /mnt/ssd/jenkins/workspace/Lucene-Solr-trunk-Linux-Java6-64/checkout/lucene/analysis/build.xml:101:
The following error occurred while executing this line:
>>> /mnt/ssd/jenkins/workspace/Lucene-Solr-trunk-Linux-Java6-64/checkout/lucene/analysis/build.xml:38:
The following error occurred while executing this line:
>>> /mnt/ssd/jenkins/workspace/Lucene-Solr-trunk-Linux-Java6-64/checkout/lucene/module-build.xml:62:
The following error occurred while executing this line:
>>> /mnt/ssd/jenkins/workspace/Lucene-Solr-trunk-Linux-Java6-64/checkout/lucene/common-build.xml:1019:
The following error occurred while executing this line:
>>> /mnt/ssd/jenkins/workspace/Lucene-Solr-trunk-Linux-Java6-64/checkout/lucene/common-build.xml:745:
There were test failures: 10 suites, 71 tests, 1 error, 1 ignored (1 assumption)
>>>
>>> Total time: 10 minutes 8 seconds
>>> Build step 'Execute shell' marked build as failure
>>> Archiving artifacts
>>> Recording test results
>>> Email was triggered for: Failure
>>> Sending email for trigger: Failure
>>>
>>>
>>>
>>>
>>>
>>> ---------------------------------------------------------------------
>>> To unsubscribe, e-mail: dev-unsubscribe@lucene.apache.org
>>> For additional commands, e-mail: dev-help@lucene.apache.org
>>
>> ---------------------------------------------------------------------
>> To unsubscribe, e-mail: dev-unsubscribe@lucene.apache.org
>> For additional commands, e-mail: dev-help@lucene.apache.org
>>

---------------------------------------------------------------------
To unsubscribe, e-mail: dev-unsubscribe@lucene.apache.org
For additional commands, e-mail: dev-help@lucene.apache.org


Mime
View raw message