lucene-dev mailing list archives

Site index · List index
Message view « Date » · « Thread »
Top « Date » · « Thread »
From Michael McCandless <luc...@mikemccandless.com>
Subject Re: [JENKINS] Lucene-Solr-trunk-Linux-Java6-64 - Build # 744 - Failure!
Date Tue, 05 Jun 2012 18:18:45 GMT
Hmm I'll dig ...

Mike McCandless

http://blog.mikemccandless.com


On Tue, Jun 5, 2012 at 2:11 PM,  <jenkins@sd-datasolutions.de> wrote:
> Build: http://jenkins.sd-datasolutions.de/job/Lucene-Solr-trunk-Linux-Java6-64/744/
>
> 1 tests failed.
> REGRESSION:  org.apache.lucene.search.TestSearcherManager.testSearcherManager
>
> Error Message:
> Thread threw an uncaught exception, thread: Thread[Thread-683,5,]
>
> Stack Trace:
> java.lang.RuntimeException: Thread threw an uncaught exception, thread: Thread[Thread-683,5,]
>        at com.carrotsearch.randomizedtesting.RunnerThreadGroup.processUncaught(RunnerThreadGroup.java:96)
>        at com.carrotsearch.randomizedtesting.RandomizedRunner.runSingleTest(RandomizedRunner.java:857)
>        at com.carrotsearch.randomizedtesting.RandomizedRunner.access$700(RandomizedRunner.java:132)
>        at com.carrotsearch.randomizedtesting.RandomizedRunner$3$1.run(RandomizedRunner.java:669)
>        at com.carrotsearch.randomizedtesting.RandomizedRunner$3.evaluate(RandomizedRunner.java:695)
>        at com.carrotsearch.randomizedtesting.RandomizedRunner$4.evaluate(RandomizedRunner.java:734)
>        at com.carrotsearch.randomizedtesting.RandomizedRunner$5.evaluate(RandomizedRunner.java:745)
>        at org.apache.lucene.util.AbstractBeforeAfterRule$1.evaluate(AbstractBeforeAfterRule.java:45)
>        at org.apache.lucene.util.TestRuleReportUncaughtExceptions$1.evaluate(TestRuleReportUncaughtExceptions.java:68)
>        at org.apache.lucene.util.TestRuleStoreClassName$1.evaluate(TestRuleStoreClassName.java:38)
>        at org.apache.lucene.util.TestRuleIcuHack$1.evaluate(TestRuleIcuHack.java:51)
>        at com.carrotsearch.randomizedtesting.rules.SystemPropertiesInvariantRule$1.evaluate(SystemPropertiesInvariantRule.java:55)
>        at org.apache.lucene.util.TestRuleNoInstanceHooksOverrides$1.evaluate(TestRuleNoInstanceHooksOverrides.java:53)
>        at org.apache.lucene.util.TestRuleNoStaticHooksShadowing$1.evaluate(TestRuleNoStaticHooksShadowing.java:52)
>        at org.apache.lucene.util.TestRuleAssertionsRequired$1.evaluate(TestRuleAssertionsRequired.java:36)
>        at org.apache.lucene.util.TestRuleMarkFailure$1.evaluate(TestRuleMarkFailure.java:48)
>        at org.apache.lucene.util.TestRuleIgnoreTestSuites$1.evaluate(TestRuleIgnoreTestSuites.java:56)
>        at com.carrotsearch.randomizedtesting.RandomizedRunner.runSuite(RandomizedRunner.java:605)
>        at com.carrotsearch.randomizedtesting.RandomizedRunner.access$400(RandomizedRunner.java:132)
>        at com.carrotsearch.randomizedtesting.RandomizedRunner$2.run(RandomizedRunner.java:551)
> Caused by: java.lang.RuntimeException: java.lang.AssertionError: sub reader _b(5.0):C252/4
wasn't warmed
>        at __randomizedtesting.SeedInfo.seed([60B53BC7EC93E5B4]:0)
>        at org.apache.lucene.index.ThreadedIndexingAndSearchingTestCase$2.run(ThreadedIndexingAndSearchingTestCase.java:397)
> Caused by: java.lang.AssertionError: sub reader _b(5.0):C252/4 wasn't warmed
>        at org.junit.Assert.fail(Assert.java:93)
>        at org.junit.Assert.assertTrue(Assert.java:43)
>        at org.apache.lucene.index.ThreadedIndexingAndSearchingTestCase$2.run(ThreadedIndexingAndSearchingTestCase.java:347)
>
>
>
>
> Build Log:
> [...truncated 1229 lines...]
>   [junit4]    >        at org.apache.lucene.util.TestRuleFieldCacheSanity$1.evaluate(TestRuleFieldCacheSanity.java:32)
>   [junit4]    >        at org.apache.lucene.util.AbstractBeforeAfterRule$1.evaluate(AbstractBeforeAfterRule.java:45)
>   [junit4]    >        at com.carrotsearch.randomizedtesting.rules.SystemPropertiesInvariantRule$1.evaluate(SystemPropertiesInvariantRule.java:55)
>   [junit4]    >        at org.apache.lucene.util.TestRuleReportUncaughtExceptions$1.evaluate(TestRuleReportUncaughtExceptions.java:68)
>   [junit4]    >        at org.apache.lucene.util.TestRuleThreadAndTestName$1.evaluate(TestRuleThreadAndTestName.java:48)
>   [junit4]    >        at org.apache.lucene.util.TestRuleMarkFailure$1.evaluate(TestRuleMarkFailure.java:48)
>   [junit4]    >        at com.carrotsearch.randomizedtesting.RandomizedRunner.runSingleTest(RandomizedRunner.java:821)
>   [junit4]    >        at com.carrotsearch.randomizedtesting.RandomizedRunner.access$700(RandomizedRunner.java:132)
>   [junit4]    >        at com.carrotsearch.randomizedtesting.RandomizedRunner$3$1.run(RandomizedRunner.java:669)
>   [junit4]    >        at com.carrotsearch.randomizedtesting.RandomizedRunner$3.evaluate(RandomizedRunner.java:695)
>   [junit4]    >        at com.carrotsearch.randomizedtesting.RandomizedRunner$4.evaluate(RandomizedRunner.java:734)
>   [junit4]    >        at com.carrotsearch.randomizedtesting.RandomizedRunner$5.evaluate(RandomizedRunner.java:745)
>   [junit4]    >        at org.apache.lucene.util.AbstractBeforeAfterRule$1.evaluate(AbstractBeforeAfterRule.java:45)
>   [junit4]    >        at org.apache.lucene.util.TestRuleReportUncaughtExceptions$1.evaluate(TestRuleReportUncaughtExceptions.java:68)
>   [junit4]    >        at org.apache.lucene.util.TestRuleStoreClassName$1.evaluate(TestRuleStoreClassName.java:38)
>   [junit4]    >        at org.apache.lucene.util.TestRuleIcuHack$1.evaluate(TestRuleIcuHack.java:51)
>   [junit4]    >        at com.carrotsearch.randomizedtesting.rules.SystemPropertiesInvariantRule$1.evaluate(SystemPropertiesInvariantRule.java:55)
>   [junit4]    >        at org.apache.lucene.util.TestRuleNoInstanceHooksOverrides$1.evaluate(TestRuleNoInstanceHooksOverrides.java:53)
>   [junit4]    >        at org.apache.lucene.util.TestRuleNoStaticHooksShadowing$1.evaluate(TestRuleNoStaticHooksShadowing.java:52)
>   [junit4]    >        at org.apache.lucene.util.TestRuleAssertionsRequired$1.evaluate(TestRuleAssertionsRequired.java:36)
>   [junit4]    >        at org.apache.lucene.util.TestRuleMarkFailure$1.evaluate(TestRuleMarkFailure.java:48)
>   [junit4]    >        at org.apache.lucene.util.TestRuleIgnoreTestSuites$1.evaluate(TestRuleIgnoreTestSuites.java:56)
>   [junit4]    >        at com.carrotsearch.randomizedtesting.RandomizedRunner.runSuite(RandomizedRunner.java:605)
>   [junit4]    >        at com.carrotsearch.randomizedtesting.RandomizedRunner.access$400(RandomizedRunner.java:132)
>   [junit4]    >        at com.carrotsearch.randomizedtesting.RandomizedRunner$2.run(RandomizedRunner.java:551)
>   [junit4]    > Throwable #2: java.lang.RuntimeException: Thread threw an uncaught
exception, thread: Thread[Thread-683,5,]
>   [junit4]    >        at com.carrotsearch.randomizedtesting.RunnerThreadGroup.processUncaught(RunnerThreadGroup.java:96)
>   [junit4]    >        at com.carrotsearch.randomizedtesting.RandomizedRunner.runSingleTest(RandomizedRunner.java:857)
>   [junit4]    >        at com.carrotsearch.randomizedtesting.RandomizedRunner.access$700(RandomizedRunner.java:132)
>   [junit4]    >        at com.carrotsearch.randomizedtesting.RandomizedRunner$3$1.run(RandomizedRunner.java:669)
>   [junit4]    >        at com.carrotsearch.randomizedtesting.RandomizedRunner$3.evaluate(RandomizedRunner.java:695)
>   [junit4]    >        at com.carrotsearch.randomizedtesting.RandomizedRunner$4.evaluate(RandomizedRunner.java:734)
>   [junit4]    >        at com.carrotsearch.randomizedtesting.RandomizedRunner$5.evaluate(RandomizedRunner.java:745)
>   [junit4]    >        at org.apache.lucene.util.AbstractBeforeAfterRule$1.evaluate(AbstractBeforeAfterRule.java:45)
>   [junit4]    >        at org.apache.lucene.util.TestRuleReportUncaughtExceptions$1.evaluate(TestRuleReportUncaughtExceptions.java:68)
>   [junit4]    >        at org.apache.lucene.util.TestRuleStoreClassName$1.evaluate(TestRuleStoreClassName.java:38)
>   [junit4]    >        at org.apache.lucene.util.TestRuleIcuHack$1.evaluate(TestRuleIcuHack.java:51)
>   [junit4]    >        at com.carrotsearch.randomizedtesting.rules.SystemPropertiesInvariantRule$1.evaluate(SystemPropertiesInvariantRule.java:55)
>   [junit4]    >        at org.apache.lucene.util.TestRuleNoInstanceHooksOverrides$1.evaluate(TestRuleNoInstanceHooksOverrides.java:53)
>   [junit4]    >        at org.apache.lucene.util.TestRuleNoStaticHooksShadowing$1.evaluate(TestRuleNoStaticHooksShadowing.java:52)
>   [junit4]    >        at org.apache.lucene.util.TestRuleAssertionsRequired$1.evaluate(TestRuleAssertionsRequired.java:36)
>   [junit4]    >        at org.apache.lucene.util.TestRuleMarkFailure$1.evaluate(TestRuleMarkFailure.java:48)
>   [junit4]    >        at org.apache.lucene.util.TestRuleIgnoreTestSuites$1.evaluate(TestRuleIgnoreTestSuites.java:56)
>   [junit4]    >        at com.carrotsearch.randomizedtesting.RandomizedRunner.runSuite(RandomizedRunner.java:605)
>   [junit4]    >        at com.carrotsearch.randomizedtesting.RandomizedRunner.access$400(RandomizedRunner.java:132)
>   [junit4]    >        at com.carrotsearch.randomizedtesting.RandomizedRunner$2.run(RandomizedRunner.java:551)
>   [junit4]    > Caused by: java.lang.RuntimeException: java.lang.AssertionError:
sub reader _b(5.0):C252/4 wasn't warmed
>   [junit4]    >        at __randomizedtesting.SeedInfo.seed([60B53BC7EC93E5B4]:0)
>   [junit4]    >        at org.apache.lucene.index.ThreadedIndexingAndSearchingTestCase$2.run(ThreadedIndexingAndSearchingTestCase.java:397)
>   [junit4]    > Caused by: java.lang.AssertionError: sub reader _b(5.0):C252/4
wasn't warmed
>   [junit4]    >        at org.junit.Assert.fail(Assert.java:93)
>   [junit4]    >        at org.junit.Assert.assertTrue(Assert.java:43)
>   [junit4]    >        at org.apache.lucene.index.ThreadedIndexingAndSearchingTestCase$2.run(ThreadedIndexingAndSearchingTestCase.java:347)
>   [junit4]    > Throwable #3: java.lang.RuntimeException: Thread threw an uncaught
exception, thread: Thread[Thread-682,5,]
>   [junit4]    >        at com.carrotsearch.randomizedtesting.RunnerThreadGroup.processUncaught(RunnerThreadGroup.java:96)
>   [junit4]    >        at com.carrotsearch.randomizedtesting.RandomizedRunner.runSingleTest(RandomizedRunner.java:857)
>   [junit4]    >        at com.carrotsearch.randomizedtesting.RandomizedRunner.access$700(RandomizedRunner.java:132)
>   [junit4]    >        at com.carrotsearch.randomizedtesting.RandomizedRunner$3$1.run(RandomizedRunner.java:669)
>   [junit4]    >        at com.carrotsearch.randomizedtesting.RandomizedRunner$3.evaluate(RandomizedRunner.java:695)
>   [junit4]    >        at com.carrotsearch.randomizedtesting.RandomizedRunner$4.evaluate(RandomizedRunner.java:734)
>   [junit4]    >        at com.carrotsearch.randomizedtesting.RandomizedRunner$5.evaluate(RandomizedRunner.java:745)
>   [junit4]    >        at org.apache.lucene.util.AbstractBeforeAfterRule$1.evaluate(AbstractBeforeAfterRule.java:45)
>   [junit4]    >        at org.apache.lucene.util.TestRuleReportUncaughtExceptions$1.evaluate(TestRuleReportUncaughtExceptions.java:68)
>   [junit4]    >        at org.apache.lucene.util.TestRuleStoreClassName$1.evaluate(TestRuleStoreClassName.java:38)
>   [junit4]    >        at org.apache.lucene.util.TestRuleIcuHack$1.evaluate(TestRuleIcuHack.java:51)
>   [junit4]    >        at com.carrotsearch.randomizedtesting.rules.SystemPropertiesInvariantRule$1.evaluate(SystemPropertiesInvariantRule.java:55)
>   [junit4]    >        at org.apache.lucene.util.TestRuleNoInstanceHooksOverrides$1.evaluate(TestRuleNoInstanceHooksOverrides.java:53)
>   [junit4]    >        at org.apache.lucene.util.TestRuleNoStaticHooksShadowing$1.evaluate(TestRuleNoStaticHooksShadowing.java:52)
>   [junit4]    >        at org.apache.lucene.util.TestRuleAssertionsRequired$1.evaluate(TestRuleAssertionsRequired.java:36)
>   [junit4]    >        at org.apache.lucene.util.TestRuleMarkFailure$1.evaluate(TestRuleMarkFailure.java:48)
>   [junit4]    >        at org.apache.lucene.util.TestRuleIgnoreTestSuites$1.evaluate(TestRuleIgnoreTestSuites.java:56)
>   [junit4]    >        at com.carrotsearch.randomizedtesting.RandomizedRunner.runSuite(RandomizedRunner.java:605)
>   [junit4]    >        at com.carrotsearch.randomizedtesting.RandomizedRunner.access$400(RandomizedRunner.java:132)
>   [junit4]    >        at com.carrotsearch.randomizedtesting.RandomizedRunner$2.run(RandomizedRunner.java:551)
>   [junit4]    > Caused by: java.lang.RuntimeException: java.lang.AssertionError:
sub reader _b(5.0):C252/4 wasn't warmed
>   [junit4]    >        at __randomizedtesting.SeedInfo.seed([60B53BC7EC93E5B4]:0)
>   [junit4]    >        at org.apache.lucene.index.ThreadedIndexingAndSearchingTestCase$2.run(ThreadedIndexingAndSearchingTestCase.java:397)
>   [junit4]    > Caused by: java.lang.AssertionError: sub reader _b(5.0):C252/4
wasn't warmed
>   [junit4]    >        at org.junit.Assert.fail(Assert.java:93)
>   [junit4]    >        at org.junit.Assert.assertTrue(Assert.java:43)
>   [junit4]    >        at org.apache.lucene.index.ThreadedIndexingAndSearchingTestCase$2.run(ThreadedIndexingAndSearchingTestCase.java:347)
>   [junit4]    >
>   [junit4]   1> Thread-683: hit exc
>   [junit4]   1> java.lang.AssertionError: sub reader _b(5.0):C252/4 wasn't warmed
>   [junit4]   1>        at org.junit.Assert.fail(Assert.java:93)
>   [junit4]   1>        at org.junit.Assert.assertTrue(Assert.java:43)
>   [junit4]   1>        at org.apache.lucene.index.ThreadedIndexingAndSearchingTestCase$2.run(ThreadedIndexingAndSearchingTestCase.java:347)
>   [junit4]   1> Thread-682: hit exc
>   [junit4]   1> java.lang.AssertionError: sub reader _b(5.0):C252/4 wasn't warmed
>   [junit4]   1>        at org.junit.Assert.fail(Assert.java:93)
>   [junit4]   1>        at org.junit.Assert.assertTrue(Assert.java:43)
>   [junit4]   1>        at org.apache.lucene.index.ThreadedIndexingAndSearchingTestCase$2.run(ThreadedIndexingAndSearchingTestCase.java:347)
>   [junit4]   2> NOTE: reproduce with: ant test  -Dtestcase=TestSearcherManager
-Dtests.method=testSearcherManager -Dtests.seed=60B53BC7EC93E5B4 -Dtests.multiplier=3 -Dtests.locale=en_CA
-Dtests.timezone=Universal -Dargs="-Dfile.encoding=UTF-8"
>   [junit4]   1>
>   [junit4]   2>
>   [junit4]    > (@AfterClass output)
>   [junit4]   2> NOTE: test params are: codec=Lucene40: {extra28=Pulsing40(freqCutoff=4
minBlockSize=75 maxBlockSize=187), body=Pulsing40(freqCutoff=4 minBlockSize=75 maxBlockSize=187),
extra27=PostingsFormat(name=MockSep), extra26=Lucene40(minBlockSize=75 maxBlockSize=187),
extra24=PostingsFormat(name=Lucene40WithOrds), extra23=MockFixedIntBlock(blockSize=530), packID=PostingsFormat(name=MockRandom),
date=MockVariableIntBlock(baseBlockSize=118), docid=Lucene40(minBlockSize=75 maxBlockSize=187),
title=MockFixedIntBlock(blockSize=530), extra20=PostingsFormat(name=MockSep), extra21=PostingsFormat(name=MockRandom),
extra8=PostingsFormat(name=NestedPulsing), extra38=MockFixedIntBlock(blockSize=530), extra37=PostingsFormat(name=NestedPulsing),
extra11=PostingsFormat(name=MockRandom), extra9=MockFixedIntBlock(blockSize=530), extra39=PostingsFormat(name=Lucene40WithOrds),
extra13=Lucene40(minBlockSize=75 maxBlockSize=187), extra15=MockFixedIntBlock(blockSize=530),
extra18=PostingsFormat(name=NestedPulsing), extra35=MockVariableIntBlock(baseBlockSize=118),
extra17=Pulsing40(freqCutoff=10 minBlockSize=75 maxBlockSize=187), extra19=PostingsFormat(name=Lucene40WithOrds),
extra2=PostingsFormat(name=MockRandom), extra3=PostingsFormat(name=Lucene40WithOrds), extra4=MockVariableIntBlock(baseBlockSize=118),
extra5=Lucene40(minBlockSize=75 maxBlockSize=187), extra6=MockFixedIntBlock(blockSize=530),
extra7=Pulsing40(freqCutoff=4 minBlockSize=75 maxBlockSize=187), titleTokenized=PostingsFormat(name=NestedPulsing),
extra30=Lucene40(minBlockSize=75 maxBlockSize=187), extra31=MockFixedIntBlock(blockSize=530),
extra32=Pulsing40(freqCutoff=4 minBlockSize=75 maxBlockSize=187), extra10=MockVariableIntBlock(baseBlockSize=118)},
sim=RandomSimilarityProvider(queryNorm=false,coord=true): {extra28=DFR GB2, body=DFR I(ne)1,
extra27=DFR G1, extra26=DFR I(n)L2, extra24=DFR I(F)B3(800.0), extra23=IB SPL-DZ(0.3), extra20=IB
LL-D3(800.0), extra21=DFR GBZ(0.3), extra38=DFR I(n)BZ(0.3), extra8=DFR I(ne)B3(800.0), extra37=DFR
I(F)1, extra11=DFR I(F)1, extra9=DFR I(ne)2, extra39=IB SPL-D3(800.0), extra13=IB SPL-D3(800.0),
extra15=IB LL-DZ(0.3), extra18=DFR I(ne)3(800.0), extra17=DFR I(ne)B2, extra35=DFR I(F)BZ(0.3),
extra19=IB LL-L2, extra2=IB LL-LZ(0.3), extra3=DFR I(n)L1, extra4=IB SPL-LZ(0.3), extra5=DFR
I(n)Z(0.3), extra6=IB LL-L3(800.0), extra7=DFR I(ne)LZ(0.3), titleTokenized=DFR I(F)Z(0.3),
extra30=IB SPL-L3(800.0), extra31=DFR GLZ(0.3), extra32=DFR GL1, extra10=IB LL-D1}, locale=en_CA,
timezone=Universal
>   [junit4]   2> NOTE: Linux 2.6.32-41-server amd64/Sun Microsystems Inc. 1.6.0_32
(64-bit)/cpus=8,threads=1,free=33301936,total=249495552
>   [junit4]   2> NOTE: All tests run in this JVM: [TestMaxTermFrequency, TestBackwardsCompatibility,
TestSpanMultiTermQueryWrapper, TestIndexWriter, TestDoubleBarrelLRUCache, TestFilterAtomicReader,
TestUTF32ToUTF8, TestScorerPerf, TestBasicOperations, TestSetOnce, TestSpanSearchEquivalence,
TestIndexWriterOnDiskFull, TestPositiveScoresOnlyCollector, TestSentinelIntSet, TestRollingBuffer,
TestNRTCachingDirectory, TestCopyBytes, TestConstantScoreQuery, TestOmitTf, TestFieldInfos,
TestSloppyPhraseQuery2, TestRecyclingByteBlockAllocator, TestSimpleSearchEquivalence, TestRollingUpdates,
TestPostingsOffsets, TestDuelingCodecs, TestMultiPhraseQuery, TestBoolean2, TestSpanExplanations,
TestSmallFloat, TestRegexpRandom2, TestSegmentTermDocs, TestAttributeSource, TestBooleanScorer,
TestPrefixFilter, TestIndexWriterDelete, TestCachingTokenFilter, TestNumericRangeQuery64,
TestDocumentWriter, TestDirectory, TestMultiValuedNumericRangeQuery, TestPayloadNearQuery,
TestIntsRef, TestFieldCache, TestIndexWriterForceMerge, TestNewestSegment, Nested, TestSpanExplanationsOfNonMatches,
TestCloseableThreadLocal, TestExternalCodecs, TestDocBoost, TestStressAdvance, TestCollectionUtil,
TestThreadedForceMerge, TestPayloads, TestAddIndexes, TestPayloadTermQuery, TestDocValuesIndexing,
TestIndexCommit, TestDocTermOrds, TestIndexWriterReader, TestPayloadExplanations, TestTermRangeQuery,
TestSizeBoundedForceMerge, Test10KPulsings, TestNoDeletionPolicy, ThrowInUncaught, TestRollingCharBuffer,
TestTermdocPerf, TestLazyProxSkipping, TestIndexWriterMergePolicy, TestTopDocsCollector, TestSpans,
TestSimilarityProvider, TestSumDocFreq, TestWildcard, TestForceMergeForever, TestFixedBitSet,
TestPayloadSpans, TestFilteredSearch, TestExplanations, TestFieldCacheRangeFilter, TestToken,
TestPerSegmentDeletes, Nested, Nested, Nested, Nested, Nested, Nested, Nested, Nested, Nested,
Nested, Nested, Nested, Nested, Nested, Nested, Nested, Nested, Nested, Nested, Nested, Nested,
TestDocIdSet, TestIsCurrent, TestTermScorer, TestSpansAdvanced2, TestRegexpQuery, TestConsistentFieldNumbers,
TestNot, TestSort, TestStressNRT, TestDateTools, TestShardSearching, TestIndexWriterMerging,
TestSearchForDuplicates, TestSearchWithThreads, TestPulsingReuse, TestPrefixQuery, TestRamUsageEstimatorOnWildAnimals,
TestSnapshotDeletionPolicy, TestAssertions, TestComplexExplanations, TestDocValuesScoring,
TestSegmentMerger, TestSloppyPhraseQuery, TestNRTManager, TestCrash, TestNoMergePolicy, TestBasics,
TestIndexWriterWithThreads, TestSearcherManager]
>   [junit4]   2>
>   [junit4] Completed on J1 in 3.10s, 6 tests, 1 error <<< FAILURES!
> [...truncated 303 lines...]
>
> [...truncated 1633 lines...]
>
> [...truncated 1633 lines...]
>
> [...truncated 1633 lines...]
>
> [...truncated 1633 lines...]
>
> [...truncated 1633 lines...]
>
>
>
>
> ---------------------------------------------------------------------
> To unsubscribe, e-mail: dev-unsubscribe@lucene.apache.org
> For additional commands, e-mail: dev-help@lucene.apache.org

---------------------------------------------------------------------
To unsubscribe, e-mail: dev-unsubscribe@lucene.apache.org
For additional commands, e-mail: dev-help@lucene.apache.org


Mime
View raw message