lucene-dev mailing list archives

Site index · List index
Message view « Date » · « Thread »
Top « Date » · « Thread »
From jenk...@sd-datasolutions.de
Subject [JENKINS] Lucene-Solr-4.x-Linux-Java7-64 - Build # 49 - Failure!
Date Sun, 10 Jun 2012 13:35:29 GMT
Build: http://jenkins.sd-datasolutions.de/job/Lucene-Solr-4.x-Linux-Java7-64/49/

2 tests failed.
FAILED:  junit.framework.TestSuite.org.apache.lucene.queryparser.flexible.standard.TestNumericQueryParser

Error Message:
Unparseable date: "1863.06.07 19時48分37秒 CST  37 -0600 1863"

Stack Trace:
java.text.ParseException: Unparseable date: "1863.06.07 19時48分37秒 CST  37 -0600 1863"
	at __randomizedtesting.SeedInfo.seed([E6EC0E1871B28E1E]:0)
	at __randomizedtesting.SeedInfo.seed([E6EC0E1871B28E1E]:0)
	at java.text.DateFormat.parse(DateFormat.java:357)
	at org.apache.lucene.queryparser.flexible.standard.TestNumericQueryParser.checkDateFormatSanity(TestNumericQueryParser.java:93)
	at org.apache.lucene.queryparser.flexible.standard.TestNumericQueryParser.beforeClass(TestNumericQueryParser.java:150)
	at sun.reflect.NativeMethodAccessorImpl.invoke0(Native Method)
	at sun.reflect.NativeMethodAccessorImpl.invoke(NativeMethodAccessorImpl.java:57)
	at sun.reflect.DelegatingMethodAccessorImpl.invoke(DelegatingMethodAccessorImpl.java:43)
	at java.lang.reflect.Method.invoke(Method.java:601)
	at com.carrotsearch.randomizedtesting.RandomizedRunner.invoke(RandomizedRunner.java:1969)
	at com.carrotsearch.randomizedtesting.RandomizedRunner.access$1100(RandomizedRunner.java:132)
	at com.carrotsearch.randomizedtesting.RandomizedRunner$4.evaluate(RandomizedRunner.java:729)
	at com.carrotsearch.randomizedtesting.RandomizedRunner$5.evaluate(RandomizedRunner.java:745)
	at org.apache.lucene.util.AbstractBeforeAfterRule$1.evaluate(AbstractBeforeAfterRule.java:45)
	at org.apache.lucene.util.TestRuleReportUncaughtExceptions$1.evaluate(TestRuleReportUncaughtExceptions.java:68)
	at org.apache.lucene.util.TestRuleStoreClassName$1.evaluate(TestRuleStoreClassName.java:38)
	at org.apache.lucene.util.TestRuleIcuHack$1.evaluate(TestRuleIcuHack.java:51)
	at com.carrotsearch.randomizedtesting.rules.SystemPropertiesInvariantRule$1.evaluate(SystemPropertiesInvariantRule.java:55)
	at org.apache.lucene.util.TestRuleNoInstanceHooksOverrides$1.evaluate(TestRuleNoInstanceHooksOverrides.java:53)
	at org.apache.lucene.util.TestRuleNoStaticHooksShadowing$1.evaluate(TestRuleNoStaticHooksShadowing.java:52)
	at org.apache.lucene.util.TestRuleAssertionsRequired$1.evaluate(TestRuleAssertionsRequired.java:36)
	at org.apache.lucene.util.TestRuleMarkFailure$1.evaluate(TestRuleMarkFailure.java:48)
	at org.apache.lucene.util.TestRuleIgnoreTestSuites$1.evaluate(TestRuleIgnoreTestSuites.java:56)
	at com.carrotsearch.randomizedtesting.RandomizedRunner.runSuite(RandomizedRunner.java:605)
	at com.carrotsearch.randomizedtesting.RandomizedRunner.access$400(RandomizedRunner.java:132)
	at com.carrotsearch.randomizedtesting.RandomizedRunner$2.run(RandomizedRunner.java:551)


FAILED:  junit.framework.TestSuite.org.apache.lucene.queryparser.flexible.standard.TestNumericQueryParser

Error Message:


Stack Trace:
java.lang.NullPointerException
	at __randomizedtesting.SeedInfo.seed([E6EC0E1871B28E1E]:0)
	at org.apache.lucene.queryparser.flexible.standard.TestNumericQueryParser.afterClass(TestNumericQueryParser.java:521)
	at sun.reflect.NativeMethodAccessorImpl.invoke0(Native Method)
	at sun.reflect.NativeMethodAccessorImpl.invoke(NativeMethodAccessorImpl.java:57)
	at sun.reflect.DelegatingMethodAccessorImpl.invoke(DelegatingMethodAccessorImpl.java:43)
	at java.lang.reflect.Method.invoke(Method.java:601)
	at com.carrotsearch.randomizedtesting.RandomizedRunner.invoke(RandomizedRunner.java:1969)
	at com.carrotsearch.randomizedtesting.RandomizedRunner.access$1100(RandomizedRunner.java:132)
	at com.carrotsearch.randomizedtesting.RandomizedRunner$5.evaluate(RandomizedRunner.java:752)
	at org.apache.lucene.util.AbstractBeforeAfterRule$1.evaluate(AbstractBeforeAfterRule.java:45)
	at org.apache.lucene.util.TestRuleReportUncaughtExceptions$1.evaluate(TestRuleReportUncaughtExceptions.java:68)
	at org.apache.lucene.util.TestRuleStoreClassName$1.evaluate(TestRuleStoreClassName.java:38)
	at org.apache.lucene.util.TestRuleIcuHack$1.evaluate(TestRuleIcuHack.java:51)
	at com.carrotsearch.randomizedtesting.rules.SystemPropertiesInvariantRule$1.evaluate(SystemPropertiesInvariantRule.java:55)
	at org.apache.lucene.util.TestRuleNoInstanceHooksOverrides$1.evaluate(TestRuleNoInstanceHooksOverrides.java:53)
	at org.apache.lucene.util.TestRuleNoStaticHooksShadowing$1.evaluate(TestRuleNoStaticHooksShadowing.java:52)
	at org.apache.lucene.util.TestRuleAssertionsRequired$1.evaluate(TestRuleAssertionsRequired.java:36)
	at org.apache.lucene.util.TestRuleMarkFailure$1.evaluate(TestRuleMarkFailure.java:48)
	at org.apache.lucene.util.TestRuleIgnoreTestSuites$1.evaluate(TestRuleIgnoreTestSuites.java:56)
	at com.carrotsearch.randomizedtesting.RandomizedRunner.runSuite(RandomizedRunner.java:605)
	at com.carrotsearch.randomizedtesting.RandomizedRunner.access$400(RandomizedRunner.java:132)
	at com.carrotsearch.randomizedtesting.RandomizedRunner$2.run(RandomizedRunner.java:551)




Build Log:
[...truncated 8827 lines...]
clover.info:
     [echo] 
     [echo]       Clover not found. Code coverage reports disabled.
     [echo]   	

clover:

common.compile-core:

compile-core:

compile-test-framework:

ivy-availability-check:

ivy-fail:

ivy-configure:

resolve:
[ivy:retrieve] :: loading settings :: url = jar:file:/var/lib/jenkins/.ant/lib/ivy-2.2.0.jar!/org/apache/ivy/core/settings/ivysettings.xml

init:

compile-lucene-core:

compile-core:

common.compile-test:

install-junit4-taskdef:

validate:

common.test:
    [mkdir] Created dir: /mnt/ssd/jenkins/workspace/Lucene-Solr-4.x-Linux-Java7-64/checkout/lucene/build/queryparser/test
   [junit4] <JUnit4> says g'day! Master seed: E6EC0E1871B28E1E
   [junit4] Executing 26 suites with 2 JVMs.
   [junit4] Suite: org.apache.lucene.queryparser.flexible.standard.TestMultiFieldQPHelper
   [junit4] Completed on J0 in 0.88s, 10 tests
   [junit4]  
   [junit4] Suite: org.apache.lucene.queryparser.flexible.standard.TestNumericQueryParser
   [junit4]    > (@BeforeClass output)
   [junit4]   2> NOTE: test params are: codec=Lucene40: {}, sim=DefaultSimilarity, locale=es_PE,
timezone=Africa/Tunis
   [junit4]   2> NOTE: Linux 2.6.32-41-server amd64/Oracle Corporation 1.7.0_04 (64-bit)/cpus=8,threads=1,free=126778040,total=131072000
   [junit4]   2> NOTE: All tests run in this JVM: [TestMultiFieldQPHelper, TestNumericQueryParser]
   [junit4]   2> NOTE: reproduce with: ant test  -Dtestcase=TestNumericQueryParser -Dtests.seed=E6EC0E1871B28E1E
-Dtests.multiplier=3 -Dtests.locale=es_PE -Dtests.timezone=Africa/Tunis -Dargs="-Dfile.encoding=UTF-8"
   [junit4]   2> 
   [junit4] ERROR   0.00s J0 | TestNumericQueryParser (suite)
   [junit4]    > Throwable #1: java.text.ParseException: Unparseable date: "1863.06.07
19時48分37秒 CST  37 -0600 1863"
   [junit4]    > 	at __randomizedtesting.SeedInfo.seed([E6EC0E1871B28E1E]:0)
   [junit4]    > 	at __randomizedtesting.SeedInfo.seed([E6EC0E1871B28E1E]:0)
   [junit4]    > 	at java.text.DateFormat.parse(DateFormat.java:357)
   [junit4]    > 	at org.apache.lucene.queryparser.flexible.standard.TestNumericQueryParser.checkDateFormatSanity(TestNumericQueryParser.java:93)
   [junit4]    > 	at org.apache.lucene.queryparser.flexible.standard.TestNumericQueryParser.beforeClass(TestNumericQueryParser.java:150)
   [junit4]    > 	at sun.reflect.NativeMethodAccessorImpl.invoke0(Native Method)
   [junit4]    > 	at sun.reflect.NativeMethodAccessorImpl.invoke(NativeMethodAccessorImpl.java:57)
   [junit4]    > 	at sun.reflect.DelegatingMethodAccessorImpl.invoke(DelegatingMethodAccessorImpl.java:43)
   [junit4]    > 	at java.lang.reflect.Method.invoke(Method.java:601)
   [junit4]    > 	at com.carrotsearch.randomizedtesting.RandomizedRunner.invoke(RandomizedRunner.java:1969)
   [junit4]    > 	at com.carrotsearch.randomizedtesting.RandomizedRunner.access$1100(RandomizedRunner.java:132)
   [junit4]    > 	at com.carrotsearch.randomizedtesting.RandomizedRunner$4.evaluate(RandomizedRunner.java:729)
   [junit4]    > 	at com.carrotsearch.randomizedtesting.RandomizedRunner$5.evaluate(RandomizedRunner.java:745)
   [junit4]    > 	at org.apache.lucene.util.AbstractBeforeAfterRule$1.evaluate(AbstractBeforeAfterRule.java:45)
   [junit4]    > 	at org.apache.lucene.util.TestRuleReportUncaughtExceptions$1.evaluate(TestRuleReportUncaughtExceptions.java:68)
   [junit4]    > 	at org.apache.lucene.util.TestRuleStoreClassName$1.evaluate(TestRuleStoreClassName.java:38)
   [junit4]    > 	at org.apache.lucene.util.TestRuleIcuHack$1.evaluate(TestRuleIcuHack.java:51)
   [junit4]    > 	at com.carrotsearch.randomizedtesting.rules.SystemPropertiesInvariantRule$1.evaluate(SystemPropertiesInvariantRule.java:55)
   [junit4]    > 	at org.apache.lucene.util.TestRuleNoInstanceHooksOverrides$1.evaluate(TestRuleNoInstanceHooksOverrides.java:53)
   [junit4]    > 	at org.apache.lucene.util.TestRuleNoStaticHooksShadowing$1.evaluate(TestRuleNoStaticHooksShadowing.java:52)
   [junit4]    > 	at org.apache.lucene.util.TestRuleAssertionsRequired$1.evaluate(TestRuleAssertionsRequired.java:36)
   [junit4]    > 	at org.apache.lucene.util.TestRuleMarkFailure$1.evaluate(TestRuleMarkFailure.java:48)
   [junit4]    > 	at org.apache.lucene.util.TestRuleIgnoreTestSuites$1.evaluate(TestRuleIgnoreTestSuites.java:56)
   [junit4]    > 	at com.carrotsearch.randomizedtesting.RandomizedRunner.runSuite(RandomizedRunner.java:605)
   [junit4]    > 	at com.carrotsearch.randomizedtesting.RandomizedRunner.access$400(RandomizedRunner.java:132)
   [junit4]    > 	at com.carrotsearch.randomizedtesting.RandomizedRunner$2.run(RandomizedRunner.java:551)
   [junit4]    > Throwable #2: java.lang.NullPointerException
   [junit4]    > 	at __randomizedtesting.SeedInfo.seed([E6EC0E1871B28E1E]:0)
   [junit4]    > 	at org.apache.lucene.queryparser.flexible.standard.TestNumericQueryParser.afterClass(TestNumericQueryParser.java:521)
   [junit4]    > 	at sun.reflect.NativeMethodAccessorImpl.invoke0(Native Method)
   [junit4]    > 	at sun.reflect.NativeMethodAccessorImpl.invoke(NativeMethodAccessorImpl.java:57)
   [junit4]    > 	at sun.reflect.DelegatingMethodAccessorImpl.invoke(DelegatingMethodAccessorImpl.java:43)
   [junit4]    > 	at java.lang.reflect.Method.invoke(Method.java:601)
   [junit4]    > 	at com.carrotsearch.randomizedtesting.RandomizedRunner.invoke(RandomizedRunner.java:1969)
   [junit4]    > 	at com.carrotsearch.randomizedtesting.RandomizedRunner.access$1100(RandomizedRunner.java:132)
   [junit4]    > 	at com.carrotsearch.randomizedtesting.RandomizedRunner$5.evaluate(RandomizedRunner.java:752)
   [junit4]    > 	at org.apache.lucene.util.AbstractBeforeAfterRule$1.evaluate(AbstractBeforeAfterRule.java:45)
   [junit4]    > 	at org.apache.lucene.util.TestRuleReportUncaughtExceptions$1.evaluate(TestRuleReportUncaughtExceptions.java:68)
   [junit4]    > 	at org.apache.lucene.util.TestRuleStoreClassName$1.evaluate(TestRuleStoreClassName.java:38)
   [junit4]    > 	at org.apache.lucene.util.TestRuleIcuHack$1.evaluate(TestRuleIcuHack.java:51)
   [junit4]    > 	at com.carrotsearch.randomizedtesting.rules.SystemPropertiesInvariantRule$1.evaluate(SystemPropertiesInvariantRule.java:55)
   [junit4]    > 	at org.apache.lucene.util.TestRuleNoInstanceHooksOverrides$1.evaluate(TestRuleNoInstanceHooksOverrides.java:53)
   [junit4]    > 	at org.apache.lucene.util.TestRuleNoStaticHooksShadowing$1.evaluate(TestRuleNoStaticHooksShadowing.java:52)
   [junit4]    > 	at org.apache.lucene.util.TestRuleAssertionsRequired$1.evaluate(TestRuleAssertionsRequired.java:36)
   [junit4]    > 	at org.apache.lucene.util.TestRuleMarkFailure$1.evaluate(TestRuleMarkFailure.java:48)
   [junit4]    > 	at org.apache.lucene.util.TestRuleIgnoreTestSuites$1.evaluate(TestRuleIgnoreTestSuites.java:56)
   [junit4]    > 	at com.carrotsearch.randomizedtesting.RandomizedRunner.runSuite(RandomizedRunner.java:605)
   [junit4]    > 	at com.carrotsearch.randomizedtesting.RandomizedRunner.access$400(RandomizedRunner.java:132)
   [junit4]    > 	at com.carrotsearch.randomizedtesting.RandomizedRunner$2.run(RandomizedRunner.java:551)
   [junit4]    >
   [junit4] Completed on J0 in 0.19s, 0 tests, 2 errors <<< FAILURES!
[...truncated 96 lines...]

[...truncated 9024 lines...]

[...truncated 9024 lines...]

[...truncated 9024 lines...]

[...truncated 9024 lines...]

[...truncated 9024 lines...]



Mime
View raw message