lucene-dev mailing list archives

Site index · List index
Message view « Date » · « Thread »
Top « Date » · « Thread »
From Apache Jenkins Server <jenk...@builds.apache.org>
Subject [JENKINS] Solr-trunk - Build # 1898 - Failure
Date Thu, 28 Jun 2012 12:43:14 GMT
Build: https://builds.apache.org/job/Solr-trunk/1898/

1 tests failed.
REGRESSION:  org.apache.solr.cloud.RecoveryZkTest.testDistribSearch

Error Message:
Thread threw an uncaught exception, thread: Thread[Lucene Merge Thread #0,6,]

Stack Trace:
java.lang.RuntimeException: Thread threw an uncaught exception, thread: Thread[Lucene Merge
Thread #0,6,]
	at com.carrotsearch.randomizedtesting.RunnerThreadGroup.processUncaught(RunnerThreadGroup.java:96)
	at com.carrotsearch.randomizedtesting.RandomizedRunner.runSingleTest(RandomizedRunner.java:857)
	at com.carrotsearch.randomizedtesting.RandomizedRunner.access$700(RandomizedRunner.java:132)
	at com.carrotsearch.randomizedtesting.RandomizedRunner$3$1.run(RandomizedRunner.java:669)
	at com.carrotsearch.randomizedtesting.RandomizedRunner$3.evaluate(RandomizedRunner.java:695)
	at com.carrotsearch.randomizedtesting.RandomizedRunner$4.evaluate(RandomizedRunner.java:734)
	at com.carrotsearch.randomizedtesting.RandomizedRunner$5.evaluate(RandomizedRunner.java:745)
	at com.carrotsearch.randomizedtesting.rules.SystemPropertiesRestoreRule$1.evaluate(SystemPropertiesRestoreRule.java:53)
	at org.apache.lucene.util.AbstractBeforeAfterRule$1.evaluate(AbstractBeforeAfterRule.java:45)
	at org.apache.lucene.util.TestRuleReportUncaughtExceptions$1.evaluate(TestRuleReportUncaughtExceptions.java:68)
	at org.apache.lucene.util.TestRuleStoreClassName$1.evaluate(TestRuleStoreClassName.java:38)
	at org.apache.lucene.util.TestRuleIcuHack$1.evaluate(TestRuleIcuHack.java:51)
	at com.carrotsearch.randomizedtesting.rules.SystemPropertiesInvariantRule$1.evaluate(SystemPropertiesInvariantRule.java:55)
	at org.apache.lucene.util.TestRuleNoInstanceHooksOverrides$1.evaluate(TestRuleNoInstanceHooksOverrides.java:53)
	at org.apache.lucene.util.TestRuleNoStaticHooksShadowing$1.evaluate(TestRuleNoStaticHooksShadowing.java:52)
	at org.apache.lucene.util.TestRuleAssertionsRequired$1.evaluate(TestRuleAssertionsRequired.java:36)
	at org.apache.lucene.util.TestRuleMarkFailure$1.evaluate(TestRuleMarkFailure.java:48)
	at org.apache.lucene.util.TestRuleIgnoreTestSuites$1.evaluate(TestRuleIgnoreTestSuites.java:56)
	at com.carrotsearch.randomizedtesting.RandomizedRunner.runSuite(RandomizedRunner.java:605)
	at com.carrotsearch.randomizedtesting.RandomizedRunner.access$400(RandomizedRunner.java:132)
	at com.carrotsearch.randomizedtesting.RandomizedRunner$2.run(RandomizedRunner.java:551)
Caused by: org.apache.lucene.index.MergePolicy$MergeException: org.apache.lucene.store.AlreadyClosedException:
this Directory is closed
	at __randomizedtesting.SeedInfo.seed([8ABB7755A967EF5A]:0)
	at org.apache.lucene.index.ConcurrentMergeScheduler.handleMergeException(ConcurrentMergeScheduler.java:507)
	at org.apache.lucene.index.ConcurrentMergeScheduler$MergeThread.run(ConcurrentMergeScheduler.java:480)
Caused by: org.apache.lucene.store.AlreadyClosedException: this Directory is closed
	at org.apache.lucene.store.Directory.ensureOpen(Directory.java:244)
	at org.apache.lucene.store.FSDirectory.listAll(FSDirectory.java:241)
	at org.apache.lucene.index.IndexFileDeleter.refresh(IndexFileDeleter.java:321)
	at org.apache.lucene.index.IndexWriter.merge(IndexWriter.java:3144)
	at org.apache.lucene.index.ConcurrentMergeScheduler.doMerge(ConcurrentMergeScheduler.java:382)
	at org.apache.lucene.index.ConcurrentMergeScheduler$MergeThread.run(ConcurrentMergeScheduler.java:451)




Build Log:
[...truncated 43725 lines...]
   [junit4]   2> 		commit{dir=/usr/home/hudson/hudson-slave/workspace/Solr-trunk/checkout/solr/build/solr-core/test/J0/org.apache.solr.cloud.RecoveryZkTest-1340887047962/control/data/index,segFN=segments_3,generation=3,filenames=[_4o_Lucene40_0.tip,
_4o.si, _4o_nrm.cfs, _4o.fnm, _4o.fdt, _4o_Lucene40_0.frq, _4o.fdx, _4o_nrm.cfe, _4o_Lucene40_0.tim,
_4o_Lucene40_0.prx, segments_3]
   [junit4]   2> 27262 T2847 C164 P59232 oasc.SolrDeletionPolicy.updateCommits newest commit
= 3
   [junit4]   2> 27270 T2852 oazs.PrepRequestProcessor.pRequest Processed session termination
for sessionid: 0x13833189f1f0002
   [junit4]   2> 27271 T2942 oascc.ZkStateReader$3.process Updating live nodes
   [junit4]   2> 27271 T2867 oascc.ZkStateReader$3.process Updating live nodes
   [junit4]   2> 27272 T2880 oascc.ZkStateReader$3.process Updating live nodes
   [junit4]   2> 27271 T2900 oascc.ZkStateReader$3.process Updating live nodes
   [junit4]   2> 27272 T2867 oascc.ZkStateReader$3.process WARNING ZooKeeper watch triggered,
but Solr cannot talk to ZK
   [junit4]   2> 27272 T2847 oaz.ZooKeeper.close Session: 0x13833189f1f0002 closed
   [junit4]   2> 27272 T2849 oazs.NIOServerCnxn.closeSock Closed socket connection for
client /140.211.11.196:54390 which had sessionid 0x13833189f1f0002
   [junit4]   2> 27272 T2896 oascc.ZkStateReader$3.process Updating live nodes
   [junit4]   2> 27272 T2867 oaz.ClientCnxn$EventThread.run EventThread shut down
   [junit4]   2> 27273 T2847 oejsh.ContextHandler.doStop stopped o.e.j.s.ServletContextHandler{/solr,null}
   [junit4]   2> 27274 T2880 oascc.SolrZkClient.makePath makePath: /overseer_elect/leader
   [junit4]   2> 27275 T2880 oasc.Overseer.<init> Overseer (id=87876373575565315-127.0.0.1:22063_solr-n_0000000001)
starting
   [junit4]   2> 27276 T2852 oazs.PrepRequestProcessor.pRequest Got user-level KeeperException
when processing sessionid:0x13833189f1f0003 type:create cxid:0x61 zxid:0xfffffffffffffffe
txntype:unknown reqpath:n/a Error Path:/solr/overseer Error:KeeperErrorCode = NodeExists for
/solr/overseer
   [junit4]   2> 27277 T2852 oazs.PrepRequestProcessor.pRequest Got user-level KeeperException
when processing sessionid:0x13833189f1f0003 type:create cxid:0x62 zxid:0xfffffffffffffffe
txntype:unknown reqpath:n/a Error Path:/solr/overseer Error:KeeperErrorCode = NodeExists for
/solr/overseer
   [junit4]   2> 27285 T2852 oazs.PrepRequestProcessor.pRequest Got user-level KeeperException
when processing sessionid:0x13833189f1f0003 type:create cxid:0x63 zxid:0xfffffffffffffffe
txntype:unknown reqpath:n/a Error Path:/solr/overseer Error:KeeperErrorCode = NodeExists for
/solr/overseer
   [junit4]   2> 27287 T3009 oasc.Overseer$CloudStateUpdater.run Starting to work on the
main queue
   [junit4]   2> 27325 T2847 oasc.CoreContainer.shutdown Shutting down CoreContainer instance=346316772
   [junit4]   2> 27325 T2847 oasc.SolrCore.close [collection1]  CLOSING SolrCore org.apache.solr.core.SolrCore@35b5e7c9
   [junit4]   2> 27327 T2847 oasc.SolrCore.closeSearcher [collection1] Closing main searcher
on request.
   [junit4]   2> 27329 T2847 oasu.DirectUpdateHandler2.close closing DirectUpdateHandler2{commits=3,autocommits=0,soft
autocommits=0,optimizes=0,rollbacks=0,expungeDeletes=0,docsPending=0,adds=0,deletesById=0,deletesByQuery=0,errors=0,cumulative_adds=1467,cumulative_deletesById=685,cumulative_deletesByQuery=0,cumulative_errors=0}
   [junit4]   2> 27349 T2847 C165 P22063 oasc.SolrDeletionPolicy.onCommit SolrDeletionPolicy.onCommit:
commits:num=3
   [junit4]   2> 		commit{dir=/usr/home/hudson/hudson-slave/workspace/Solr-trunk/checkout/solr/build/solr-core/test/J0/org.apache.solr.cloud.RecoveryZkTest-1340887047962/jetty1/index,segFN=segments_3,generation=3,filenames=[_3w_nrm.cfe,
_42.fdt, _3s_nrm.cfs, _42.fdx, _40.fdx, _40.fdt, _3w_nrm.cfs, _43_Lucene40_0.tim, _44_nrm.cfs,
_3s.si, _3t_Lucene40_0.frq, _3w_Lucene40_0.frq, _3v_Lucene40_0.tim, _45.fnm, _43_Lucene40_0.tip,
_43.fnm, _3v.si, _3v_Lucene40_0.tip, _3w.si, _3y_2.del, _40_nrm.cfs, _3x.si, _3y_Lucene40_0.frq,
_45_Lucene40_0.frq, _3z_Lucene40_0.frq, _3z_nrm.cfe, _43_Lucene40_0.prx, _3s_nrm.cfe, _3z.si,
_45_nrm.cfe, _3z_nrm.cfs, _43_nrm.cfs, _3x_Lucene40_0.prx, _3t_nrm.cfe, _3w.fnm, _3w_Lucene40_0.tim,
_42.fnm, _3w_3.del, _42_Lucene40_0.prx, _42_nrm.cfs, _42.si, _3z.fnm, _3w_Lucene40_0.tip,
_3t_1.del, _43_Lucene40_0.frq, _3t_Lucene40_0.prx, _3u.fdt, _3u.fdx, _3t.fnm, _3x.fdx, _3v_Lucene40_0.frq,
_3w.fdt, _3y_nrm.cfe, _3x_nrm.cfe, _3w.fdx, _3t.fdt, _3s_Lucene40_0.frq, _45_Lucene40_0.prx,
_40.fnm, _3t.fdx, _3z.fdt, _43.si, _3t_Lucene40_0.tip, _3u.si, _3z.fdx, _43.fdx, _3t_Lucene40_0.tim,
_3t_nrm.cfs, _3v_Lucene40_0.prx, _3x_nrm.cfs, _3y_nrm.cfs, _3z_2.del, _3x.fdt, _43.fdt, _3x.fnm,
_3s.fdt, _44_Lucene40_0.prx, _3u.fnm, _3v_3.del, _3s_Lucene40_0.tim, _3s_Lucene40_0.tip, _3s.fdx,
_40_Lucene40_0.tip, _3y.si, _3z_Lucene40_0.prx, _3u_2.del, _3s.fnm, _45.fdt, _3u_Lucene40_0.tip,
_45.fdx, _44.fdx, _42_nrm.cfe, _44.fdt, _3u_Lucene40_0.tim, _44_Lucene40_0.tip, _44_Lucene40_0.tim,
_3y_Lucene40_0.prx, _40.si, _44_Lucene40_0.frq, _44.si, _3w_Lucene40_0.prx, _43_nrm.cfe, _3x_Lucene40_0.frq,
_3v.fdt, _3u_Lucene40_0.frq, _3y_Lucene40_0.tim, _40_1.del, _42_2.del, _3u_Lucene40_0.prx,
_3v.fdx, _3y_Lucene40_0.tip, _3y.fdx, _40_nrm.cfe, _3x_3.del, _45_Lucene40_0.tim, _44.fnm,
_45_Lucene40_0.tip, _3x_Lucene40_0.tim, _3x_Lucene40_0.tip, _40_Lucene40_0.prx, _3s_2.del,
_3t.si, _3y.fdt, _3u_nrm.cfs, _3y.fnm, _42_Lucene40_0.frq, _45.si, _42_Lucene40_0.tim, _3s_Lucene40_0.prx,
_3v.fnm, _3v_nrm.cfs, _43_1.del, _42_Lucene40_0.tip, _3v_nrm.cfe, _3u_nrm.cfe, _40_Lucene40_0.frq,
_40_Lucene40_0.tim, _44_nrm.cfe, _45_nrm.cfs, _3z_Lucene40_0.tim, _3z_Lucene40_0.tip, segments_3]
   [junit4]   2> 		commit{dir=/usr/home/hudson/hudson-slave/workspace/Solr-trunk/checkout/solr/build/solr-core/test/J0/org.apache.solr.cloud.RecoveryZkTest-1340887047962/jetty1/index,segFN=segments_4,generation=4,filenames=[_4i.fdt,
_4i.si, _4i_Lucene40_0.tim, _4i_Lucene40_0.tip, _4j_Lucene40_0.frq, _4n.fnm, _4k_Lucene40_0.frq,
_4n_Lucene40_0.tip, _4h.fnm, _4q.si, _4o.fdt, _4o.fdx, _4q_Lucene40_0.prx, _4h_Lucene40_0.frq,
_4i.fdx, _4l_1.del, _4n.si, _4j.fdt, _4m.fdt, _4m.fdx, _4l.fdt, _4n_Lucene40_0.tim, _4q.fnm,
_4k.si, _4m_Lucene40_0.tim, _4j.si, _4k.fdt, _4m_Lucene40_0.tip, _4k.fdx, _4l.fdx, _4q_Lucene40_0.frq,
_4j.fdx, _4k_Lucene40_0.tip, _4n_Lucene40_0.prx, _4g_Lucene40_0.prx, _4g_1.del, _4k_Lucene40_0.tim,
_4q_nrm.cfs, _4n_nrm.cfs, _4o_Lucene40_0.frq, _4q.fdt, _4g.fnm, _4l_Lucene40_0.frq, _4q.fdx,
_4j_nrm.cfs, _4q_Lucene40_0.tim, _4l_nrm.cfs, _4m_nrm.cfe, _4n.fdx, _4q_Lucene40_0.tip, _4n.fdt,
_4k_nrm.cfs, _4h_1.del, _4l.fnm, _4g.si, _4h_Lucene40_0.prx, _4i_2.del, _4m.si, _4j.fnm, _4j_1.del,
_4o.fnm, _4k.fnm, _4i_Lucene40_0.prx, _4g.fdt, _4g.fdx, _4h_Lucene40_0.tip, _4o_nrm.cfs, _4g_Lucene40_0.frq,
_4l.si, _4m_Lucene40_0.frq, _4i_nrm.cfs, _4l_Lucene40_0.prx, _4h_Lucene40_0.tim, _4g_Lucene40_0.tim,
_4m_Lucene40_0.prx, _4o_nrm.cfe, _4g_Lucene40_0.tip, _4i_Lucene40_0.frq, _4i_nrm.cfe, _4n_Lucene40_0.frq,
_4h.si, _4j_Lucene40_0.tim, _4m.fnm, _4o_Lucene40_0.tim, _4k_1.del, _4j_Lucene40_0.tip, _4o_Lucene40_0.tip,
_4g_nrm.cfs, _4l_nrm.cfe, _4o.si, _4h.fdx, _4l_Lucene40_0.tim, _4k_Lucene40_0.prx, _4k_nrm.cfe,
_4h.fdt, _4l_Lucene40_0.tip, _4m_nrm.cfs, _4g_nrm.cfe, _4h_nrm.cfs, _4q_nrm.cfe, _4n_nrm.cfe,
_4h_nrm.cfe, _4o_Lucene40_0.prx, _4j_Lucene40_0.prx, _4j_nrm.cfe, segments_4, _4i.fnm]
   [junit4]   2> 		commit{dir=/usr/home/hudson/hudson-slave/workspace/Solr-trunk/checkout/solr/build/solr-core/test/J0/org.apache.solr.cloud.RecoveryZkTest-1340887047962/jetty1/index,segFN=segments_5,generation=5,filenames=[_4q_nrm.cfs,
_4o_Lucene40_0.frq, _4q.fdt, _4o_nrm.cfe, _4q.fdx, _4p_nrm.cfe, _4q_Lucene40_0.tim, _4p_Lucene40_0.tim,
_4q_Lucene40_0.tip, _4p.fdx, _4q.fnm, _4o_Lucene40_0.tim, _4p.fdt, _4p_Lucene40_0.frq, _4o_Lucene40_0.tip,
_4o.si, _4p_Lucene40_0.tip, _4o.fnm, _4p.si, _4p_1.del, _4p.fnm, _4o_nrm.cfs, _4q.si, _4q_Lucene40_0.frq,
_4o.fdt, _4p_nrm.cfs, _4q_nrm.cfe, _4o.fdx, segments_5, _4o_Lucene40_0.prx, _4q_Lucene40_0.prx,
_4p_Lucene40_0.prx]
   [junit4]   2> 27350 T2847 C165 P22063 oasc.SolrDeletionPolicy.updateCommits newest commit
= 5
   [junit4]   2> 27363 T2852 oazs.PrepRequestProcessor.pRequest Processed session termination
for sessionid: 0x13833189f1f0003
   [junit4]   2> 27364 T2880 oascc.ZkStateReader$3.process Updating live nodes
   [junit4]   2> 27364 T2942 oascc.ZkStateReader$3.process Updating live nodes
   [junit4]   2> 27364 T2896 oascc.ZkStateReader$3.process Updating live nodes
   [junit4]   2> 27364 T2880 oascc.ZkStateReader$3.process WARNING ZooKeeper watch triggered,
but Solr cannot talk to ZK
   [junit4]   2> 27364 T2847 oaz.ZooKeeper.close Session: 0x13833189f1f0003 closed
   [junit4]   2> 27364 T2849 oazs.NIOServerCnxn.closeSock Closed socket connection for
client /140.211.11.196:36694 which had sessionid 0x13833189f1f0003
   [junit4]   2> 27365 T2900 oascc.ZkStateReader$3.process Updating live nodes
   [junit4]   2> 27365 T2880 oaz.ClientCnxn$EventThread.run EventThread shut down
   [junit4]   2> 27366 T2847 oejsh.ContextHandler.doStop stopped o.e.j.s.ServletContextHandler{/solr,null}
   [junit4]   2> 27366 T2942 oasc.RecoveryStrategy.close WARNING Stopping recovery for
core collection1 zkNodeName=127.0.0.1:34080_solr_collection1
   [junit4]   2> 27368 T2942 oascc.SolrZkClient.makePath makePath: /collections/collection1/leaders/shard1
   [junit4]   2> 27370 T2852 oazs.PrepRequestProcessor.pRequest Got user-level KeeperException
when processing sessionid:0x13833189f1f0007 type:create cxid:0x4b zxid:0xfffffffffffffffe
txntype:unknown reqpath:n/a Error Path:/solr/overseer Error:KeeperErrorCode = NodeExists for
/solr/overseer
   [junit4]   2> 27381 T2942 oascc.SolrZkClient.makePath makePath: /overseer_elect/leader
   [junit4]   2> 27383 T2942 oasc.Overseer.<init> Overseer (id=87876373575565319-127.0.0.1:34080_solr-n_0000000004)
starting
   [junit4]   2> 27383 T2852 oazs.PrepRequestProcessor.pRequest Got user-level KeeperException
when processing sessionid:0x13833189f1f0007 type:create cxid:0x52 zxid:0xfffffffffffffffe
txntype:unknown reqpath:n/a Error Path:/solr/overseer Error:KeeperErrorCode = NodeExists for
/solr/overseer
   [junit4]   2> 27391 T2852 oazs.PrepRequestProcessor.pRequest Got user-level KeeperException
when processing sessionid:0x13833189f1f0007 type:create cxid:0x53 zxid:0xfffffffffffffffe
txntype:unknown reqpath:n/a Error Path:/solr/overseer Error:KeeperErrorCode = NodeExists for
/solr/overseer
   [junit4]   2> 27392 T2852 oazs.PrepRequestProcessor.pRequest Got user-level KeeperException
when processing sessionid:0x13833189f1f0007 type:create cxid:0x54 zxid:0xfffffffffffffffe
txntype:unknown reqpath:n/a Error Path:/solr/overseer Error:KeeperErrorCode = NodeExists for
/solr/overseer
   [junit4]   2> 27400 T3010 oasc.Overseer$CloudStateUpdater.run Starting to work on the
main queue
   [junit4]   2> 27401 T3010 oascc.ZkStateReader.updateCloudState Manual update of cluster
state initiated
   [junit4]   2> 27402 T3010 oascc.ZkStateReader.updateCloudState Updating cloud state
from ZooKeeper... 
   [junit4]   2> 27418 T2847 oasc.CoreContainer.shutdown Shutting down CoreContainer instance=1161715355
   [junit4]   2> 27418 T2847 oasc.RecoveryStrategy.close WARNING Stopping recovery for
core collection1 zkNodeName=127.0.0.1:34080_solr_collection1
   [junit4]   2> 27418 T2847 oasc.SolrCore.close [collection1]  CLOSING SolrCore org.apache.solr.core.SolrCore@209ddbcd
   [junit4]   2> 27419 T2942 oascc.ZkStateReader$2.process A cluster state change has occurred
   [junit4]   2> 27419 T2900 oascc.ZkStateReader$2.process A cluster state change has occurred
   [junit4]   2> 27419 T2896 oascc.ZkStateReader$2.process A cluster state change has occurred
   [junit4]   2> 27421 T2847 oasc.SolrCore.closeSearcher [collection1] Closing main searcher
on request.
   [junit4]   2> 27421 T2847 oasu.DirectUpdateHandler2.close closing DirectUpdateHandler2{commits=4,autocommits=0,soft
autocommits=0,optimizes=0,rollbacks=0,expungeDeletes=0,docsPending=0,adds=0,deletesById=0,deletesByQuery=0,errors=0,cumulative_adds=651,cumulative_deletesById=320,cumulative_deletesByQuery=0,cumulative_errors=0}
   [junit4]   2> 27423 T2847 oasc.RecoveryStrategy.close WARNING Stopping recovery for
core collection1 zkNodeName=127.0.0.1:34080_solr_collection1
   [junit4]   2> 27423 T2852 oazs.PrepRequestProcessor.pRequest Processed session termination
for sessionid: 0x13833189f1f0007
   [junit4]   2> 27423 T3010 oasc.Overseer$CloudStateUpdater.run WARNING Overseer cannot
talk to ZK
   [junit4]   2> 27432 T2900 oascc.ZkStateReader$3.process Updating live nodes
   [junit4]   2> 27432 T2896 oascc.ZkStateReader$3.process Updating live nodes
   [junit4]   2> 27432 T2847 oaz.ZooKeeper.close Session: 0x13833189f1f0007 closed
   [junit4]   2> 27432 T2849 oazs.NIOServerCnxn.closeSock Closed socket connection for
client /140.211.11.196:62381 which had sessionid 0x13833189f1f0007
   [junit4]   2> 27432 T2847 oejsh.ContextHandler.doStop stopped o.e.j.s.ServletContextHandler{/solr,null}
   [junit4]   2> 27487 T2852 oazs.PrepRequestProcessor.pRequest Processed session termination
for sessionid: 0x13833189f1f0006
   [junit4]   2> 27488 T2900 oaz.ClientCnxn$EventThread.run EventThread shut down
   [junit4]   2> 27488 T2849 oazs.NIOServerCnxn.closeSock Closed socket connection for
client /140.211.11.196:53493 which had sessionid 0x13833189f1f0006
   [junit4]   2> 27488 T2847 oaz.ZooKeeper.close Session: 0x13833189f1f0006 closed
   [junit4]   2> 27489 T2852 oazs.PrepRequestProcessor.pRequest Processed session termination
for sessionid: 0x13833189f1f0005
   [junit4]   2> 27495 T2849 oazs.NIOServerCnxn.closeSock Closed socket connection for
client /140.211.11.196:12547 which had sessionid 0x13833189f1f0005
   [junit4]   2> 27495 T2896 oaz.ClientCnxn$EventThread.run EventThread shut down
   [junit4]   2> 27495 T2847 oaz.ZooKeeper.close Session: 0x13833189f1f0005 closed
   [junit4]   2> 27496 T2851 oazs.SyncRequestProcessor.run SyncRequestProcessor exited!
   [junit4]   2> 27496 T2852 oazs.PrepRequestProcessor.run PrepRequestProcessor exited
loop!
   [junit4]   2> 27496 T2847 oazs.FinalRequestProcessor.shutdown shutdown of request processor
complete
   [junit4]   2> 27663 T2849 oazs.NIOServerCnxn$Factory.run NIOServerCnxn factory exited
run method
   [junit4]   2> 27664 T2847 oazs.FinalRequestProcessor.shutdown shutdown of request processor
complete
   [junit4]   2> 27687 T2847 oas.SolrTestCaseJ4.tearDown ###Ending testDistribSearch
   [junit4]   2> NOTE: reproduce with: ant test  -Dtestcase=RecoveryZkTest -Dtests.method=testDistribSearch
-Dtests.seed=8ABB7755A967EF5A -Dtests.locale=in_ID -Dtests.timezone=Asia/Almaty -Dargs="-Dfile.encoding=ISO8859-1"
   [junit4]   2> 27732 T2868 oasc.Overseer$CloudStateUpdater.amILeader WARNING  org.apache.zookeeper.KeeperException$SessionExpiredException:
KeeperErrorCode = Session expired for /overseer_elect/leader
   [junit4]   2> 	at org.apache.zookeeper.KeeperException.create(KeeperException.java:118)
   [junit4]   2> 	at org.apache.zookeeper.KeeperException.create(KeeperException.java:42)
   [junit4]   2> 	at org.apache.zookeeper.ZooKeeper.getData(ZooKeeper.java:927)
   [junit4]   2> 	at org.apache.solr.common.cloud.SolrZkClient$7.execute(SolrZkClient.java:289)
   [junit4]   2> 	at org.apache.solr.common.cloud.SolrZkClient$7.execute(SolrZkClient.java:286)
   [junit4]   2> 	at org.apache.solr.common.cloud.ZkCmdExecutor.retryOperation(ZkCmdExecutor.java:65)
   [junit4]   2> 	at org.apache.solr.common.cloud.SolrZkClient.getData(SolrZkClient.java:286)
   [junit4]   2> 	at org.apache.solr.cloud.Overseer$CloudStateUpdater.amILeader(Overseer.java:186)
   [junit4]   2> 	at org.apache.solr.cloud.Overseer$CloudStateUpdater.run(Overseer.java:111)
   [junit4]   2> 	at java.lang.Thread.run(Thread.java:679)
   [junit4]   2> 
   [junit4]   2>
   [junit4]    > (@AfterClass output)
   [junit4]   2> 27740 T2847 oas.SolrTestCaseJ4.deleteCore ###deleteCore
   [junit4]   2> 27740 T2868 oasc.Overseer$CloudStateUpdater.amILeader According to ZK
I (id=87876373575565314-127.0.0.1:59232_solr-n_0000000000) am no longer a leader.
   [junit4]   2> NOTE: test params are: codec=Lucene40: {}, sim=DefaultSimilarity, locale=in_ID,
timezone=Asia/Almaty
   [junit4]   2> NOTE: FreeBSD 9.0-RELEASE amd64/Sun Microsystems Inc. 1.6.0_32 (64-bit)/cpus=16,threads=6,free=72406696,total=358416384
   [junit4]   2> NOTE: All tests run in this JVM: [ConvertedLegacyTest, TestCodecSupport,
UUIDFieldTest, TestDefaultSimilarityFactory, TestDocSet, NoCacheHeaderTest, TestMappingCharFilterFactory,
TestGalicianStemFilterFactory, TestLuceneMatchVersion, TestItalianLightStemFilterFactory,
TestBulgarianStemFilterFactory, TestMergePolicyConfig, ZkControllerTest, LeaderElectionIntegrationTest,
UniqFieldsUpdateProcessorFactoryTest, TestPorterStemFilterFactory, SolrPluginUtilsTest, TestIndonesianStemFilterFactory,
TestFastLRUCache, LukeRequestHandlerTest, TestUAX29URLEmailTokenizerFactory, TestPortugueseLightStemFilterFactory,
CurrencyFieldTest, AlternateDirectoryTest, LeaderElectionTest, TestGreekStemFilterFactory,
XsltUpdateRequestHandlerTest, TestJmxIntegration, TestHashPartitioner, TestSpanishLightStemFilterFactory,
SpellingQueryConverterTest, MoreLikeThisHandlerTest, SolrRequestParserTest, TestCSVResponseWriter,
TestPortugueseMinimalStemFilterFactory, TestRecovery, EchoParamsTest, ResourceLoaderTest,
TestUpdate, CopyFieldTest, TestNGramFilters, AutoCommitTest, TestOmitPositions, SOLR749Test,
TestPersianNormalizationFilterFactory, NotRequiredUniqueKeyTest, DateFieldTest, LengthFilterTest,
TestJapaneseReadingFormFilterFactory, QueryEqualityTest, PeerSyncTest, OpenExchangeRatesOrgProviderTest,
WordBreakSolrSpellCheckerTest, TermsComponentTest, TestSynonymFilterFactory, TestPerFieldSimilarity,
StatsComponentTest, TestLatvianStemFilterFactory, SampleTest, TestStopFilterFactory, TestCapitalizationFilterFactory,
TestQuerySenderNoQuery, ZkNodePropsTest, DirectSolrSpellCheckerTest, TestNorwegianLightStemFilterFactory,
TestJapanesePartOfSpeechStopFilterFactory, TestFoldingMultitermQuery, TestValueSourceCache,
TestJoin, TestPatternTokenizerFactory, CoreAdminHandlerTest, LoggingHandlerTest, LegacyHTMLStripCharFilterTest,
IndexBasedSpellCheckerTest, ReturnFieldsTest, TestMultiWordSynonyms, TestSystemIdResolver,
TestRemoteStreaming, HighlighterTest, TestArabicFilters, RequestHandlersTest, RequiredFieldsTest,
PluginInfoTest, DistributedQueryElevationComponentTest, TestRealTimeGet, SuggesterWFSTTest,
DateMathParserTest, IndexReaderFactoryTest, DebugComponentTest, TestTrie, TestArbitraryIndexDir,
CloudStateUpdateTest, TestSolrDeletionPolicy2, TestKStemFilterFactory, TestSwedishLightStemFilterFactory,
TestDFRSimilarityFactory, TestKeepFilterFactory, TestRemoveDuplicatesTokenFilterFactory, TestFiltering,
SpellPossibilityIteratorTest, MultiTermTest, TestSolrXMLSerializer, DOMUtilTest, CacheHeaderTest,
BasicDistributedZkTest, RAMDirectoryFactoryTest, SearchHandlerTest, TestDelimitedPayloadTokenFilterFactory,
JsonLoaderTest, TestHungarianLightStemFilterFactory, BasicZkTest, TestQueryTypes, TestNumberUtils,
TestIrishLowerCaseFilterFactory, TestReplicationHandler, TestSearchPerf, TestDictionaryCompoundWordTokenFilterFactory,
TestLRUCache, TestBinaryResponseWriter, DirectUpdateHandlerOptimizeTest, TestGreekLowerCaseFilterFactory,
TestCollationField, FieldAnalysisRequestHandlerTest, SpatialFilterTest, TestBadConfig, TestIndexingPerformance,
TestGalicianMinimalStemFilterFactory, CSVRequestHandlerTest, TestIndexSearcher, URLClassifyProcessorTest,
UpdateParamsTest, BadComponentTest, TestLFUCache, SpellCheckComponentTest, TestCJKWidthFilterFactory,
TestJapaneseKatakanaStemFilterFactory, DirectUpdateHandlerTest, TestThaiWordFilterFactory,
QueryElevationComponentTest, TestStandardFactories, TestTurkishLowerCaseFilterFactory, XmlUpdateRequestHandlerTest,
TestPortugueseStemFilterFactory, IndexSchemaRuntimeFieldTest, TestElisionFilterFactory, TestPatternReplaceFilterFactory,
TestReversedWildcardFilterFactory, TestRangeQuery, DocumentAnalysisRequestHandlerTest, TestPhraseSuggestions,
BasicFunctionalityTest, SolrCoreTest, TestCSVLoader, ShowFileRequestHandlerTest, FastVectorHighlighterTest,
TestWikipediaTokenizerFactory, TestTrimFilterFactory, TestJapaneseTokenizerFactory, TestFaceting,
TestSurroundQueryParser, TestUtils, TestKeywordMarkerFilterFactory, DirectSolrConnectionTest,
FieldMutatingUpdateProcessorTest, TestHunspellStemFilterFactory, CommonGramsQueryFilterFactoryTest,
TestRussianLightStemFilterFactory, TestBM25SimilarityFactory, TestLMJelinekMercerSimilarityFactory,
SpellCheckCollatorTest, PolyFieldTest, TestGermanStemFilterFactory, CloudStateTest, TestQueryUtils,
TestReverseStringFilterFactory, TestSolrCoreProperties, SolrCoreCheckLockOnStartupTest, TestNorwegianMinimalStemFilterFactory,
TestSort, UpdateRequestProcessorFactoryTest, TestWordDelimiterFilterFactory, TestHTMLStripCharFilterFactory,
CommonGramsFilterFactoryTest, TestBeiderMorseFilterFactory, TestIBSimilarityFactory, NumericFieldsTest,
TestBinaryField, TestConfig, BadIndexSchemaTest, TestShingleFilterFactory, TestPropInject,
MBeansHandlerTest, TestGroupingSearch, PrimUtilsTest, TestRandomFaceting, DisMaxRequestHandlerTest,
TestEnglishMinimalStemFilterFactory, TestDistributedGrouping, OverseerTest, FullSolrCloudTest,
RecoveryZkTest]
   [junit4]   2> 
   [junit4] Completed in 27.75s, 1 test, 1 error <<< FAILURES!
[...truncated 225 lines...]

[...truncated 44051 lines...]

[...truncated 44051 lines...]

[...truncated 44051 lines...]

[...truncated 44051 lines...]

[...truncated 44051 lines...]



Mime
View raw message