lucene-dev mailing list archives

Site index · List index
Message view « Date » · « Thread »
Top « Date » · « Thread »
From jenk...@sd-datasolutions.de
Subject [JENKINS] Lucene-Solr-trunk-Linux-Java6-64 - Build # 702 - Still Failing!
Date Mon, 04 Jun 2012 21:29:27 GMT
Build: http://jenkins.sd-datasolutions.de/job/Lucene-Solr-trunk-Linux-Java6-64/702/

3 tests failed.
FAILED:  org.apache.solr.handler.component.DistributedSpellCheckComponentTest.testDistribSearch

Error Message:
Server at http://localhost:52075/solr returned non ok status:500, message:Server Error

Stack Trace:
org.apache.solr.common.SolrException: Server at http://localhost:52075/solr returned non ok status:500, message:Server Error
	at __randomizedtesting.SeedInfo.seed([83C376835FB8374D:225F89B28E75771]:0)
	at org.apache.solr.client.solrj.impl.HttpSolrServer.request(HttpSolrServer.java:375)
	at org.apache.solr.client.solrj.impl.HttpSolrServer.request(HttpSolrServer.java:182)
	at org.apache.solr.client.solrj.request.QueryRequest.process(QueryRequest.java:90)
	at org.apache.solr.client.solrj.SolrServer.query(SolrServer.java:323)
	at org.apache.solr.BaseDistributedSearchTestCase.query(BaseDistributedSearchTestCase.java:385)
	at org.apache.solr.handler.component.DistributedSpellCheckComponentTest.doTest(DistributedSpellCheckComponentTest.java:152)
	at org.apache.solr.BaseDistributedSearchTestCase.testDistribSearch(BaseDistributedSearchTestCase.java:686)
	at sun.reflect.NativeMethodAccessorImpl.invoke0(Native Method)
	at sun.reflect.NativeMethodAccessorImpl.invoke(NativeMethodAccessorImpl.java:39)
	at sun.reflect.DelegatingMethodAccessorImpl.invoke(DelegatingMethodAccessorImpl.java:25)
	at java.lang.reflect.Method.invoke(Method.java:597)
	at com.carrotsearch.randomizedtesting.RandomizedRunner.invoke(RandomizedRunner.java:1969)
	at com.carrotsearch.randomizedtesting.RandomizedRunner.access$1100(RandomizedRunner.java:132)
	at com.carrotsearch.randomizedtesting.RandomizedRunner$6.evaluate(RandomizedRunner.java:814)
	at com.carrotsearch.randomizedtesting.RandomizedRunner$7.evaluate(RandomizedRunner.java:875)
	at com.carrotsearch.randomizedtesting.RandomizedRunner$8.evaluate(RandomizedRunner.java:889)
	at com.carrotsearch.randomizedtesting.rules.SystemPropertiesRestoreRule$1.evaluate(SystemPropertiesRestoreRule.java:53)
	at org.apache.lucene.util.TestRuleSetupTeardownChained$1.evaluate(TestRuleSetupTeardownChained.java:50)
	at org.apache.lucene.util.TestRuleFieldCacheSanity$1.evaluate(TestRuleFieldCacheSanity.java:32)
	at org.apache.lucene.util.AbstractBeforeAfterRule$1.evaluate(AbstractBeforeAfterRule.java:45)
	at com.carrotsearch.randomizedtesting.rules.SystemPropertiesInvariantRule$1.evaluate(SystemPropertiesInvariantRule.java:55)
	at org.apache.lucene.util.TestRuleReportUncaughtExceptions$1.evaluate(TestRuleReportUncaughtExceptions.java:68)
	at org.apache.lucene.util.TestRuleThreadAndTestName$1.evaluate(TestRuleThreadAndTestName.java:48)
	at org.apache.lucene.util.TestRuleMarkFailure$1.evaluate(TestRuleMarkFailure.java:48)
	at com.carrotsearch.randomizedtesting.RandomizedRunner.runSingleTest(RandomizedRunner.java:821)
	at com.carrotsearch.randomizedtesting.RandomizedRunner.access$700(RandomizedRunner.java:132)
	at com.carrotsearch.randomizedtesting.RandomizedRunner$3$1.run(RandomizedRunner.java:669)
	at com.carrotsearch.randomizedtesting.RandomizedRunner$3.evaluate(RandomizedRunner.java:695)
	at com.carrotsearch.randomizedtesting.RandomizedRunner$4.evaluate(RandomizedRunner.java:734)
	at com.carrotsearch.randomizedtesting.RandomizedRunner$5.evaluate(RandomizedRunner.java:745)
	at com.carrotsearch.randomizedtesting.rules.SystemPropertiesRestoreRule$1.evaluate(SystemPropertiesRestoreRule.java:53)
	at org.apache.lucene.util.AbstractBeforeAfterRule$1.evaluate(AbstractBeforeAfterRule.java:45)
	at org.apache.lucene.util.TestRuleReportUncaughtExceptions$1.evaluate(TestRuleReportUncaughtExceptions.java:68)
	at org.apache.lucene.util.TestRuleStoreClassName$1.evaluate(TestRuleStoreClassName.java:38)
	at org.apache.lucene.util.TestRuleIcuHack$1.evaluate(TestRuleIcuHack.java:51)
	at com.carrotsearch.randomizedtesting.rules.SystemPropertiesInvariantRule$1.evaluate(SystemPropertiesInvariantRule.java:55)
	at org.apache.lucene.util.TestRuleNoInstanceHooksOverrides$1.evaluate(TestRuleNoInstanceHooksOverrides.java:53)
	at org.apache.lucene.util.TestRuleNoStaticHooksShadowing$1.evaluate(TestRuleNoStaticHooksShadowing.java:52)
	at org.apache.lucene.util.TestRuleAssertionsRequired$1.evaluate(TestRuleAssertionsRequired.java:36)
	at org.apache.lucene.util.TestRuleMarkFailure$1.evaluate(TestRuleMarkFailure.java:48)
	at org.apache.lucene.util.TestRuleIgnoreTestSuites$1.evaluate(TestRuleIgnoreTestSuites.java:56)
	at com.carrotsearch.randomizedtesting.RandomizedRunner.runSuite(RandomizedRunner.java:605)
	at com.carrotsearch.randomizedtesting.RandomizedRunner.access$400(RandomizedRunner.java:132)
	at com.carrotsearch.randomizedtesting.RandomizedRunner$2.run(RandomizedRunner.java:551)


FAILED:  org.apache.solr.spelling.WordBreakSolrSpellCheckerTest.testInConjunction

Error Message:
Exception during query

Stack Trace:
java.lang.RuntimeException: Exception during query
	at __randomizedtesting.SeedInfo.seed([83C376835FB8374D:C677DEC807575131]:0)
	at org.apache.solr.SolrTestCaseJ4.assertQ(SolrTestCaseJ4.java:459)
	at org.apache.solr.SolrTestCaseJ4.assertQ(SolrTestCaseJ4.java:426)
	at org.apache.solr.spelling.WordBreakSolrSpellCheckerTest.testInConjunction(WordBreakSolrSpellCheckerTest.java:126)
	at sun.reflect.NativeMethodAccessorImpl.invoke0(Native Method)
	at sun.reflect.NativeMethodAccessorImpl.invoke(NativeMethodAccessorImpl.java:39)
	at sun.reflect.DelegatingMethodAccessorImpl.invoke(DelegatingMethodAccessorImpl.java:25)
	at java.lang.reflect.Method.invoke(Method.java:597)
	at com.carrotsearch.randomizedtesting.RandomizedRunner.invoke(RandomizedRunner.java:1969)
	at com.carrotsearch.randomizedtesting.RandomizedRunner.access$1100(RandomizedRunner.java:132)
	at com.carrotsearch.randomizedtesting.RandomizedRunner$6.evaluate(RandomizedRunner.java:814)
	at com.carrotsearch.randomizedtesting.RandomizedRunner$7.evaluate(RandomizedRunner.java:875)
	at com.carrotsearch.randomizedtesting.RandomizedRunner$8.evaluate(RandomizedRunner.java:889)
	at com.carrotsearch.randomizedtesting.rules.SystemPropertiesRestoreRule$1.evaluate(SystemPropertiesRestoreRule.java:53)
	at org.apache.lucene.util.TestRuleSetupTeardownChained$1.evaluate(TestRuleSetupTeardownChained.java:50)
	at org.apache.lucene.util.TestRuleFieldCacheSanity$1.evaluate(TestRuleFieldCacheSanity.java:32)
	at org.apache.lucene.util.AbstractBeforeAfterRule$1.evaluate(AbstractBeforeAfterRule.java:45)
	at com.carrotsearch.randomizedtesting.rules.SystemPropertiesInvariantRule$1.evaluate(SystemPropertiesInvariantRule.java:55)
	at org.apache.lucene.util.TestRuleReportUncaughtExceptions$1.evaluate(TestRuleReportUncaughtExceptions.java:68)
	at org.apache.lucene.util.TestRuleThreadAndTestName$1.evaluate(TestRuleThreadAndTestName.java:48)
	at org.apache.lucene.util.TestRuleMarkFailure$1.evaluate(TestRuleMarkFailure.java:48)
	at com.carrotsearch.randomizedtesting.RandomizedRunner.runSingleTest(RandomizedRunner.java:821)
	at com.carrotsearch.randomizedtesting.RandomizedRunner.access$700(RandomizedRunner.java:132)
	at com.carrotsearch.randomizedtesting.RandomizedRunner$3$1.run(RandomizedRunner.java:669)
	at com.carrotsearch.randomizedtesting.RandomizedRunner$3.evaluate(RandomizedRunner.java:695)
	at com.carrotsearch.randomizedtesting.RandomizedRunner$4.evaluate(RandomizedRunner.java:734)
	at com.carrotsearch.randomizedtesting.RandomizedRunner$5.evaluate(RandomizedRunner.java:745)
	at com.carrotsearch.randomizedtesting.rules.SystemPropertiesRestoreRule$1.evaluate(SystemPropertiesRestoreRule.java:53)
	at org.apache.lucene.util.AbstractBeforeAfterRule$1.evaluate(AbstractBeforeAfterRule.java:45)
	at org.apache.lucene.util.TestRuleReportUncaughtExceptions$1.evaluate(TestRuleReportUncaughtExceptions.java:68)
	at org.apache.lucene.util.TestRuleStoreClassName$1.evaluate(TestRuleStoreClassName.java:38)
	at org.apache.lucene.util.TestRuleIcuHack$1.evaluate(TestRuleIcuHack.java:51)
	at com.carrotsearch.randomizedtesting.rules.SystemPropertiesInvariantRule$1.evaluate(SystemPropertiesInvariantRule.java:55)
	at org.apache.lucene.util.TestRuleNoInstanceHooksOverrides$1.evaluate(TestRuleNoInstanceHooksOverrides.java:53)
	at org.apache.lucene.util.TestRuleNoStaticHooksShadowing$1.evaluate(TestRuleNoStaticHooksShadowing.java:52)
	at org.apache.lucene.util.TestRuleAssertionsRequired$1.evaluate(TestRuleAssertionsRequired.java:36)
	at org.apache.lucene.util.TestRuleMarkFailure$1.evaluate(TestRuleMarkFailure.java:48)
	at org.apache.lucene.util.TestRuleIgnoreTestSuites$1.evaluate(TestRuleIgnoreTestSuites.java:56)
	at com.carrotsearch.randomizedtesting.RandomizedRunner.runSuite(RandomizedRunner.java:605)
	at com.carrotsearch.randomizedtesting.RandomizedRunner.access$400(RandomizedRunner.java:132)
	at com.carrotsearch.randomizedtesting.RandomizedRunner$2.run(RandomizedRunner.java:551)
Caused by: java.lang.NullPointerException
	at org.apache.solr.handler.component.SpellCheckComponent.toNamedList(SpellCheckComponent.java:566)
	at org.apache.solr.handler.component.SpellCheckComponent.process(SpellCheckComponent.java:177)
	at org.apache.solr.handler.component.SearchHandler.handleRequestBody(SearchHandler.java:204)
	at org.apache.solr.handler.RequestHandlerBase.handleRequest(RequestHandlerBase.java:129)
	at org.apache.solr.core.SolrCore.execute(SolrCore.java:1555)
	at org.apache.solr.util.TestHarness.query(TestHarness.java:357)
	at org.apache.solr.util.TestHarness.query(TestHarness.java:340)
	at org.apache.solr.SolrTestCaseJ4.assertQ(SolrTestCaseJ4.java:433)
	... 39 more


FAILED:  org.apache.solr.spelling.WordBreakSolrSpellCheckerTest.testCollate

Error Message:
Exception during query

Stack Trace:
java.lang.RuntimeException: Exception during query
	at __randomizedtesting.SeedInfo.seed([83C376835FB8374D:49E22FB7F5400A26]:0)
	at org.apache.solr.SolrTestCaseJ4.assertQ(SolrTestCaseJ4.java:459)
	at org.apache.solr.SolrTestCaseJ4.assertQ(SolrTestCaseJ4.java:426)
	at org.apache.solr.spelling.WordBreakSolrSpellCheckerTest.testCollate(WordBreakSolrSpellCheckerTest.java:181)
	at sun.reflect.NativeMethodAccessorImpl.invoke0(Native Method)
	at sun.reflect.NativeMethodAccessorImpl.invoke(NativeMethodAccessorImpl.java:39)
	at sun.reflect.DelegatingMethodAccessorImpl.invoke(DelegatingMethodAccessorImpl.java:25)
	at java.lang.reflect.Method.invoke(Method.java:597)
	at com.carrotsearch.randomizedtesting.RandomizedRunner.invoke(RandomizedRunner.java:1969)
	at com.carrotsearch.randomizedtesting.RandomizedRunner.access$1100(RandomizedRunner.java:132)
	at com.carrotsearch.randomizedtesting.RandomizedRunner$6.evaluate(RandomizedRunner.java:814)
	at com.carrotsearch.randomizedtesting.RandomizedRunner$7.evaluate(RandomizedRunner.java:875)
	at com.carrotsearch.randomizedtesting.RandomizedRunner$8.evaluate(RandomizedRunner.java:889)
	at com.carrotsearch.randomizedtesting.rules.SystemPropertiesRestoreRule$1.evaluate(SystemPropertiesRestoreRule.java:53)
	at org.apache.lucene.util.TestRuleSetupTeardownChained$1.evaluate(TestRuleSetupTeardownChained.java:50)
	at org.apache.lucene.util.TestRuleFieldCacheSanity$1.evaluate(TestRuleFieldCacheSanity.java:32)
	at org.apache.lucene.util.AbstractBeforeAfterRule$1.evaluate(AbstractBeforeAfterRule.java:45)
	at com.carrotsearch.randomizedtesting.rules.SystemPropertiesInvariantRule$1.evaluate(SystemPropertiesInvariantRule.java:55)
	at org.apache.lucene.util.TestRuleReportUncaughtExceptions$1.evaluate(TestRuleReportUncaughtExceptions.java:68)
	at org.apache.lucene.util.TestRuleThreadAndTestName$1.evaluate(TestRuleThreadAndTestName.java:48)
	at org.apache.lucene.util.TestRuleMarkFailure$1.evaluate(TestRuleMarkFailure.java:48)
	at com.carrotsearch.randomizedtesting.RandomizedRunner.runSingleTest(RandomizedRunner.java:821)
	at com.carrotsearch.randomizedtesting.RandomizedRunner.access$700(RandomizedRunner.java:132)
	at com.carrotsearch.randomizedtesting.RandomizedRunner$3$1.run(RandomizedRunner.java:669)
	at com.carrotsearch.randomizedtesting.RandomizedRunner$3.evaluate(RandomizedRunner.java:695)
	at com.carrotsearch.randomizedtesting.RandomizedRunner$4.evaluate(RandomizedRunner.java:734)
	at com.carrotsearch.randomizedtesting.RandomizedRunner$5.evaluate(RandomizedRunner.java:745)
	at com.carrotsearch.randomizedtesting.rules.SystemPropertiesRestoreRule$1.evaluate(SystemPropertiesRestoreRule.java:53)
	at org.apache.lucene.util.AbstractBeforeAfterRule$1.evaluate(AbstractBeforeAfterRule.java:45)
	at org.apache.lucene.util.TestRuleReportUncaughtExceptions$1.evaluate(TestRuleReportUncaughtExceptions.java:68)
	at org.apache.lucene.util.TestRuleStoreClassName$1.evaluate(TestRuleStoreClassName.java:38)
	at org.apache.lucene.util.TestRuleIcuHack$1.evaluate(TestRuleIcuHack.java:51)
	at com.carrotsearch.randomizedtesting.rules.SystemPropertiesInvariantRule$1.evaluate(SystemPropertiesInvariantRule.java:55)
	at org.apache.lucene.util.TestRuleNoInstanceHooksOverrides$1.evaluate(TestRuleNoInstanceHooksOverrides.java:53)
	at org.apache.lucene.util.TestRuleNoStaticHooksShadowing$1.evaluate(TestRuleNoStaticHooksShadowing.java:52)
	at org.apache.lucene.util.TestRuleAssertionsRequired$1.evaluate(TestRuleAssertionsRequired.java:36)
	at org.apache.lucene.util.TestRuleMarkFailure$1.evaluate(TestRuleMarkFailure.java:48)
	at org.apache.lucene.util.TestRuleIgnoreTestSuites$1.evaluate(TestRuleIgnoreTestSuites.java:56)
	at com.carrotsearch.randomizedtesting.RandomizedRunner.runSuite(RandomizedRunner.java:605)
	at com.carrotsearch.randomizedtesting.RandomizedRunner.access$400(RandomizedRunner.java:132)
	at com.carrotsearch.randomizedtesting.RandomizedRunner$2.run(RandomizedRunner.java:551)
Caused by: java.lang.NullPointerException
	at org.apache.solr.handler.component.SpellCheckComponent.toNamedList(SpellCheckComponent.java:566)
	at org.apache.solr.handler.component.SpellCheckComponent.process(SpellCheckComponent.java:177)
	at org.apache.solr.handler.component.SearchHandler.handleRequestBody(SearchHandler.java:204)
	at org.apache.solr.handler.RequestHandlerBase.handleRequest(RequestHandlerBase.java:129)
	at org.apache.solr.core.SolrCore.execute(SolrCore.java:1555)
	at org.apache.solr.util.TestHarness.query(TestHarness.java:357)
	at org.apache.solr.util.TestHarness.query(TestHarness.java:340)
	at org.apache.solr.SolrTestCaseJ4.assertQ(SolrTestCaseJ4.java:433)
	... 39 more




Build Log:
[...truncated 10303 lines...]
   [junit4]   2> 1602 T1992 C94 oashc.SpellCheckComponent.finishStage localhost:51542/solr {suggestions={quock={numFound=2,startOffset=12,endOffset=17,origFreq=0,suggestion=[{word=quick,freq=1}, {word=quote,freq=12}]},reb={numFound=1,startOffset=19,endOffset=22,origFreq=0,suggestion=[{word=red,freq=13}]},correctlySpelled=false,collation=lowerfilt:(+quick +red),collationInternalRank=0,collation=lowerfilt:(+quote +red),collationInternalRank=1}}
   [junit4]   2> 1602 T1992 C94 REQ [collection1] webapp=/solr path=/select params={spellcheck=true&shards.qt=spellCheckCompRH_Direct&spellcheck.extendedResults=true&spellcheck.collateExtendedResults=false&spellcheck.maxCollationTries=10&spellcheck.maxCollations=10&spellcheck.collate=true&wt=javabin&version=2&fl=id,lowerfilt&shards=localhost:51542/solr&q=lowerfilt:(%2Bquock+%2Breb)&spellcheck.count=10&qt=spellCheckCompRH_Direct} status=0 QTime=7 
   [junit4]   2> 1608 T1982 C93 REQ [collection1] webapp=/solr path=/select params={spellcheck=true&shards.qt=spellCheckCompRH_Direct&spellcheck.extendedResults=true&spellcheck.collateExtendedResults=false&spellcheck.maxCollationTries=0&spellcheck.maxCollations=1&distrib=false&spellcheck.collate=true&wt=javabin&version=2&fl=id,lowerfilt&q=lowerfilt:(%2Bquock+%2Breb)&spellcheck.count=10&qt=spellCheckCompRH_Direct} hits=0 status=0 QTime=4 
   [junit4]   2> 1616 T1993 C94 REQ [collection1] webapp=/solr path=/select params={spellcheck=true&shards.qt=spellCheckCompRH_Direct&spellcheck.maxCollationTries=0&distrib=false&version=2&fl=id,score&shard.url=localhost:51542/solr&NOW=1338845268500&spellcheck.count=10&qt=spellCheckCompRH_Direct&fsv=true&spellcheck.extendedResults=true&spellcheck.collateExtendedResults=false&spellcheck.maxCollations=1&spellcheck.collate=true&wt=javabin&spellcheck.onlyMorePopular=false&rows=10&start=0&q=lowerfilt:(%2Bquock+%2Breb)&spellcheck.dictionary=direct&isShard=true} hits=0 status=0 QTime=4 
   [junit4]   2> 1616 T1992 C94 oashc.SpellCheckComponent.finishStage localhost:51542/solr {suggestions={quock={numFound=2,startOffset=12,endOffset=17,origFreq=0,suggestion=[{word=quick,freq=1}, {word=quote,freq=12}]},reb={numFound=1,startOffset=19,endOffset=22,origFreq=0,suggestion=[{word=red,freq=13}]},correctlySpelled=false,collation=lowerfilt:(+quick +red)}}
   [junit4]   2> 1616 T1992 C94 REQ [collection1] webapp=/solr path=/select params={spellcheck=true&shards.qt=spellCheckCompRH_Direct&spellcheck.extendedResults=true&spellcheck.collateExtendedResults=false&spellcheck.maxCollationTries=0&spellcheck.maxCollations=1&spellcheck.collate=true&wt=javabin&version=2&fl=id,lowerfilt&shards=localhost:51542/solr&q=lowerfilt:(%2Bquock+%2Breb)&spellcheck.count=10&qt=spellCheckCompRH_Direct} status=0 QTime=6 
   [junit4]   2> 1619 T1982 C93 REQ [collection1] webapp=/solr path=/select params={spellcheck=true&spellcheck.maxResultsForSuggest=10&shards.qt=spellCheckCompRH&spellcheck.extendedResults=true&spellcheck.collateExtendedResults=true&spellcheck.maxCollationTries=10&spellcheck.maxCollations=1&distrib=false&spellcheck.collate=true&wt=javabin&version=2&fl=id,lowerfilt&q=lowerfilt:("quote+red+fox")&spellcheck.count=10&qt=spellCheckCompRH&spellcheck.alternativeTermCount=5} hits=12 status=0 QTime=1 
   [junit4]   2> 1623 T1993 C94 REQ [collection1] webapp=/solr path=/select params={spellcheck=true&shards.qt=spellCheckCompRH&spellcheck.maxCollationTries=10&distrib=false&version=2&fl=id,score&shard.url=localhost:51542/solr&NOW=1338845268511&spellcheck.count=10&qt=spellCheckCompRH&fsv=true&spellcheck.alternativeTermCount=5&spellcheck.maxResultsForSuggest=10&spellcheck.extendedResults=true&spellcheck.collateExtendedResults=true&spellcheck.maxCollations=1&spellcheck.collate=true&wt=javabin&spellcheck.onlyMorePopular=false&rows=10&start=0&q=lowerfilt:("quote+red+fox")&isShard=true} hits=12 status=0 QTime=1 
   [junit4]   2> 1625 T1993 C94 REQ [collection1] webapp=/solr path=/select params={spellcheck=false&spellcheck.maxResultsForSuggest=10&spellcheck.extendedResults=true&shards.qt=spellCheckCompRH&spellcheck.collateExtendedResults=true&spellcheck.maxCollationTries=10&spellcheck.maxCollations=1&ids=21,20,19,17,22,18,15,16,13,14&distrib=false&spellcheck.collate=true&wt=javabin&spellcheck.onlyMorePopular=false&version=2&fl=id,lowerfilt&shard.url=localhost:51542/solr&NOW=1338845268511&q=lowerfilt:("quote+red+fox")&spellcheck.count=10&qt=spellCheckCompRH&isShard=true&spellcheck.alternativeTermCount=5} status=0 QTime=0 
   [junit4]   2> 1626 T1992 C94 REQ [collection1] webapp=/solr path=/select params={spellcheck=true&spellcheck.maxResultsForSuggest=10&shards.qt=spellCheckCompRH&spellcheck.extendedResults=true&spellcheck.collateExtendedResults=true&spellcheck.maxCollationTries=10&spellcheck.maxCollations=1&spellcheck.collate=true&wt=javabin&version=2&fl=id,lowerfilt&shards=localhost:51542/solr&q=lowerfilt:("quote+red+fox")&spellcheck.count=10&qt=spellCheckCompRH&spellcheck.alternativeTermCount=5} status=0 QTime=5 
   [junit4]   2> 1631 T1982 C93 REQ [collection1] webapp=/solr path=/select params={spellcheck=true&spellcheck.maxResultsForSuggest=10&shards.qt=spellCheckCompRH&spellcheck.extendedResults=true&spellcheck.collateExtendedResults=true&spellcheck.maxCollationTries=10&spellcheck.maxCollations=1&distrib=false&spellcheck.collate=true&wt=javabin&version=2&fl=id,lowerfilt&q=lowerfilt:("rod+fix")&spellcheck.count=10&qt=spellCheckCompRH&spellcheck.alternativeTermCount=5} hits=1 status=0 QTime=4 
   [junit4]   2> 1637 T1993 C94 REQ [collection1] webapp=/solr path=/select params={spellcheck=true&shards.qt=spellCheckCompRH&spellcheck.maxCollationTries=10&distrib=false&version=2&fl=id,score&shard.url=localhost:51542/solr&NOW=1338845268523&spellcheck.count=10&qt=spellCheckCompRH&fsv=true&spellcheck.alternativeTermCount=5&spellcheck.maxResultsForSuggest=10&spellcheck.extendedResults=true&spellcheck.collateExtendedResults=true&spellcheck.maxCollations=1&spellcheck.collate=true&wt=javabin&spellcheck.onlyMorePopular=false&rows=10&start=0&q=lowerfilt:("rod+fix")&isShard=true} hits=1 status=0 QTime=2 
   [junit4]   2> 1639 T1993 C94 REQ [collection1] webapp=/solr path=/select params={spellcheck=false&spellcheck.maxResultsForSuggest=10&spellcheck.extendedResults=true&shards.qt=spellCheckCompRH&spellcheck.collateExtendedResults=true&spellcheck.maxCollationTries=10&spellcheck.maxCollations=1&ids=25&distrib=false&spellcheck.collate=true&wt=javabin&spellcheck.onlyMorePopular=false&version=2&fl=id,lowerfilt&shard.url=localhost:51542/solr&NOW=1338845268523&q=lowerfilt:("rod+fix")&spellcheck.count=10&qt=spellCheckCompRH&isShard=true&spellcheck.alternativeTermCount=5} status=0 QTime=0 
   [junit4]   2> 1640 T1992 C94 oashc.SpellCheckComponent.finishStage localhost:51542/solr {suggestions={rod={numFound=2,startOffset=12,endOffset=15,origFreq=1,suggestion=[{word=red,freq=13}, {word=ford,freq=1}]},fix={numFound=1,startOffset=16,endOffset=19,origFreq=1,suggestion=[{word=fox,freq=13}]},correctlySpelled=false,collation={collationQuery=lowerfilt:("red fox"),hits=13,misspellingsAndCorrections={rod=red,fix=fox},collationInternalRank=2}}}
   [junit4]   2> 1640 T1992 C94 oashc.SpellCheckComponent.finishStage localhost:51542/solr null
   [junit4]   2> 1640 T1992 C94 REQ [collection1] webapp=/solr path=/select params={spellcheck=true&spellcheck.maxResultsForSuggest=10&shards.qt=spellCheckCompRH&spellcheck.extendedResults=true&spellcheck.collateExtendedResults=true&spellcheck.maxCollationTries=10&spellcheck.maxCollations=1&spellcheck.collate=true&wt=javabin&version=2&fl=id,lowerfilt&shards=localhost:51542/solr&q=lowerfilt:("rod+fix")&spellcheck.count=10&qt=spellCheckCompRH&spellcheck.alternativeTermCount=5} status=0 QTime=7 
   [junit4]   2> 1654 T1982 C93 oasc.SolrException.log SEVERE java.lang.NullPointerException
   [junit4]   2> 		at org.apache.solr.handler.component.SpellCheckComponent.toNamedList(SpellCheckComponent.java:566)
   [junit4]   2> 		at org.apache.solr.handler.component.SpellCheckComponent.process(SpellCheckComponent.java:177)
   [junit4]   2> 		at org.apache.solr.handler.component.SearchHandler.handleRequestBody(SearchHandler.java:204)
   [junit4]   2> 		at org.apache.solr.handler.RequestHandlerBase.handleRequest(RequestHandlerBase.java:129)
   [junit4]   2> 		at org.apache.solr.core.SolrCore.execute(SolrCore.java:1555)
   [junit4]   2> 		at org.apache.solr.servlet.SolrDispatchFilter.execute(SolrDispatchFilter.java:442)
   [junit4]   2> 		at org.apache.solr.servlet.SolrDispatchFilter.doFilter(SolrDispatchFilter.java:263)
   [junit4]   2> 		at org.eclipse.jetty.servlet.ServletHandler$CachedChain.doFilter(ServletHandler.java:1337)
   [junit4]   2> 		at org.eclipse.jetty.servlet.ServletHandler.doHandle(ServletHandler.java:484)
   [junit4]   2> 		at org.eclipse.jetty.server.session.SessionHandler.doHandle(SessionHandler.java:231)
   [junit4]   2> 		at org.eclipse.jetty.server.handler.ScopedHandler.handle(ScopedHandler.java:119)
   [junit4]   2> 		at org.eclipse.jetty.server.handler.GzipHandler.handle(GzipHandler.java:267)
   [junit4]   2> 		at org.eclipse.jetty.server.handler.ContextHandler.doHandle(ContextHandler.java:1067)
   [junit4]   2> 		at org.eclipse.jetty.servlet.ServletHandler.doScope(ServletHandler.java:413)
   [junit4]   2> 		at org.eclipse.jetty.server.session.SessionHandler.doScope(SessionHandler.java:192)
   [junit4]   2> 		at org.eclipse.jetty.server.handler.ContextHandler.doScope(ContextHandler.java:999)
   [junit4]   2> 		at org.eclipse.jetty.server.handler.ScopedHandler.handle(ScopedHandler.java:117)
   [junit4]   2> 		at org.eclipse.jetty.server.handler.HandlerWrapper.handle(HandlerWrapper.java:111)
   [junit4]   2> 		at org.eclipse.jetty.server.Server.handle(Server.java:351)
   [junit4]   2> 		at org.eclipse.jetty.server.AbstractHttpConnection.handleRequest(AbstractHttpConnection.java:454)
   [junit4]   2> 		at org.eclipse.jetty.server.BlockingHttpConnection.handleRequest(BlockingHttpConnection.java:47)
   [junit4]   2> 		at org.eclipse.jetty.server.AbstractHttpConnection.headerComplete(AbstractHttpConnection.java:890)
   [junit4]   2> 		at org.eclipse.jetty.server.AbstractHttpConnection$RequestHandler.headerComplete(AbstractHttpConnection.java:944)
   [junit4]   2> 		at org.eclipse.jetty.http.HttpParser.parseNext(HttpParser.java:634)
   [junit4]   2> 		at org.eclipse.jetty.http.HttpParser.parseAvailable(HttpParser.java:230)
   [junit4]   2> 		at org.eclipse.jetty.server.BlockingHttpConnection.handle(BlockingHttpConnection.java:66)
   [junit4]   2> 		at org.eclipse.jetty.server.bio.SocketConnector$ConnectorEndPoint.run(SocketConnector.java:254)
   [junit4]   2> 		at org.eclipse.jetty.util.thread.QueuedThreadPool.runJob(QueuedThreadPool.java:599)
   [junit4]   2> 		at org.eclipse.jetty.util.thread.QueuedThreadPool$3.run(QueuedThreadPool.java:534)
   [junit4]   2> 		at java.lang.Thread.run(Thread.java:662)
   [junit4]   2> 	
   [junit4]   2> 1654 T1982 C93 REQ [collection1] webapp=/solr path=/select params={spellcheck=true&shards.qt=spellCheckWithWordbreak_Direct&spellcheck.extendedResults=true&spellcheck.collateExtendedResults=true&spellcheck.maxCollationTries=0&spellcheck.maxCollations=1&distrib=false&spellcheck.collate=true&wt=javabin&version=2&fl=id,lowerfilt&q=lowerfilt:(%2Bquock+%2Bredfox+%2Bjum+%2Bped)&spellcheck.count=10&qt=spellCheckWithWordbreak_Direct} hits=0 status=500 QTime=12 
   [junit4]   2> 1655 T1982 C93 oasc.SolrException.log SEVERE null:java.lang.NullPointerException
   [junit4]   2> 		at org.apache.solr.handler.component.SpellCheckComponent.toNamedList(SpellCheckComponent.java:566)
   [junit4]   2> 		at org.apache.solr.handler.component.SpellCheckComponent.process(SpellCheckComponent.java:177)
   [junit4]   2> 		at org.apache.solr.handler.component.SearchHandler.handleRequestBody(SearchHandler.java:204)
   [junit4]   2> 		at org.apache.solr.handler.RequestHandlerBase.handleRequest(RequestHandlerBase.java:129)
   [junit4]   2> 		at org.apache.solr.core.SolrCore.execute(SolrCore.java:1555)
   [junit4]   2> 		at org.apache.solr.servlet.SolrDispatchFilter.execute(SolrDispatchFilter.java:442)
   [junit4]   2> 		at org.apache.solr.servlet.SolrDispatchFilter.doFilter(SolrDispatchFilter.java:263)
   [junit4]   2> 		at org.eclipse.jetty.servlet.ServletHandler$CachedChain.doFilter(ServletHandler.java:1337)
   [junit4]   2> 		at org.eclipse.jetty.servlet.ServletHandler.doHandle(ServletHandler.java:484)
   [junit4]   2> 		at org.eclipse.jetty.server.session.SessionHandler.doHandle(SessionHandler.java:231)
   [junit4]   2> 		at org.eclipse.jetty.server.handler.ScopedHandler.handle(ScopedHandler.java:119)
   [junit4]   2> 		at org.eclipse.jetty.server.handler.GzipHandler.handle(GzipHandler.java:267)
   [junit4]   2> 		at org.eclipse.jetty.server.handler.ContextHandler.doHandle(ContextHandler.java:1067)
   [junit4]   2> 		at org.eclipse.jetty.servlet.ServletHandler.doScope(ServletHandler.java:413)
   [junit4]   2> 		at org.eclipse.jetty.server.session.SessionHandler.doScope(SessionHandler.java:192)
   [junit4]   2> 		at org.eclipse.jetty.server.handler.ContextHandler.doScope(ContextHandler.java:999)
   [junit4]   2> 		at org.eclipse.jetty.server.handler.ScopedHandler.handle(ScopedHandler.java:117)
   [junit4]   2> 		at org.eclipse.jetty.server.handler.HandlerWrapper.handle(HandlerWrapper.java:111)
   [junit4]   2> 		at org.eclipse.jetty.server.Server.handle(Server.java:351)
   [junit4]   2> 		at org.eclipse.jetty.server.AbstractHttpConnection.handleRequest(AbstractHttpConnection.java:454)
   [junit4]   2> 		at org.eclipse.jetty.server.BlockingHttpConnection.handleRequest(BlockingHttpConnection.java:47)
   [junit4]   2> 		at org.eclipse.jetty.server.AbstractHttpConnection.headerComplete(AbstractHttpConnection.java:890)
   [junit4]   2> 		at org.eclipse.jetty.server.AbstractHttpConnection$RequestHandler.headerComplete(AbstractHttpConnection.java:944)
   [junit4]   2> 		at org.eclipse.jetty.http.HttpParser.parseNext(HttpParser.java:634)
   [junit4]   2> 		at org.eclipse.jetty.http.HttpParser.parseAvailable(HttpParser.java:230)
   [junit4]   2> 		at org.eclipse.jetty.server.BlockingHttpConnection.handle(BlockingHttpConnection.java:66)
   [junit4]   2> 		at org.eclipse.jetty.server.bio.SocketConnector$ConnectorEndPoint.run(SocketConnector.java:254)
   [junit4]   2> 		at org.eclipse.jetty.util.thread.QueuedThreadPool.runJob(QueuedThreadPool.java:599)
   [junit4]   2> 		at org.eclipse.jetty.util.thread.QueuedThreadPool$3.run(QueuedThreadPool.java:534)
   [junit4]   2> 		at java.lang.Thread.run(Thread.java:662)
   [junit4]   2> 	
   [junit4]   2> 1656 T1979 oasc.CoreContainer.shutdown Shutting down CoreContainer instance=331772484
   [junit4]   2> 1657 T1979 oasc.SolrCore.close [collection1]  CLOSING SolrCore org.apache.solr.core.SolrCore@6d7ea9ca
   [junit4]   2> 1658 T1979 oasc.SolrCore.closeSearcher [collection1] Closing main searcher on request.
   [junit4]   2> 1659 T1979 oasu.DirectUpdateHandler2.close closing DirectUpdateHandler2{commits=1,autocommits=0,soft autocommits=0,optimizes=0,rollbacks=0,expungeDeletes=0,docsPending=0,adds=0,deletesById=0,deletesByQuery=0,errors=0,cumulative_adds=24,cumulative_deletesById=0,cumulative_deletesByQuery=1,cumulative_errors=0}
   [junit4]   2> 1661 T1979 oejsh.ContextHandler.doStop stopped o.e.j.s.ServletContextHandler{/solr,null}
   [junit4]   2> 1713 T1979 oasc.CoreContainer.shutdown Shutting down CoreContainer instance=1404089919
   [junit4]   2> 1714 T1979 oasc.SolrCore.close [collection1]  CLOSING SolrCore org.apache.solr.core.SolrCore@190d2a6a
   [junit4]   2> 1717 T1979 oasc.SolrCore.closeSearcher [collection1] Closing main searcher on request.
   [junit4]   2> 1718 T1979 oasu.DirectUpdateHandler2.close closing DirectUpdateHandler2{commits=1,autocommits=0,soft autocommits=0,optimizes=0,rollbacks=0,expungeDeletes=0,docsPending=0,adds=0,deletesById=0,deletesByQuery=0,errors=0,cumulative_adds=24,cumulative_deletesById=0,cumulative_deletesByQuery=1,cumulative_errors=0}
   [junit4]   2> 1720 T1979 oejsh.ContextHandler.doStop stopped o.e.j.s.ServletContextHandler{/solr,null}
   [junit4]   2> 1779 T1979 oas.SolrTestCaseJ4.tearDown ###Ending testDistribSearch
   [junit4]   2> NOTE: reproduce with: ant test  -Dtestcase=DistributedSpellCheckComponentTest -Dtests.method=testDistribSearch -Dtests.seed=83C376835FB8374D -Dtests.multiplier=3 -Dtests.locale=hu -Dtests.timezone=America/Chicago -Dargs="-Dfile.encoding=UTF-8"
   [junit4]   2>
   [junit4]    > (@AfterClass output)
   [junit4]   2> 1809 T1979 oas.SolrTestCaseJ4.deleteCore ###deleteCore
   [junit4]   2> NOTE: test params are: codec=Lucene40: {end4=MockFixedIntBlock(blockSize=759), end3=Pulsing40(freqCutoff=13 minBlockSize=41 maxBlockSize=123), end2=PostingsFormat(name=Lucene40WithOrds), start1=PostingsFormat(name=Memory doPackFST= true), end1=PostingsFormat(name=MockSep), start4=PostingsFormat(name=NestedPulsing), start2=Lucene40(minBlockSize=41 maxBlockSize=123), start3=PostingsFormat(name=MockRandom), gram2=PostingsFormat(name=Memory doPackFST= true), word=PostingsFormat(name=SimpleText), gram1=PostingsFormat(name=MockSep), gram4=PostingsFormat(name=MockRandom), gram3=PostingsFormat(name=NestedPulsing)}, sim=DefaultSimilarity, locale=hu, timezone=America/Chicago
   [junit4]   2> NOTE: Linux 2.6.32-41-server amd64/Sun Microsystems Inc. 1.6.0_32 (64-bit)/cpus=8,threads=1,free=195278304,total=271515648
   [junit4]   2> NOTE: All tests run in this JVM: [IndexReaderFactoryTest, TestJapaneseTokenizerFactory, TestThaiWordFilterFactory, TestBulgarianStemFilterFactory, ResourceLoaderTest, TestUpdate, IndexBasedSpellCheckerTest, TestElisionFilterFactory, OutputWriterTest, SolrInfoMBeanTest, NumericFieldsTest, TestRealTimeGet, TestGreekLowerCaseFilterFactory, TestCJKBigramFilterFactory, QueryElevationComponentTest, DirectSolrSpellCheckerTest, AlternateDirectoryTest, MoreLikeThisHandlerTest, TestFiltering, CurrencyFieldTest, BadComponentTest, TestPatternReplaceFilterFactory, TestCollationField, AutoCommitTest, CommonGramsQueryFilterFactoryTest, TestSolrQueryParser, DebugComponentTest, URLClassifyProcessorTest, TestIBSimilarityFactory, TestFaceting, TestSolrDeletionPolicy2, SolrPluginUtilsTest, SolrRequestParserTest, RecoveryZkTest, SuggesterTest, TestFinnishLightStemFilterFactory, TestSolrCoreProperties, UUIDFieldTest, SimpleFacetsTest, TestConfig, TestQueryUtils, TestXIncludeConfig, TestGalicianStemFilterFactory, TestBadConfig, TestSearchPerf, QueryParsingTest, TestPortugueseLightStemFilterFactory, TestPerFieldSimilarity, TestNorwegianMinimalStemFilterFactory, TestPortugueseStemFilterFactory, TestGermanMinimalStemFilterFactory, TestJmxIntegration, SolrIndexConfigTest, RequiredFieldsTest, EchoParamsTest, TestPluginEnable, TestJapaneseBaseFormFilterFactory, TestRecovery, TestFrenchLightStemFilterFactory, TestCzechStemFilterFactory, DocumentAnalysisRequestHandlerTest, TestLuceneMatchVersion, ReturnFieldsTest, ZkNodePropsTest, CopyFieldTest, TestSolrXMLSerializer, SearchHandlerTest, IndexSchemaTest, TestDistributedGrouping, TestTrimFilterFactory, TestWikipediaTokenizerFactory, RAMDirectoryFactoryTest, OverseerTest, TestSystemIdResolver, TestQueryTypes, TestHashPartitioner, FileBasedSpellCheckerTest, DistributedQueryElevationComponentTest, TestNGramFilters, TestValueSourceCache, TestPatternTokenizerFactory, SpellPossibilityIteratorTest, TestIndexingPerformance, TestLFUCache, NodeStateWatcherTest, TestRangeQuery, TestCapitalizationFilterFactory, TestReplicationHandler, TestGermanLightStemFilterFactory, SpellCheckCollatorTest, TestTypeTokenFilterFactory, FileUtilsTest, TestGalicianMinimalStemFilterFactory, ZkSolrClientTest, TestLRUCache, XsltUpdateRequestHandlerTest, TestSurroundQueryParser, CacheHeaderTest, PingRequestHandlerTest, DistributedSpellCheckComponentTest]
   [junit4]   2> 
   [junit4] Completed on J1 in 1.82s, 1 test, 1 error <<< FAILURES!
[...truncated 610 lines...]
   [junit4]   2> 		at sun.reflect.NativeMethodAccessorImpl.invoke(NativeMethodAccessorImpl.java:39)
   [junit4]   2> 		at sun.reflect.DelegatingMethodAccessorImpl.invoke(DelegatingMethodAccessorImpl.java:25)
   [junit4]   2> 		at java.lang.reflect.Method.invoke(Method.java:597)
   [junit4]   2> 		at com.carrotsearch.randomizedtesting.RandomizedRunner.invoke(RandomizedRunner.java:1969)
   [junit4]   2> 		at com.carrotsearch.randomizedtesting.RandomizedRunner.access$1100(RandomizedRunner.java:132)
   [junit4]   2> 		at com.carrotsearch.randomizedtesting.RandomizedRunner$6.evaluate(RandomizedRunner.java:814)
   [junit4]   2> 		at com.carrotsearch.randomizedtesting.RandomizedRunner$7.evaluate(RandomizedRunner.java:875)
   [junit4]   2> 		at com.carrotsearch.randomizedtesting.RandomizedRunner$8.evaluate(RandomizedRunner.java:889)
   [junit4]   2> 		at com.carrotsearch.randomizedtesting.rules.SystemPropertiesRestoreRule$1.evaluate(SystemPropertiesRestoreRule.java:53)
   [junit4]   2> 		at org.apache.lucene.util.TestRuleSetupTeardownChained$1.evaluate(TestRuleSetupTeardownChained.java:50)
   [junit4]   2> 		at org.apache.lucene.util.TestRuleFieldCacheSanity$1.evaluate(TestRuleFieldCacheSanity.java:32)
   [junit4]   2> 		at org.apache.lucene.util.AbstractBeforeAfterRule$1.evaluate(AbstractBeforeAfterRule.java:45)
   [junit4]   2> 		at com.carrotsearch.randomizedtesting.rules.SystemPropertiesInvariantRule$1.evaluate(SystemPropertiesInvariantRule.java:55)
   [junit4]   2> 		at org.apache.lucene.util.TestRuleReportUncaughtExceptions$1.evaluate(TestRuleReportUncaughtExceptions.java:68)
   [junit4]   2> 		at org.apache.lucene.util.TestRuleThreadAndTestName$1.evaluate(TestRuleThreadAndTestName.java:48)
   [junit4]   2> 		at org.apache.lucene.util.TestRuleMarkFailure$1.evaluate(TestRuleMarkFailure.java:48)
   [junit4]   2> 		at com.carrotsearch.randomizedtesting.RandomizedRunner.runSingleTest(RandomizedRunner.java:821)
   [junit4]   2> 		at com.carrotsearch.randomizedtesting.RandomizedRunner.access$700(RandomizedRunner.java:132)
   [junit4]   2> 		at com.carrotsearch.randomizedtesting.RandomizedRunner$3$1.run(RandomizedRunner.java:669)
   [junit4]   2> 		at com.carrotsearch.randomizedtesting.RandomizedRunner$3.evaluate(RandomizedRunner.java:695)
   [junit4]   2> 		at com.carrotsearch.randomizedtesting.RandomizedRunner$4.evaluate(RandomizedRunner.java:734)
   [junit4]   2> 		at com.carrotsearch.randomizedtesting.RandomizedRunner$5.evaluate(RandomizedRunner.java:745)
   [junit4]   2> 		at com.carrotsearch.randomizedtesting.rules.SystemPropertiesRestoreRule$1.evaluate(SystemPropertiesRestoreRule.java:53)
   [junit4]   2> 		at org.apache.lucene.util.AbstractBeforeAfterRule$1.evaluate(AbstractBeforeAfterRule.java:45)
   [junit4]   2> 		at org.apache.lucene.util.TestRuleReportUncaughtExceptions$1.evaluate(TestRuleReportUncaughtExceptions.java:68)
   [junit4]   2> 		at org.apache.lucene.util.TestRuleStoreClassName$1.evaluate(TestRuleStoreClassName.java:38)
   [junit4]   2> 		at org.apache.lucene.util.TestRuleIcuHack$1.evaluate(TestRuleIcuHack.java:51)
   [junit4]   2> 		at com.carrotsearch.randomizedtesting.rules.SystemPropertiesInvariantRule$1.evaluate(SystemPropertiesInvariantRule.java:55)
   [junit4]   2> 		at org.apache.lucene.util.TestRuleNoInstanceHooksOverrides$1.evaluate(TestRuleNoInstanceHooksOverrides.java:53)
   [junit4]   2> 		at org.apache.lucene.util.TestRuleNoStaticHooksShadowing$1.evaluate(TestRuleNoStaticHooksShadowing.java:52)
   [junit4]   2> 		at org.apache.lucene.util.TestRuleAssertionsRequired$1.evaluate(TestRuleAssertionsRequired.java:36)
   [junit4]   2> 		at org.apache.lucene.util.TestRuleMarkFailure$1.evaluate(TestRuleMarkFailure.java:48)
   [junit4]   2> 		at org.apache.lucene.util.TestRuleIgnoreTestSuites$1.evaluate(TestRuleIgnoreTestSuites.java:56)
   [junit4]   2> 		at com.carrotsearch.randomizedtesting.RandomizedRunner.runSuite(RandomizedRunner.java:605)
   [junit4]   2> 		at com.carrotsearch.randomizedtesting.RandomizedRunner.access$400(RandomizedRunner.java:132)
   [junit4]   2> 		at com.carrotsearch.randomizedtesting.RandomizedRunner$2.run(RandomizedRunner.java:551)
   [junit4]   2> 	
   [junit4]   2> 798 T2150 C113 REQ [collection1] webapp=null path=null params={spellcheck=true&spellcheck.accuracy=.75&indent=true&spellcheck.collateExtendedResults=true&spellcheck.extendedResults=true&spellcheck.maxCollations=10&q=lowerfilt:(paintable+pine+apple+godness)&spellcheck.collate=true&qt=spellCheckWithWordbreak&spellcheck.build=true} hits=0 status=500 QTime=42 
   [junit4]   2> 799 T2150 oasc.SolrException.log SEVERE REQUEST FAILED: spellcheck=true&spellcheck.accuracy=.75&indent=true&spellcheck.collateExtendedResults=true&spellcheck.extendedResults=true&spellcheck.maxCollations=10&q=lowerfilt:(paintable+pine+apple+godness)&spellcheck.collate=true&qt=spellCheckWithWordbreak&spellcheck.build=true:java.lang.NullPointerException
   [junit4]   2> 		at org.apache.solr.handler.component.SpellCheckComponent.toNamedList(SpellCheckComponent.java:566)
   [junit4]   2> 		at org.apache.solr.handler.component.SpellCheckComponent.process(SpellCheckComponent.java:177)
   [junit4]   2> 		at org.apache.solr.handler.component.SearchHandler.handleRequestBody(SearchHandler.java:204)
   [junit4]   2> 		at org.apache.solr.handler.RequestHandlerBase.handleRequest(RequestHandlerBase.java:129)
   [junit4]   2> 		at org.apache.solr.core.SolrCore.execute(SolrCore.java:1555)
   [junit4]   2> 		at org.apache.solr.util.TestHarness.query(TestHarness.java:357)
   [junit4]   2> 		at org.apache.solr.util.TestHarness.query(TestHarness.java:340)
   [junit4]   2> 		at org.apache.solr.SolrTestCaseJ4.assertQ(SolrTestCaseJ4.java:433)
   [junit4]   2> 		at org.apache.solr.SolrTestCaseJ4.assertQ(SolrTestCaseJ4.java:426)
   [junit4]   2> 		at org.apache.solr.spelling.WordBreakSolrSpellCheckerTest.testCollate(WordBreakSolrSpellCheckerTest.java:181)
   [junit4]   2> 		at sun.reflect.NativeMethodAccessorImpl.invoke0(Native Method)
   [junit4]   2> 		at sun.reflect.NativeMethodAccessorImpl.invoke(NativeMethodAccessorImpl.java:39)
   [junit4]   2> 		at sun.reflect.DelegatingMethodAccessorImpl.invoke(DelegatingMethodAccessorImpl.java:25)
   [junit4]   2> 		at java.lang.reflect.Method.invoke(Method.java:597)
   [junit4]   2> 		at com.carrotsearch.randomizedtesting.RandomizedRunner.invoke(RandomizedRunner.java:1969)
   [junit4]   2> 		at com.carrotsearch.randomizedtesting.RandomizedRunner.access$1100(RandomizedRunner.java:132)
   [junit4]   2> 		at com.carrotsearch.randomizedtesting.RandomizedRunner$6.evaluate(RandomizedRunner.java:814)
   [junit4]   2> 		at com.carrotsearch.randomizedtesting.RandomizedRunner$7.evaluate(RandomizedRunner.java:875)
   [junit4]   2> 		at com.carrotsearch.randomizedtesting.RandomizedRunner$8.evaluate(RandomizedRunner.java:889)
   [junit4]   2> 		at com.carrotsearch.randomizedtesting.rules.SystemPropertiesRestoreRule$1.evaluate(SystemPropertiesRestoreRule.java:53)
   [junit4]   2> 		at org.apache.lucene.util.TestRuleSetupTeardownChained$1.evaluate(TestRuleSetupTeardownChained.java:50)
   [junit4]   2> 		at org.apache.lucene.util.TestRuleFieldCacheSanity$1.evaluate(TestRuleFieldCacheSanity.java:32)
   [junit4]   2> 		at org.apache.lucene.util.AbstractBeforeAfterRule$1.evaluate(AbstractBeforeAfterRule.java:45)
   [junit4]   2> 		at com.carrotsearch.randomizedtesting.rules.SystemPropertiesInvariantRule$1.evaluate(SystemPropertiesInvariantRule.java:55)
   [junit4]   2> 		at org.apache.lucene.util.TestRuleReportUncaughtExceptions$1.evaluate(TestRuleReportUncaughtExceptions.java:68)
   [junit4]   2> 		at org.apache.lucene.util.TestRuleThreadAndTestName$1.evaluate(TestRuleThreadAndTestName.java:48)
   [junit4]   2> 		at org.apache.lucene.util.TestRuleMarkFailure$1.evaluate(TestRuleMarkFailure.java:48)
   [junit4]   2> 		at com.carrotsearch.randomizedtesting.RandomizedRunner.runSingleTest(RandomizedRunner.java:821)
   [junit4]   2> 		at com.carrotsearch.randomizedtesting.RandomizedRunner.access$700(RandomizedRunner.java:132)
   [junit4]   2> 		at com.carrotsearch.randomizedtesting.RandomizedRunner$3$1.run(RandomizedRunner.java:669)
   [junit4]   2> 		at com.carrotsearch.randomizedtesting.RandomizedRunner$3.evaluate(RandomizedRunner.java:695)
   [junit4]   2> 		at com.carrotsearch.randomizedtesting.RandomizedRunner$4.evaluate(RandomizedRunner.java:734)
   [junit4]   2> 		at com.carrotsearch.randomizedtesting.RandomizedRunner$5.evaluate(RandomizedRunner.java:745)
   [junit4]   2> 		at com.carrotsearch.randomizedtesting.rules.SystemPropertiesRestoreRule$1.evaluate(SystemPropertiesRestoreRule.java:53)
   [junit4]   2> 		at org.apache.lucene.util.AbstractBeforeAfterRule$1.evaluate(AbstractBeforeAfterRule.java:45)
   [junit4]   2> 		at org.apache.lucene.util.TestRuleReportUncaughtExceptions$1.evaluate(TestRuleReportUncaughtExceptions.java:68)
   [junit4]   2> 		at org.apache.lucene.util.TestRuleStoreClassName$1.evaluate(TestRuleStoreClassName.java:38)
   [junit4]   2> 		at org.apache.lucene.util.TestRuleIcuHack$1.evaluate(TestRuleIcuHack.java:51)
   [junit4]   2> 		at com.carrotsearch.randomizedtesting.rules.SystemPropertiesInvariantRule$1.evaluate(SystemPropertiesInvariantRule.java:55)
   [junit4]   2> 		at org.apache.lucene.util.TestRuleNoInstanceHooksOverrides$1.evaluate(TestRuleNoInstanceHooksOverrides.java:53)
   [junit4]   2> 		at org.apache.lucene.util.TestRuleNoStaticHooksShadowing$1.evaluate(TestRuleNoStaticHooksShadowing.java:52)
   [junit4]   2> 		at org.apache.lucene.util.TestRuleAssertionsRequired$1.evaluate(TestRuleAssertionsRequired.java:36)
   [junit4]   2> 		at org.apache.lucene.util.TestRuleMarkFailure$1.evaluate(TestRuleMarkFailure.java:48)
   [junit4]   2> 		at org.apache.lucene.util.TestRuleIgnoreTestSuites$1.evaluate(TestRuleIgnoreTestSuites.java:56)
   [junit4]   2> 		at com.carrotsearch.randomizedtesting.RandomizedRunner.runSuite(RandomizedRunner.java:605)
   [junit4]   2> 		at com.carrotsearch.randomizedtesting.RandomizedRunner.access$400(RandomizedRunner.java:132)
   [junit4]   2> 		at com.carrotsearch.randomizedtesting.RandomizedRunner$2.run(RandomizedRunner.java:551)
   [junit4]   2> 	
   [junit4]   2> 799 T2150 oas.SolrTestCaseJ4.tearDown ###Ending testCollate
   [junit4]   2> NOTE: reproduce with: ant test  -Dtestcase=WordBreakSolrSpellCheckerTest -Dtests.method=testCollate -Dtests.seed=83C376835FB8374D -Dtests.multiplier=3 -Dtests.locale=es_CL -Dtests.timezone=Asia/Ulan_Bator -Dargs="-Dfile.encoding=UTF-8"
   [junit4]   2>
   [junit4]    > (@AfterClass output)
   [junit4]   2> 803 T2150 oas.SolrTestCaseJ4.deleteCore ###deleteCore
   [junit4]   2> 803 T2150 oasc.CoreContainer.shutdown Shutting down CoreContainer instance=1541143123
   [junit4]   2> 803 T2150 oasc.SolrCore.close [collection1]  CLOSING SolrCore org.apache.solr.core.SolrCore@bac64e7
   [junit4]   2> 803 T2150 oasc.SolrCore.closeSearcher [collection1] Closing main searcher on request.
   [junit4]   2> 804 T2150 oasu.DirectUpdateHandler2.close closing DirectUpdateHandler2{commits=1,autocommits=0,soft autocommits=0,optimizes=0,rollbacks=0,expungeDeletes=0,docsPending=0,adds=0,deletesById=0,deletesByQuery=0,errors=0,cumulative_adds=7,cumulative_deletesById=0,cumulative_deletesByQuery=0,cumulative_errors=0}
   [junit4]   2> NOTE: test params are: codec=Lucene40: {end4=Lucene40(minBlockSize=41 maxBlockSize=84), end3=PostingsFormat(name=NestedPulsing), end2=MockFixedIntBlock(blockSize=631), start1=MockFixedIntBlock(blockSize=631), end1=PostingsFormat(name=Memory doPackFST= true), start4=PostingsFormat(name=NestedPulsing), start2=PostingsFormat(name=SimpleText), start3=PostingsFormat(name=MockSep), gram2=PostingsFormat(name=Lucene40WithOrds), word=PostingsFormat(name=Memory doPackFST= true), gram1=PostingsFormat(name=SimpleText), gram4=PostingsFormat(name=MockSep), gram3=Pulsing40(freqCutoff=20 minBlockSize=41 maxBlockSize=84)}, sim=DefaultSimilarity, locale=es_CL, timezone=Asia/Ulan_Bator
   [junit4]   2> NOTE: Linux 2.6.32-41-server amd64/Sun Microsystems Inc. 1.6.0_32 (64-bit)/cpus=8,threads=1,free=120343024,total=253034496
   [junit4]   2> NOTE: All tests run in this JVM: [IndexReaderFactoryTest, TestJapaneseTokenizerFactory, TestThaiWordFilterFactory, TestBulgarianStemFilterFactory, ResourceLoaderTest, TestUpdate, IndexBasedSpellCheckerTest, TestElisionFilterFactory, OutputWriterTest, SolrInfoMBeanTest, NumericFieldsTest, TestRealTimeGet, TestGreekLowerCaseFilterFactory, TestCJKBigramFilterFactory, QueryElevationComponentTest, DirectSolrSpellCheckerTest, AlternateDirectoryTest, MoreLikeThisHandlerTest, TestFiltering, CurrencyFieldTest, BadComponentTest, TestPatternReplaceFilterFactory, TestCollationField, AutoCommitTest, CommonGramsQueryFilterFactoryTest, TestSolrQueryParser, DebugComponentTest, URLClassifyProcessorTest, TestIBSimilarityFactory, TestFaceting, TestSolrDeletionPolicy2, SolrPluginUtilsTest, SolrRequestParserTest, RecoveryZkTest, SuggesterTest, TestFinnishLightStemFilterFactory, TestSolrCoreProperties, UUIDFieldTest, SimpleFacetsTest, TestConfig, TestQueryUtils, TestXIncludeConfig, TestGalicianStemFilterFactory, TestBadConfig, TestSearchPerf, QueryParsingTest, TestPortugueseLightStemFilterFactory, TestPerFieldSimilarity, TestNorwegianMinimalStemFilterFactory, TestPortugueseStemFilterFactory, TestGermanMinimalStemFilterFactory, TestJmxIntegration, SolrIndexConfigTest, RequiredFieldsTest, EchoParamsTest, TestPluginEnable, TestJapaneseBaseFormFilterFactory, TestRecovery, TestFrenchLightStemFilterFactory, TestCzechStemFilterFactory, DocumentAnalysisRequestHandlerTest, TestLuceneMatchVersion, ReturnFieldsTest, ZkNodePropsTest, CopyFieldTest, TestSolrXMLSerializer, SearchHandlerTest, IndexSchemaTest, TestDistributedGrouping, TestTrimFilterFactory, TestWikipediaTokenizerFactory, RAMDirectoryFactoryTest, OverseerTest, TestSystemIdResolver, TestQueryTypes, TestHashPartitioner, FileBasedSpellCheckerTest, DistributedQueryElevationComponentTest, TestNGramFilters, TestValueSourceCache, TestPatternTokenizerFactory, SpellPossibilityIteratorTest, TestIndexingPerformance, TestLFUCache, NodeStateWatcherTest, TestRangeQuery, TestCapitalizationFilterFactory, TestReplicationHandler, TestGermanLightStemFilterFactory, SpellCheckCollatorTest, TestTypeTokenFilterFactory, FileUtilsTest, TestGalicianMinimalStemFilterFactory, ZkSolrClientTest, TestLRUCache, XsltUpdateRequestHandlerTest, TestSurroundQueryParser, CacheHeaderTest, PingRequestHandlerTest, DistributedSpellCheckComponentTest, SoftAutoCommitTest, TestJoin, TestGroupingSearch, StandardRequestHandlerTest, LukeRequestHandlerTest, TestCoreContainer, CoreAdminHandlerTest, SuggesterTSTTest, NoCacheHeaderTest, SolrCoreCheckLockOnStartupTest, FieldMutatingUpdateProcessorTest, RequestHandlersTest, HighlighterConfigTest, JSONWriterTest, FieldAnalysisRequestHandlerTest, BinaryUpdateRequestHandlerTest, IndexSchemaRuntimeFieldTest, TermVectorComponentTest, UpdateRequestProcessorFactoryTest, UpdateParamsTest, TestMergePolicyConfig, MinimalSchemaTest, TestHyphenationCompoundWordTokenFilterFactory, TestPatternReplaceCharFilterFactory, TestMultiWordSynonyms, TestRussianLightStemFilterFactory, TestHindiFilters, TestSuggestSpellingConverter, TestIrishLowerCaseFilterFactory, TestItalianLightStemFilterFactory, SystemInfoHandlerTest, WordBreakSolrSpellCheckerTest]
   [junit4]   2> 
   [junit4] Completed on J1 in 0.82s, 3 tests, 2 errors <<< FAILURES!
[...truncated 19 lines...]

[...truncated 11134 lines...]

[...truncated 11134 lines...]

[...truncated 11134 lines...]


Mime
View raw message