lucene-dev mailing list archives

Site index · List index
Message view « Date » · « Thread »
Top « Date » · « Thread »
From Apache Jenkins Server <jenk...@builds.apache.org>
Subject [JENKINS] Lucene-Solr-tests-only-trunk - Build # 14746 - Failure
Date Wed, 20 Jun 2012 03:07:31 GMT
Build: https://builds.apache.org/job/Lucene-Solr-tests-only-trunk/14746/

1 tests failed.
REGRESSION:  org.apache.lucene.analysis.core.TestRandomChains.testRandomChains

Error Message:
stage 3: inconsistent startOffset at pos=0: 0 vs 4; token=euroopannnn unnnnionnnninnnn

Stack Trace:
java.lang.IllegalStateException: stage 3: inconsistent startOffset at pos=0: 0 vs 4; token=euroopannnn
unnnnionnnninnnn
	at __randomizedtesting.SeedInfo.seed([AAD0B7132D6D554E:97319E726A7F488E]:0)
	at org.apache.lucene.analysis.ValidatingTokenFilter.incrementToken(ValidatingTokenFilter.java:119)
	at org.apache.lucene.analysis.ga.IrishLowerCaseFilter.incrementToken(IrishLowerCaseFilter.java:42)
	at org.apache.lucene.analysis.ValidatingTokenFilter.incrementToken(ValidatingTokenFilter.java:78)
	at org.apache.lucene.analysis.BaseTokenStreamTestCase.checkAnalysisConsistency(BaseTokenStreamTestCase.java:644)
	at org.apache.lucene.analysis.BaseTokenStreamTestCase.checkRandomData(BaseTokenStreamTestCase.java:554)
	at org.apache.lucene.analysis.BaseTokenStreamTestCase.checkRandomData(BaseTokenStreamTestCase.java:450)
	at org.apache.lucene.analysis.core.TestRandomChains.testRandomChains(TestRandomChains.java:860)
	at sun.reflect.NativeMethodAccessorImpl.invoke0(Native Method)
	at sun.reflect.NativeMethodAccessorImpl.invoke(NativeMethodAccessorImpl.java:57)
	at sun.reflect.DelegatingMethodAccessorImpl.invoke(DelegatingMethodAccessorImpl.java:43)
	at java.lang.reflect.Method.invoke(Method.java:616)
	at com.carrotsearch.randomizedtesting.RandomizedRunner.invoke(RandomizedRunner.java:1969)
	at com.carrotsearch.randomizedtesting.RandomizedRunner.access$1100(RandomizedRunner.java:132)
	at com.carrotsearch.randomizedtesting.RandomizedRunner$6.evaluate(RandomizedRunner.java:814)
	at com.carrotsearch.randomizedtesting.RandomizedRunner$7.evaluate(RandomizedRunner.java:875)
	at com.carrotsearch.randomizedtesting.RandomizedRunner$8.evaluate(RandomizedRunner.java:889)
	at org.apache.lucene.util.TestRuleSetupTeardownChained$1.evaluate(TestRuleSetupTeardownChained.java:50)
	at org.apache.lucene.util.TestRuleFieldCacheSanity$1.evaluate(TestRuleFieldCacheSanity.java:32)
	at org.apache.lucene.util.AbstractBeforeAfterRule$1.evaluate(AbstractBeforeAfterRule.java:45)
	at com.carrotsearch.randomizedtesting.rules.SystemPropertiesInvariantRule$1.evaluate(SystemPropertiesInvariantRule.java:55)
	at org.apache.lucene.util.TestRuleReportUncaughtExceptions$1.evaluate(TestRuleReportUncaughtExceptions.java:68)
	at org.apache.lucene.util.TestRuleThreadAndTestName$1.evaluate(TestRuleThreadAndTestName.java:48)
	at org.apache.lucene.util.TestRuleMarkFailure$1.evaluate(TestRuleMarkFailure.java:48)
	at com.carrotsearch.randomizedtesting.RandomizedRunner.runSingleTest(RandomizedRunner.java:821)
	at com.carrotsearch.randomizedtesting.RandomizedRunner.access$700(RandomizedRunner.java:132)
	at com.carrotsearch.randomizedtesting.RandomizedRunner$3$1.run(RandomizedRunner.java:669)
	at com.carrotsearch.randomizedtesting.RandomizedRunner$3.evaluate(RandomizedRunner.java:695)
	at com.carrotsearch.randomizedtesting.RandomizedRunner$4.evaluate(RandomizedRunner.java:734)
	at com.carrotsearch.randomizedtesting.RandomizedRunner$5.evaluate(RandomizedRunner.java:745)
	at org.apache.lucene.util.AbstractBeforeAfterRule$1.evaluate(AbstractBeforeAfterRule.java:45)
	at org.apache.lucene.util.TestRuleReportUncaughtExceptions$1.evaluate(TestRuleReportUncaughtExceptions.java:68)
	at org.apache.lucene.util.TestRuleStoreClassName$1.evaluate(TestRuleStoreClassName.java:38)
	at org.apache.lucene.util.TestRuleIcuHack$1.evaluate(TestRuleIcuHack.java:51)
	at com.carrotsearch.randomizedtesting.rules.SystemPropertiesInvariantRule$1.evaluate(SystemPropertiesInvariantRule.java:55)
	at org.apache.lucene.util.TestRuleNoInstanceHooksOverrides$1.evaluate(TestRuleNoInstanceHooksOverrides.java:53)
	at org.apache.lucene.util.TestRuleNoStaticHooksShadowing$1.evaluate(TestRuleNoStaticHooksShadowing.java:52)
	at org.apache.lucene.util.TestRuleAssertionsRequired$1.evaluate(TestRuleAssertionsRequired.java:36)
	at org.apache.lucene.util.TestRuleMarkFailure$1.evaluate(TestRuleMarkFailure.java:48)
	at org.apache.lucene.util.TestRuleIgnoreTestSuites$1.evaluate(TestRuleIgnoreTestSuites.java:56)
	at com.carrotsearch.randomizedtesting.RandomizedRunner.runSuite(RandomizedRunner.java:605)
	at com.carrotsearch.randomizedtesting.RandomizedRunner.access$400(RandomizedRunner.java:132)
	at com.carrotsearch.randomizedtesting.RandomizedRunner$2.run(RandomizedRunner.java:551)




Build Log:
[...truncated 4595 lines...]
   [junit4]  
   [junit4] Suite: org.apache.lucene.analysis.wikipedia.WikipediaTokenizerTest
   [junit4] Completed on J0 in 231.93s, 8 tests
   [junit4]  
   [junit4] Suite: org.apache.lucene.analysis.hunspell.HunspellStemmerTest
   [junit4] Completed on J0 in 0.05s, 5 tests
   [junit4]  
   [junit4] Suite: org.apache.lucene.analysis.fr.TestFrenchMinimalStemFilter
   [junit4] Completed on J1 in 2.18s, 4 tests
   [junit4]  
   [junit4] Suite: org.apache.lucene.analysis.cjk.TestCJKWidthFilter
   [junit4] Completed on J0 in 2.34s, 4 tests
   [junit4]  
   [junit4] Suite: org.apache.lucene.analysis.th.TestThaiAnalyzer
   [junit4] Completed on J0 in 259.19s, 9 tests
   [junit4]  
   [junit4] Suite: org.apache.lucene.analysis.pattern.TestPatternTokenizer
   [junit4] Completed on J1 in 240.66s, 3 tests
   [junit4]  
   [junit4] Suite: org.apache.lucene.analysis.da.TestDanishAnalyzer
   [junit4] Completed on J1 in 234.77s, 4 tests
   [junit4]  
   [junit4] Suite: org.apache.lucene.analysis.miscellaneous.TestLengthFilter
   [junit4] Completed on J1 in 0.02s, 3 tests
   [junit4]  
   [junit4] Suite: org.apache.lucene.analysis.miscellaneous.TestLimitTokenCountAnalyzer
   [junit4] Completed on J1 in 0.07s, 2 tests
   [junit4]  
   [junit4] Suite: org.apache.lucene.analysis.miscellaneous.TestCapitalizationFilter
   [junit4] Completed on J0 in 1.10s, 3 tests
   [junit4]  
   [junit4] Suite: org.apache.lucene.analysis.pt.TestPortugueseLightStemFilter
   [junit4] Completed on J0 in 234.27s, 5 tests
   [junit4]  
   [junit4] Suite: org.apache.lucene.analysis.core.TestRandomChains
   [junit4] ERROR   3.37s J0 | TestRandomChains.testRandomChains
   [junit4]    > Throwable #1: java.lang.IllegalStateException: stage 3: inconsistent startOffset
at pos=0: 0 vs 4; token=euroopannnn unnnnionnnninnnn
   [junit4]    > 	at __randomizedtesting.SeedInfo.seed([AAD0B7132D6D554E:97319E726A7F488E]:0)
   [junit4]    > 	at org.apache.lucene.analysis.ValidatingTokenFilter.incrementToken(ValidatingTokenFilter.java:119)
   [junit4]    > 	at org.apache.lucene.analysis.ga.IrishLowerCaseFilter.incrementToken(IrishLowerCaseFilter.java:42)
   [junit4]    > 	at org.apache.lucene.analysis.ValidatingTokenFilter.incrementToken(ValidatingTokenFilter.java:78)
   [junit4]    > 	at org.apache.lucene.analysis.BaseTokenStreamTestCase.checkAnalysisConsistency(BaseTokenStreamTestCase.java:644)
   [junit4]    > 	at org.apache.lucene.analysis.BaseTokenStreamTestCase.checkRandomData(BaseTokenStreamTestCase.java:554)
   [junit4]    > 	at org.apache.lucene.analysis.BaseTokenStreamTestCase.checkRandomData(BaseTokenStreamTestCase.java:450)
   [junit4]    > 	at org.apache.lucene.analysis.core.TestRandomChains.testRandomChains(TestRandomChains.java:860)
   [junit4]    > 	at sun.reflect.NativeMethodAccessorImpl.invoke0(Native Method)
   [junit4]    > 	at sun.reflect.NativeMethodAccessorImpl.invoke(NativeMethodAccessorImpl.java:57)
   [junit4]    > 	at sun.reflect.DelegatingMethodAccessorImpl.invoke(DelegatingMethodAccessorImpl.java:43)
   [junit4]    > 	at java.lang.reflect.Method.invoke(Method.java:616)
   [junit4]    > 	at com.carrotsearch.randomizedtesting.RandomizedRunner.invoke(RandomizedRunner.java:1969)
   [junit4]    > 	at com.carrotsearch.randomizedtesting.RandomizedRunner.access$1100(RandomizedRunner.java:132)
   [junit4]    > 	at com.carrotsearch.randomizedtesting.RandomizedRunner$6.evaluate(RandomizedRunner.java:814)
   [junit4]    > 	at com.carrotsearch.randomizedtesting.RandomizedRunner$7.evaluate(RandomizedRunner.java:875)
   [junit4]    > 	at com.carrotsearch.randomizedtesting.RandomizedRunner$8.evaluate(RandomizedRunner.java:889)
   [junit4]    > 	at org.apache.lucene.util.TestRuleSetupTeardownChained$1.evaluate(TestRuleSetupTeardownChained.java:50)
   [junit4]    > 	at org.apache.lucene.util.TestRuleFieldCacheSanity$1.evaluate(TestRuleFieldCacheSanity.java:32)
   [junit4]    > 	at org.apache.lucene.util.AbstractBeforeAfterRule$1.evaluate(AbstractBeforeAfterRule.java:45)
   [junit4]    > 	at com.carrotsearch.randomizedtesting.rules.SystemPropertiesInvariantRule$1.evaluate(SystemPropertiesInvariantRule.java:55)
   [junit4]    > 	at org.apache.lucene.util.TestRuleReportUncaughtExceptions$1.evaluate(TestRuleReportUncaughtExceptions.java:68)
   [junit4]    > 	at org.apache.lucene.util.TestRuleThreadAndTestName$1.evaluate(TestRuleThreadAndTestName.java:48)
   [junit4]    > 	at org.apache.lucene.util.TestRuleMarkFailure$1.evaluate(TestRuleMarkFailure.java:48)
   [junit4]    > 	at com.carrotsearch.randomizedtesting.RandomizedRunner.runSingleTest(RandomizedRunner.java:821)
   [junit4]    > 	at com.carrotsearch.randomizedtesting.RandomizedRunner.access$700(RandomizedRunner.java:132)
   [junit4]    > 	at com.carrotsearch.randomizedtesting.RandomizedRunner$3$1.run(RandomizedRunner.java:669)
   [junit4]    > 	at com.carrotsearch.randomizedtesting.RandomizedRunner$3.evaluate(RandomizedRunner.java:695)
   [junit4]    > 	at com.carrotsearch.randomizedtesting.RandomizedRunner$4.evaluate(RandomizedRunner.java:734)
   [junit4]    > 	at com.carrotsearch.randomizedtesting.RandomizedRunner$5.evaluate(RandomizedRunner.java:745)
   [junit4]    > 	at org.apache.lucene.util.AbstractBeforeAfterRule$1.evaluate(AbstractBeforeAfterRule.java:45)
   [junit4]    > 	at org.apache.lucene.util.TestRuleReportUncaughtExceptions$1.evaluate(TestRuleReportUncaughtExceptions.java:68)
   [junit4]    > 	at org.apache.lucene.util.TestRuleStoreClassName$1.evaluate(TestRuleStoreClassName.java:38)
   [junit4]    > 	at org.apache.lucene.util.TestRuleIcuHack$1.evaluate(TestRuleIcuHack.java:51)
   [junit4]    > 	at com.carrotsearch.randomizedtesting.rules.SystemPropertiesInvariantRule$1.evaluate(SystemPropertiesInvariantRule.java:55)
   [junit4]    > 	at org.apache.lucene.util.TestRuleNoInstanceHooksOverrides$1.evaluate(TestRuleNoInstanceHooksOverrides.java:53)
   [junit4]    > 	at org.apache.lucene.util.TestRuleNoStaticHooksShadowing$1.evaluate(TestRuleNoStaticHooksShadowing.java:52)
   [junit4]    > 	at org.apache.lucene.util.TestRuleAssertionsRequired$1.evaluate(TestRuleAssertionsRequired.java:36)
   [junit4]    > 	at org.apache.lucene.util.TestRuleMarkFailure$1.evaluate(TestRuleMarkFailure.java:48)
   [junit4]    > 	at org.apache.lucene.util.TestRuleIgnoreTestSuites$1.evaluate(TestRuleIgnoreTestSuites.java:56)
   [junit4]    > 	at com.carrotsearch.randomizedtesting.RandomizedRunner.runSuite(RandomizedRunner.java:605)
   [junit4]    > 	at com.carrotsearch.randomizedtesting.RandomizedRunner.access$400(RandomizedRunner.java:132)
   [junit4]    > 	at com.carrotsearch.randomizedtesting.RandomizedRunner$2.run(RandomizedRunner.java:551)
   [junit4]    > 
   [junit4]   2> TEST FAIL: useCharFilter=true text='hd\u00e4 Euroopan unionin'
   [junit4]   2> Exception from random analyzer: 
   [junit4]   2> charfilters=
   [junit4]   2>   org.apache.lucene.analysis.MockCharFilter(java.io.StringReader@ef1a1fc)
   [junit4]   2> tokenizer=
   [junit4]   2>   org.apache.lucene.analysis.core.LowerCaseTokenizer(LUCENE_50, org.apache.lucene.util.AttributeSource$AttributeFactory$DefaultAttributeFactory@23f69907,
org.apache.lucene.analysis.core.TestRandomChains$CheckThatYouDidntReadAnythingReaderWrapper@19c1af0e)
   [junit4]   2> filters=
   [junit4]   2>   org.apache.lucene.analysis.shingle.ShingleFilter(org.apache.lucene.analysis.ValidatingTokenFilter@37caea)
   [junit4]   2>   org.apache.lucene.analysis.id.IndonesianStemFilter(org.apache.lucene.analysis.ValidatingTokenFilter@6c1927b)
   [junit4]   2>   org.apache.lucene.analysis.miscellaneous.LengthFilter(false, org.apache.lucene.analysis.ValidatingTokenFilter@6c1927b,
17, 78)
   [junit4]   2>   org.apache.lucene.analysis.ga.IrishLowerCaseFilter(org.apache.lucene.analysis.ValidatingTokenFilter@6c1927b)
   [junit4]   2> offsetsAreCorrect=true
   [junit4]   2> NOTE: reproduce with: ant test  -Dtestcase=TestRandomChains -Dtests.method=testRandomChains
-Dtests.seed=AAD0B7132D6D554E -Dtests.multiplier=3 -Dtests.locale=ca_ES -Dtests.timezone=America/Guadeloupe
-Dargs="-Dfile.encoding=ISO8859-1"
   [junit4]   2>
   [junit4]    > (@AfterClass output)
   [junit4]   2> NOTE: test params are: codec=Appending, sim=DefaultSimilarity, locale=ca_ES,
timezone=America/Guadeloupe
   [junit4]   2> NOTE: FreeBSD 9.0-RELEASE amd64/Sun Microsystems Inc. 1.6.0_32 (64-bit)/cpus=16,threads=1,free=90701240,total=246153216
   [junit4]   2> NOTE: All tests run in this JVM: [WikipediaTokenizerTest, HunspellStemmerTest,
TestCJKWidthFilter, TestThaiAnalyzer, TestCapitalizationFilter, TestPortugueseLightStemFilter,
TestRandomChains]
   [junit4]   2> 
   [junit4] Completed on J0 in 3.74s, 1 test, 1 error <<< FAILURES!
[...truncated 401 lines...]

[...truncated 5097 lines...]

[...truncated 5097 lines...]

[...truncated 5097 lines...]

[...truncated 5097 lines...]

[...truncated 5097 lines...]



Mime
View raw message