lucene-dev mailing list archives

Site index · List index
Message view « Date » · « Thread »
Top « Date » · « Thread »
From jenk...@sd-datasolutions.de
Subject [JENKINS] Lucene-Solr-4.x-Windows-Java7-64 - Build # 64 - Failure!
Date Thu, 14 Jun 2012 16:33:32 GMT
Build: http://jenkins.sd-datasolutions.de/job/Lucene-Solr-4.x-Windows-Java7-64/64/

1 tests failed.
REGRESSION:  org.apache.solr.handler.component.SpellCheckComponentTest.testThresholdTokenFrequency

Error Message:
Path not found: /spellcheck/suggestions/[1]/suggestion

Stack Trace:
java.lang.RuntimeException: Path not found: /spellcheck/suggestions/[1]/suggestion
	at __randomizedtesting.SeedInfo.seed([6587EC4535619BCC:EF2063B4BA8AA2B7]:0)
	at org.apache.solr.SolrTestCaseJ4.assertJQ(SolrTestCaseJ4.java:545)
	at org.apache.solr.SolrTestCaseJ4.assertJQ(SolrTestCaseJ4.java:493)
	at org.apache.solr.handler.component.SpellCheckComponentTest.testThresholdTokenFrequency(SpellCheckComponentTest.java:211)
	at sun.reflect.NativeMethodAccessorImpl.invoke0(Native Method)
	at sun.reflect.NativeMethodAccessorImpl.invoke(NativeMethodAccessorImpl.java:57)
	at sun.reflect.DelegatingMethodAccessorImpl.invoke(DelegatingMethodAccessorImpl.java:43)
	at java.lang.reflect.Method.invoke(Method.java:601)
	at com.carrotsearch.randomizedtesting.RandomizedRunner.invoke(RandomizedRunner.java:1969)
	at com.carrotsearch.randomizedtesting.RandomizedRunner.access$1100(RandomizedRunner.java:132)
	at com.carrotsearch.randomizedtesting.RandomizedRunner$6.evaluate(RandomizedRunner.java:814)
	at com.carrotsearch.randomizedtesting.RandomizedRunner$7.evaluate(RandomizedRunner.java:875)
	at com.carrotsearch.randomizedtesting.RandomizedRunner$8.evaluate(RandomizedRunner.java:889)
	at com.carrotsearch.randomizedtesting.rules.SystemPropertiesRestoreRule$1.evaluate(SystemPropertiesRestoreRule.java:53)
	at org.apache.lucene.util.TestRuleSetupTeardownChained$1.evaluate(TestRuleSetupTeardownChained.java:50)
	at org.apache.lucene.util.TestRuleFieldCacheSanity$1.evaluate(TestRuleFieldCacheSanity.java:32)
	at org.apache.lucene.util.AbstractBeforeAfterRule$1.evaluate(AbstractBeforeAfterRule.java:45)
	at com.carrotsearch.randomizedtesting.rules.SystemPropertiesInvariantRule$1.evaluate(SystemPropertiesInvariantRule.java:55)
	at org.apache.lucene.util.TestRuleReportUncaughtExceptions$1.evaluate(TestRuleReportUncaughtExceptions.java:68)
	at org.apache.lucene.util.TestRuleThreadAndTestName$1.evaluate(TestRuleThreadAndTestName.java:48)
	at org.apache.lucene.util.TestRuleMarkFailure$1.evaluate(TestRuleMarkFailure.java:48)
	at com.carrotsearch.randomizedtesting.RandomizedRunner.runSingleTest(RandomizedRunner.java:821)
	at com.carrotsearch.randomizedtesting.RandomizedRunner.access$700(RandomizedRunner.java:132)
	at com.carrotsearch.randomizedtesting.RandomizedRunner$3$1.run(RandomizedRunner.java:669)
	at com.carrotsearch.randomizedtesting.RandomizedRunner$3.evaluate(RandomizedRunner.java:695)
	at com.carrotsearch.randomizedtesting.RandomizedRunner$4.evaluate(RandomizedRunner.java:734)
	at com.carrotsearch.randomizedtesting.RandomizedRunner$5.evaluate(RandomizedRunner.java:745)
	at com.carrotsearch.randomizedtesting.rules.SystemPropertiesRestoreRule$1.evaluate(SystemPropertiesRestoreRule.java:53)
	at org.apache.lucene.util.AbstractBeforeAfterRule$1.evaluate(AbstractBeforeAfterRule.java:45)
	at org.apache.lucene.util.TestRuleReportUncaughtExceptions$1.evaluate(TestRuleReportUncaughtExceptions.java:68)
	at org.apache.lucene.util.TestRuleStoreClassName$1.evaluate(TestRuleStoreClassName.java:38)
	at org.apache.lucene.util.TestRuleIcuHack$1.evaluate(TestRuleIcuHack.java:51)
	at com.carrotsearch.randomizedtesting.rules.SystemPropertiesInvariantRule$1.evaluate(SystemPropertiesInvariantRule.java:55)
	at org.apache.lucene.util.TestRuleNoInstanceHooksOverrides$1.evaluate(TestRuleNoInstanceHooksOverrides.java:53)
	at org.apache.lucene.util.TestRuleNoStaticHooksShadowing$1.evaluate(TestRuleNoStaticHooksShadowing.java:52)
	at org.apache.lucene.util.TestRuleAssertionsRequired$1.evaluate(TestRuleAssertionsRequired.java:36)
	at org.apache.lucene.util.TestRuleMarkFailure$1.evaluate(TestRuleMarkFailure.java:48)
	at org.apache.lucene.util.TestRuleIgnoreTestSuites$1.evaluate(TestRuleIgnoreTestSuites.java:56)
	at com.carrotsearch.randomizedtesting.RandomizedRunner.runSuite(RandomizedRunner.java:605)
	at com.carrotsearch.randomizedtesting.RandomizedRunner.access$400(RandomizedRunner.java:132)
	at com.carrotsearch.randomizedtesting.RandomizedRunner$2.run(RandomizedRunner.java:551)




Build Log:
[...truncated 10434 lines...]
   [junit4]    > 	at org.apache.lucene.util.TestRuleIcuHack$1.evaluate(TestRuleIcuHack.java:51)
   [junit4]    > 	at com.carrotsearch.randomizedtesting.rules.SystemPropertiesInvariantRule$1.evaluate(SystemPropertiesInvariantRule.java:55)
   [junit4]    > 	at org.apache.lucene.util.TestRuleNoInstanceHooksOverrides$1.evaluate(TestRuleNoInstanceHooksOverrides.java:53)
   [junit4]    > 	at org.apache.lucene.util.TestRuleNoStaticHooksShadowing$1.evaluate(TestRuleNoStaticHooksShadowing.java:52)
   [junit4]    > 	at org.apache.lucene.util.TestRuleAssertionsRequired$1.evaluate(TestRuleAssertionsRequired.java:36)
   [junit4]    > 	at org.apache.lucene.util.TestRuleMarkFailure$1.evaluate(TestRuleMarkFailure.java:48)
   [junit4]    > 	at org.apache.lucene.util.TestRuleIgnoreTestSuites$1.evaluate(TestRuleIgnoreTestSuites.java:56)
   [junit4]    > 	at com.carrotsearch.randomizedtesting.RandomizedRunner.runSuite(RandomizedRunner.java:605)
   [junit4]    > 	at com.carrotsearch.randomizedtesting.RandomizedRunner.access$400(RandomizedRunner.java:132)
   [junit4]    > 	at com.carrotsearch.randomizedtesting.RandomizedRunner$2.run(RandomizedRunner.java:551)
   [junit4]    > 
   [junit4]   2> 1441 T356 oas.SolrTestCaseJ4.setUp ###Starting testThresholdTokenFrequency
   [junit4]   2> ASYNC  NEW_CORE C24 name=collection1 org.apache.solr.core.SolrCore@13603408
   [junit4]   2> 1448 T356 C24 oasc.SolrDeletionPolicy.onInit SolrDeletionPolicy.onInit:
commits:num=1
   [junit4]   2> 		commit{dir=MockDirWrapper(org.apache.lucene.store.RAMDirectory@211c6c4e
lockFactory=org.apache.lucene.store.NativeFSLockFactory@9da99bc),segFN=segments_1,generation=1,filenames=[segments_1]
   [junit4]   2> 1449 T356 C24 oasc.SolrDeletionPolicy.updateCommits newest commit = 1
   [junit4]   2> 1451 T356 C24 UPDATE [collection1] webapp=null path=null params={} {add=[0]}
0 4
   [junit4]   2> 1462 T356 C24 UPDATE [collection1] webapp=null path=null params={} {add=[1]}
0 1
   [junit4]   2> 1470 T356 C24 UPDATE [collection1] webapp=null path=null params={} {add=[2]}
0 1
   [junit4]   2> 1479 T356 C24 UPDATE [collection1] webapp=null path=null params={} {add=[3]}
0 0
   [junit4]   2> 1487 T356 C24 UPDATE [collection1] webapp=null path=null params={} {add=[4]}
0 1
   [junit4]   2> 1495 T356 C24 UPDATE [collection1] webapp=null path=null params={} {add=[5]}
0 0
   [junit4]   2> 1504 T356 C24 UPDATE [collection1] webapp=null path=null params={} {add=[6]}
0 0
   [junit4]   2> 1513 T356 C24 UPDATE [collection1] webapp=null path=null params={} {add=[7]}
0 1
   [junit4]   2> 1523 T356 C24 UPDATE [collection1] webapp=null path=null params={} {add=[8]}
0 3
   [junit4]   2> 1530 T356 C24 UPDATE [collection1] webapp=null path=null params={} {add=[9]}
0 0
   [junit4]   2> 1539 T356 C24 oasu.DirectUpdateHandler2.commit start commit{flags=0,version=0,optimize=false,openSearcher=true,waitSearcher=true,expungeDeletes=false,softCommit=false}
   [junit4]   2> 1544 T356 C24 oasc.SolrDeletionPolicy.onCommit SolrDeletionPolicy.onCommit:
commits:num=2
   [junit4]   2> 		commit{dir=MockDirWrapper(org.apache.lucene.store.RAMDirectory@211c6c4e
lockFactory=org.apache.lucene.store.NativeFSLockFactory@9da99bc),segFN=segments_1,generation=1,filenames=[segments_1]
   [junit4]   2> 		commit{dir=MockDirWrapper(org.apache.lucene.store.RAMDirectory@211c6c4e
lockFactory=org.apache.lucene.store.NativeFSLockFactory@9da99bc),segFN=segments_2,generation=2,filenames=[_0_Lucene40_0.tim,
_0.fnm, _0_Lucene40_0.frq, _0_nrm.cfe, segments_2, _0.fdx, _0_nrm.cfs, _0.si, _0_Lucene40_0.prx,
_0.fdt, _0_Lucene40_0.tip]
   [junit4]   2> 1545 T356 C24 oasc.SolrDeletionPolicy.updateCommits newest commit = 2
   [junit4]   2> 1545 T356 C24 oasc.SolrCore.getSearcher WARNING [collection1] PERFORMANCE
WARNING: Overlapping onDeckSearchers=2
   [junit4]   2> 1548 T356 C24 oass.SolrIndexSearcher.<init> Opening Searcher@16015cf6
main
   [junit4]   2> 1548 T356 C24 oass.SolrIndexSearcher.<init> WARNING WARNING: Directory
impl does not support setting indexDir: org.apache.lucene.store.MockDirectoryWrapper
   [junit4]   2> 1549 T356 C24 oasu.DirectUpdateHandler2.commit end_commit_flush
   [junit4]   2> 1551 T357 oasc.SolrCore.registerSearcher [collection1] Registered new
searcher Searcher@26c225 main{StandardDirectoryReader(segments_1:1)}
   [junit4]   2> 1551 T357 oashc.SpellCheckComponent$SpellCheckerListener.newSearcher Loading
spell index for spellchecker: default
   [junit4]   2> 1553 T357 oashc.SpellCheckComponent$SpellCheckerListener.newSearcher Loading
spell index for spellchecker: default_teststop
   [junit4]   2> 1555 T357 oashc.SpellCheckComponent$SpellCheckerListener.newSearcher Loading
spell index for spellchecker: direct
   [junit4]   2> 1555 T357 oashc.SpellCheckComponent$SpellCheckerListener.newSearcher Loading
spell index for spellchecker: direct_lowerfilt
   [junit4]   2> 1556 T357 oashc.SpellCheckComponent$SpellCheckerListener.newSearcher Loading
spell index for spellchecker: wordbreak
   [junit4]   2> 1556 T357 oashc.SpellCheckComponent$SpellCheckerListener.newSearcher Loading
spell index for spellchecker: threshold
   [junit4]   2> 1557 T357 oashc.SpellCheckComponent$SpellCheckerListener.newSearcher Loading
spell index for spellchecker: threshold_direct
   [junit4]   2> 1557 T357 oashc.SpellCheckComponent$SpellCheckerListener.newSearcher Loading
spell index for spellchecker: multipleFields
   [junit4]   2> 1558 T357 oashc.SpellCheckComponent$SpellCheckerListener.newSearcher Loading
spell index for spellchecker: jarowinkler
   [junit4]   2> 1559 T357 oashc.SpellCheckComponent$SpellCheckerListener.newSearcher Loading
spell index for spellchecker: external
   [junit4]   2> 1562 T357 oashc.SpellCheckComponent$SpellCheckerListener.newSearcher Loading
spell index for spellchecker: freq
   [junit4]   2> 1563 T357 oashc.SpellCheckComponent$SpellCheckerListener.newSearcher Loading
spell index for spellchecker: fqcn
   [junit4]   2> 1564 T357 oashc.SpellCheckComponent$SpellCheckerListener.newSearcher Loading
spell index for spellchecker: perDict
   [junit4]   2> 1565 T357 oasc.SolrCore.registerSearcher [collection1] Registered new
searcher Searcher@16015cf6 main{StandardDirectoryReader(segments_2:3 _0(4.0):C10)}
   [junit4]   2> 1567 T356 C24 UPDATE [collection1] webapp=null path=null params={} {commit=}
0 29
   [junit4]   2> 1576 T356 C24 REQ [collection1] webapp=null path=null params={spellcheck=true&spellcheck.extendedResults=true&q=documenq&spellcheck.dictionary=threshold&spellcheck.count=5&qt=spellCheckCompRH}
hits=0 status=0 QTime=6 
   [junit4]   2> 1581 T356 oas.SolrTestCaseJ4.assertJQ SEVERE query failed JSON validation.
error=Path not found: /spellcheck/suggestions/[1]/suggestion
   [junit4]   2> 	 expected =/spellcheck/suggestions/[1]/suggestion==[{"word":"document","freq":2}]
   [junit4]   2> 	 response = {
   [junit4]   2> 	  "responseHeader":{
   [junit4]   2> 	    "status":0,
   [junit4]   2> 	    "QTime":6},
   [junit4]   2> 	  "response":{"numFound":0,"start":0,"docs":[]
   [junit4]   2> 	  },
   [junit4]   2> 	  "spellcheck":{
   [junit4]   2> 	    "suggestions":[
   [junit4]   2> 	      "correctlySpelled",false]}}
   [junit4]   2> 	
   [junit4]   2> 	 request = spellcheck=true&spellcheck.extendedResults=true&q=documenq&spellcheck.dictionary=threshold&spellcheck.count=5&qt=spellCheckCompRH
   [junit4]   2> 1581 T356 oas.SolrTestCaseJ4.tearDown ###Ending testThresholdTokenFrequency
   [junit4]   2> 1589 T356 C24 oasu.DirectUpdateHandler2.deleteAll [collection1] REMOVING
ALL DOCUMENTS FROM INDEX
   [junit4]   2> 1589 T356 C24 UPDATE [collection1] webapp=null path=null params={} {deleteByQuery=*:*}
0 0
   [junit4]   2> 1597 T356 C24 oasu.DirectUpdateHandler2.commit start commit{flags=0,version=0,optimize=false,openSearcher=true,waitSearcher=true,expungeDeletes=false,softCommit=false}
   [junit4]   2> 1602 T356 C24 oasc.SolrDeletionPolicy.onCommit SolrDeletionPolicy.onCommit:
commits:num=2
   [junit4]   2> 		commit{dir=MockDirWrapper(org.apache.lucene.store.RAMDirectory@211c6c4e
lockFactory=org.apache.lucene.store.NativeFSLockFactory@9da99bc),segFN=segments_2,generation=2,filenames=[_0_Lucene40_0.tim,
_0.fnm, _0_Lucene40_0.frq, _0_nrm.cfe, segments_2, _0.fdx, _0_nrm.cfs, _0.si, _0_Lucene40_0.prx,
_0.fdt, _0_Lucene40_0.tip]
   [junit4]   2> 		commit{dir=MockDirWrapper(org.apache.lucene.store.RAMDirectory@211c6c4e
lockFactory=org.apache.lucene.store.NativeFSLockFactory@9da99bc),segFN=segments_3,generation=3,filenames=[segments_3]
   [junit4]   2> 1602 T356 C24 oasc.SolrDeletionPolicy.updateCommits newest commit = 3
   [junit4]   2> 1608 T356 C24 oass.SolrIndexSearcher.<init> Opening Searcher@39779e4b
main
   [junit4]   2> 1608 T356 C24 oass.SolrIndexSearcher.<init> WARNING WARNING: Directory
impl does not support setting indexDir: org.apache.lucene.store.MockDirectoryWrapper
   [junit4]   2> 1609 T357 oashc.SpellCheckComponent$SpellCheckerListener.buildSpellIndex
Building spell index for spell checker: default
   [junit4]   2> 1612 T356 C24 oasu.DirectUpdateHandler2.commit end_commit_flush
   [junit4]   2> 1635 T357 oashc.SpellCheckComponent$SpellCheckerListener.buildSpellIndex
Building spell index for spell checker: default_teststop
   [junit4]   2> 1648 T357 oashc.SpellCheckComponent$SpellCheckerListener.buildSpellIndex
Building spell index for spell checker: threshold
   [junit4]   2> 1667 T357 oashc.SpellCheckComponent$SpellCheckerListener.buildSpellIndex
Building spell index for spell checker: threshold_direct
   [junit4]   2> 1667 T357 oashc.SpellCheckComponent$SpellCheckerListener.buildSpellIndex
Building spell index for spell checker: multipleFields
   [junit4]   2> 1690 T357 oashc.SpellCheckComponent$SpellCheckerListener.buildSpellIndex
Building spell index for spell checker: freq
   [junit4]   2> 1709 T357 oashc.SpellCheckComponent$SpellCheckerListener.buildSpellIndex
Building spell index for spell checker: fqcn
   [junit4]   2> 1724 T357 oasc.SolrCore.registerSearcher [collection1] Registered new
searcher Searcher@39779e4b main{StandardDirectoryReader(segments_3:4)}
   [junit4]   2> 1724 T356 C24 UPDATE [collection1] webapp=null path=null params={} {commit=}
0 127
   [junit4]   2> NOTE: reproduce with: ant test  -Dtestcase=SpellCheckComponentTest -Dtests.method=testThresholdTokenFrequency
-Dtests.seed=6587EC4535619BCC -Dtests.locale=es -Dtests.timezone=Africa/Nouakchott -Dargs="-Dfile.encoding=Cp1252"
   [junit4]   2>
   [junit4]    > (@AfterClass output)
   [junit4]   2> 6762 T356 oas.SolrTestCaseJ4.deleteCore ###deleteCore
   [junit4]   2> 6762 T356 oasc.CoreContainer.shutdown Shutting down CoreContainer instance=307199750
   [junit4]   2> 6763 T356 oasc.SolrCore.close [collection1]  CLOSING SolrCore org.apache.solr.core.SolrCore@13603408
   [junit4]   2> 6765 T356 oasc.SolrCore.closeSearcher [collection1] Closing main searcher
on request.
   [junit4]   2> 6765 T356 oasu.DirectUpdateHandler2.close closing DirectUpdateHandler2{commits=20,autocommits=0,soft
autocommits=0,optimizes=0,rollbacks=0,expungeDeletes=0,docsPending=0,adds=0,deletesById=0,deletesByQuery=0,errors=0,cumulative_adds=92,cumulative_deletesById=0,cumulative_deletesByQuery=9,cumulative_errors=0}
   [junit4]   2> !!!! WARNING: best effort to remove C:\Jenkins\workspace\Lucene-Solr-4.x-Windows-Java7-64\solr\build\solr-core\test\J0\.\solrtest-SpellCheckComponentTest-1339690623809\spellchecker1\_8.fdt
FAILED !!!!!
   [junit4]   2> !!!! WARNING: best effort to remove C:\Jenkins\workspace\Lucene-Solr-4.x-Windows-Java7-64\solr\build\solr-core\test\J0\.\solrtest-SpellCheckComponentTest-1339690623809\spellchecker1
FAILED !!!!!
   [junit4]   2> !!!! WARNING: best effort to remove C:\Jenkins\workspace\Lucene-Solr-4.x-Windows-Java7-64\solr\build\solr-core\test\J0\.\solrtest-SpellCheckComponentTest-1339690623809
FAILED !!!!!
   [junit4]   2> NOTE: test params are: codec=Appending, sim=DefaultSimilarity, locale=es,
timezone=Africa/Nouakchott
   [junit4]   2> NOTE: Windows 7 6.1 amd64/Oracle Corporation 1.7.0_04 (64-bit)/cpus=2,threads=1,free=94939904,total=206962688
   [junit4]   2> NOTE: All tests run in this JVM: [TestElisionFilterFactory, TestDFRSimilarityFactory,
TestItalianLightStemFilterFactory, FieldAnalysisRequestHandlerTest, FullSolrCloudTest, TestJmxIntegration,
XmlUpdateRequestHandlerTest, TestQueryTypes, TestSynonymMap, TestSolrXMLSerializer, TestDistributedSearch,
FastVectorHighlighterTest, PrimUtilsTest, UniqFieldsUpdateProcessorFactoryTest, LukeRequestHandlerTest,
SpellCheckComponentTest]
   [junit4]   2> 
   [junit4] Completed in 6.80s, 9 tests, 1 error <<< FAILURES!
[...truncated 1126 lines...]

[...truncated 11661 lines...]

[...truncated 11661 lines...]

[...truncated 11661 lines...]

[...truncated 11661 lines...]

[...truncated 11661 lines...]



Mime
View raw message