lucene-dev mailing list archives

Site index · List index
Message view « Date » · « Thread »
Top « Date » · « Thread »
From jenk...@sd-datasolutions.de
Subject [JENKINS] Lucene-Solr-trunk-Windows-Java6-64 - Build # 410 - Still Failing!
Date Mon, 04 Jun 2012 15:29:11 GMT
Build: http://jenkins.sd-datasolutions.de/job/Lucene-Solr-trunk-Windows-Java6-64/410/

1 tests failed.
FAILED:  org.apache.solr.handler.TestReplicationHandler.test

Error Message:
expected:<498> but was:<0>

Stack Trace:
java.lang.AssertionError: expected:<498> but was:<0>
	at __randomizedtesting.SeedInfo.seed([C5571D5587CDBA9E:4D03228F2931D766]:0)
	at org.junit.Assert.fail(Assert.java:93)
	at org.junit.Assert.failNotEquals(Assert.java:647)
	at org.junit.Assert.assertEquals(Assert.java:128)
	at org.junit.Assert.assertEquals(Assert.java:472)
	at org.junit.Assert.assertEquals(Assert.java:456)
	at org.apache.solr.handler.TestReplicationHandler.doTestIndexAndConfigReplication(TestReplicationHandler.java:391)
	at org.apache.solr.handler.TestReplicationHandler.test(TestReplicationHandler.java:250)
	at sun.reflect.NativeMethodAccessorImpl.invoke0(Native Method)
	at sun.reflect.NativeMethodAccessorImpl.invoke(NativeMethodAccessorImpl.java:39)
	at sun.reflect.DelegatingMethodAccessorImpl.invoke(DelegatingMethodAccessorImpl.java:25)
	at java.lang.reflect.Method.invoke(Method.java:597)
	at com.carrotsearch.randomizedtesting.RandomizedRunner.invoke(RandomizedRunner.java:1969)
	at com.carrotsearch.randomizedtesting.RandomizedRunner.access$1100(RandomizedRunner.java:132)
	at com.carrotsearch.randomizedtesting.RandomizedRunner$6.evaluate(RandomizedRunner.java:814)
	at com.carrotsearch.randomizedtesting.RandomizedRunner$7.evaluate(RandomizedRunner.java:875)
	at com.carrotsearch.randomizedtesting.RandomizedRunner$8.evaluate(RandomizedRunner.java:889)
	at com.carrotsearch.randomizedtesting.rules.SystemPropertiesRestoreRule$1.evaluate(SystemPropertiesRestoreRule.java:53)
	at org.apache.lucene.util.TestRuleSetupTeardownChained$1.evaluate(TestRuleSetupTeardownChained.java:50)
	at org.apache.lucene.util.TestRuleFieldCacheSanity$1.evaluate(TestRuleFieldCacheSanity.java:32)
	at org.apache.lucene.util.AbstractBeforeAfterRule$1.evaluate(AbstractBeforeAfterRule.java:45)
	at com.carrotsearch.randomizedtesting.rules.SystemPropertiesInvariantRule$1.evaluate(SystemPropertiesInvariantRule.java:55)
	at org.apache.lucene.util.TestRuleReportUncaughtExceptions$1.evaluate(TestRuleReportUncaughtExceptions.java:68)
	at org.apache.lucene.util.TestRuleThreadAndTestName$1.evaluate(TestRuleThreadAndTestName.java:48)
	at org.apache.lucene.util.TestRuleMarkFailure$1.evaluate(TestRuleMarkFailure.java:48)
	at com.carrotsearch.randomizedtesting.RandomizedRunner.runSingleTest(RandomizedRunner.java:821)
	at com.carrotsearch.randomizedtesting.RandomizedRunner.access$700(RandomizedRunner.java:132)
	at com.carrotsearch.randomizedtesting.RandomizedRunner$3$1.run(RandomizedRunner.java:669)
	at com.carrotsearch.randomizedtesting.RandomizedRunner$3.evaluate(RandomizedRunner.java:695)
	at com.carrotsearch.randomizedtesting.RandomizedRunner$4.evaluate(RandomizedRunner.java:734)
	at com.carrotsearch.randomizedtesting.RandomizedRunner$5.evaluate(RandomizedRunner.java:745)
	at com.carrotsearch.randomizedtesting.rules.SystemPropertiesRestoreRule$1.evaluate(SystemPropertiesRestoreRule.java:53)
	at org.apache.lucene.util.AbstractBeforeAfterRule$1.evaluate(AbstractBeforeAfterRule.java:45)
	at org.apache.lucene.util.TestRuleReportUncaughtExceptions$1.evaluate(TestRuleReportUncaughtExceptions.java:68)
	at org.apache.lucene.util.TestRuleStoreClassName$1.evaluate(TestRuleStoreClassName.java:38)
	at org.apache.lucene.util.TestRuleIcuHack$1.evaluate(TestRuleIcuHack.java:51)
	at com.carrotsearch.randomizedtesting.rules.SystemPropertiesInvariantRule$1.evaluate(SystemPropertiesInvariantRule.java:55)
	at org.apache.lucene.util.TestRuleNoInstanceHooksOverrides$1.evaluate(TestRuleNoInstanceHooksOverrides.java:53)
	at org.apache.lucene.util.TestRuleNoStaticHooksShadowing$1.evaluate(TestRuleNoStaticHooksShadowing.java:52)
	at org.apache.lucene.util.TestRuleAssertionsRequired$1.evaluate(TestRuleAssertionsRequired.java:36)
	at org.apache.lucene.util.TestRuleMarkFailure$1.evaluate(TestRuleMarkFailure.java:48)
	at org.apache.lucene.util.TestRuleIgnoreTestSuites$1.evaluate(TestRuleIgnoreTestSuites.java:56)
	at com.carrotsearch.randomizedtesting.RandomizedRunner.runSuite(RandomizedRunner.java:605)
	at com.carrotsearch.randomizedtesting.RandomizedRunner.access$400(RandomizedRunner.java:132)
	at com.carrotsearch.randomizedtesting.RandomizedRunner$2.run(RandomizedRunner.java:551)




Build Log:
[...truncated 13504 lines...]
   [junit4]   2> 37518 T2974 C178 REQ [collection1] webapp=/solr path=/replication params={command=filecontent&checksum=true&generation=7&wt=filestream&file=_3.fdx}
status=0 QTime=0 
   [junit4]   2> 37521 T2974 C178 REQ [collection1] webapp=/solr path=/replication params={command=filecontent&checksum=true&generation=7&wt=filestream&file=_3_nrm.cfs}
status=0 QTime=0 
   [junit4]   2> 37524 T2974 C178 REQ [collection1] webapp=/solr path=/replication params={command=filecontent&checksum=true&generation=7&wt=filestream&file=_3_Lucene40_0.tip}
status=0 QTime=0 
   [junit4]   2> 37528 T2974 C178 REQ [collection1] webapp=/solr path=/replication params={command=filecontent&checksum=true&generation=7&wt=filestream&file=segments_7}
status=0 QTime=0 
   [junit4]   2> 37532 T2974 C178 REQ [collection1] webapp=/solr path=/replication params={command=filecontent&checksum=true&generation=7&wt=filestream&file=_3_Lucene40_0.tim}
status=0 QTime=0 
   [junit4]   2> 37535 T2974 C178 REQ [collection1] webapp=/solr path=/replication params={command=filecontent&checksum=true&generation=7&wt=filestream&file=_3_Lucene40_0.frq}
status=0 QTime=0 
   [junit4]   2> 37538 T2974 C178 REQ [collection1] webapp=/solr path=/replication params={command=filecontent&checksum=true&generation=7&wt=filestream&file=_3.si}
status=0 QTime=0 
   [junit4]   2> 37541 T2974 C178 REQ [collection1] webapp=/solr path=/replication params={command=filecontent&checksum=true&generation=7&wt=filestream&file=_3.fnm}
status=0 QTime=0 
   [junit4]   2> 37544 T2974 C178 REQ [collection1] webapp=/solr path=/replication params={command=filecontent&checksum=true&generation=7&wt=filestream&file=_3.fdt}
status=0 QTime=0 
   [junit4]   2> 37545 T2990 oash.SnapPuller.fetchLatestIndex Total time taken for download
: 0 secs
   [junit4]   2> 37546 T2990 oash.SnapPuller.copyAFile SEVERE Unable to move index file
from: .\org.apache.solr.handler.TestReplicationHandler$SolrInstance-1338823592587\slave\data\index.20120604152709\_3_nrm.cfe
to: C:\Jenkins\workspace\Lucene-Solr-trunk-Windows-Java6-64\solr\build\solr-core\test\J0\org.apache.solr.handler.TestReplicationHandler$SolrInstance-1338823592587\slave\data\index.20120604152638\_3_nrm.cfe
Trying to do a copy
   [junit4]   2> 37546 T2990 oash.SnapPuller.copyAFile SEVERE Unable to copy index file
from: .\org.apache.solr.handler.TestReplicationHandler$SolrInstance-1338823592587\slave\data\index.20120604152709\_3_nrm.cfe
to: C:\Jenkins\workspace\Lucene-Solr-trunk-Windows-Java6-64\solr\build\solr-core\test\J0\org.apache.solr.handler.TestReplicationHandler$SolrInstance-1338823592587\slave\data\index.20120604152638\_3_nrm.cfe
java.io.FileNotFoundException: C:\Jenkins\workspace\Lucene-Solr-trunk-Windows-Java6-64\solr\build\solr-core\test\J0\org.apache.solr.handler.TestReplicationHandler$SolrInstance-1338823592587\slave\data\index.20120604152638\_3_nrm.cfe
(The system cannot find the path specified)
   [junit4]   2> 	at java.io.FileOutputStream.open(Native Method)
   [junit4]   2> 	at java.io.FileOutputStream.<init>(FileOutputStream.java:194)
   [junit4]   2> 	at java.io.FileOutputStream.<init>(FileOutputStream.java:145)
   [junit4]   2> 	at org.apache.solr.util.FileUtils.copyFile(FileUtils.java:48)
   [junit4]   2> 	at org.apache.solr.handler.SnapPuller.copyAFile(SnapPuller.java:654)
   [junit4]   2> 	at org.apache.solr.handler.SnapPuller.copyIndexFiles(SnapPuller.java:691)
   [junit4]   2> 	at org.apache.solr.handler.SnapPuller.fetchLatestIndex(SnapPuller.java:371)
   [junit4]   2> 	at org.apache.solr.handler.ReplicationHandler.doFetch(ReplicationHandler.java:298)
   [junit4]   2> 	at org.apache.solr.handler.SnapPuller$1.run(SnapPuller.java:169)
   [junit4]   2> 	at java.util.concurrent.Executors$RunnableAdapter.call(Executors.java:441)
   [junit4]   2> 	at java.util.concurrent.FutureTask$Sync.innerRunAndReset(FutureTask.java:317)
   [junit4]   2> 	at java.util.concurrent.FutureTask.runAndReset(FutureTask.java:150)
   [junit4]   2> 	at java.util.concurrent.ScheduledThreadPoolExecutor$ScheduledFutureTask.access$101(ScheduledThreadPoolExecutor.java:98)
   [junit4]   2> 	at java.util.concurrent.ScheduledThreadPoolExecutor$ScheduledFutureTask.runPeriodic(ScheduledThreadPoolExecutor.java:180)
   [junit4]   2> 	at java.util.concurrent.ScheduledThreadPoolExecutor$ScheduledFutureTask.run(ScheduledThreadPoolExecutor.java:204)
   [junit4]   2> 	at java.util.concurrent.ThreadPoolExecutor$Worker.runTask(ThreadPoolExecutor.java:886)
   [junit4]   2> 	at java.util.concurrent.ThreadPoolExecutor$Worker.run(ThreadPoolExecutor.java:908)
   [junit4]   2> 	at java.lang.Thread.run(Thread.java:662)
   [junit4]   2> 
   [junit4]   2> 37551 T2982 C179 REQ [collection1] webapp=/solr path=/select params={wt=javabin&q=*:*&version=2}
hits=0 status=0 QTime=0 
   [junit4]   2> 37653 T2982 C179 REQ [collection1] webapp=/solr path=/select params={wt=javabin&q=*:*&version=2}
hits=0 status=0 QTime=0 
   [junit4]   2> 37756 T2982 C179 REQ [collection1] webapp=/solr path=/select params={wt=javabin&q=*:*&version=2}
hits=0 status=0 QTime=0 
   [junit4]   2> 37858 T2982 C179 REQ [collection1] webapp=/solr path=/select params={wt=javabin&q=*:*&version=2}
hits=0 status=0 QTime=0 
   [junit4]   2> 37961 T2982 C179 REQ [collection1] webapp=/solr path=/select params={wt=javabin&q=*:*&version=2}
hits=0 status=0 QTime=0 
   [junit4]   2> 38063 T2982 C179 REQ [collection1] webapp=/solr path=/select params={wt=javabin&q=*:*&version=2}
hits=0 status=0 QTime=0 
   [junit4]   2> 38166 T2982 C179 REQ [collection1] webapp=/solr path=/select params={wt=javabin&q=*:*&version=2}
hits=0 status=0 QTime=0 
   [junit4]   2> 38268 T2982 C179 REQ [collection1] webapp=/solr path=/select params={wt=javabin&q=*:*&version=2}
hits=0 status=0 QTime=0 
   [junit4]   2> 38371 T2982 C179 REQ [collection1] webapp=/solr path=/select params={wt=javabin&q=*:*&version=2}
hits=0 status=0 QTime=0 
   [junit4]   2> 38474 T2982 C179 REQ [collection1] webapp=/solr path=/select params={wt=javabin&q=*:*&version=2}
hits=0 status=0 QTime=0 
   [junit4]   2> 38507 T2974 C178 REQ [collection1] webapp=/solr path=/replication params={command=indexversion&wt=javabin}
status=0 QTime=0 
   [junit4]   2> 38507 T2990 oash.SnapPuller.fetchLatestIndex Master's generation: 7
   [junit4]   2> 38507 T2990 oash.SnapPuller.fetchLatestIndex Slave's generation: 6
   [junit4]   2> 38507 T2990 oash.SnapPuller.fetchLatestIndex Starting replication process
   [junit4]   2> 38510 T2974 C178 REQ [collection1] webapp=/solr path=/replication params={command=filelist&wt=javabin&generation=7}
status=0 QTime=1 
   [junit4]   2> 38510 T2990 oash.SnapPuller.fetchLatestIndex Number of files in latest
index in master: 10
   [junit4]   2> 38513 T2974 C178 REQ [collection1] webapp=/solr path=/replication params={command=filecontent&checksum=true&generation=7&wt=filestream&file=_3_nrm.cfe}
status=0 QTime=0 
   [junit4]   2> 38516 T2974 C178 REQ [collection1] webapp=/solr path=/replication params={command=filecontent&checksum=true&generation=7&wt=filestream&file=_3.fdx}
status=0 QTime=0 
   [junit4]   2> 38518 T2974 C178 REQ [collection1] webapp=/solr path=/replication params={command=filecontent&checksum=true&generation=7&wt=filestream&file=_3_nrm.cfs}
status=0 QTime=0 
   [junit4]   2> 38521 T2974 C178 REQ [collection1] webapp=/solr path=/replication params={command=filecontent&checksum=true&generation=7&wt=filestream&file=_3_Lucene40_0.tip}
status=0 QTime=0 
   [junit4]   2> 38525 T2974 C178 REQ [collection1] webapp=/solr path=/replication params={command=filecontent&checksum=true&generation=7&wt=filestream&file=segments_7}
status=0 QTime=0 
   [junit4]   2> 38528 T2974 C178 REQ [collection1] webapp=/solr path=/replication params={command=filecontent&checksum=true&generation=7&wt=filestream&file=_3_Lucene40_0.tim}
status=0 QTime=0 
   [junit4]   2> 38532 T2974 C178 REQ [collection1] webapp=/solr path=/replication params={command=filecontent&checksum=true&generation=7&wt=filestream&file=_3_Lucene40_0.frq}
status=0 QTime=0 
   [junit4]   2> 38535 T2974 C178 REQ [collection1] webapp=/solr path=/replication params={command=filecontent&checksum=true&generation=7&wt=filestream&file=_3.si}
status=0 QTime=0 
   [junit4]   2> 38540 T2974 C178 REQ [collection1] webapp=/solr path=/replication params={command=filecontent&checksum=true&generation=7&wt=filestream&file=_3.fnm}
status=0 QTime=0 
   [junit4]   2> 38544 T2974 C178 REQ [collection1] webapp=/solr path=/replication params={command=filecontent&checksum=true&generation=7&wt=filestream&file=_3.fdt}
status=0 QTime=0 
   [junit4]   2> 38545 T2990 oash.SnapPuller.fetchLatestIndex Total time taken for download
: 0 secs
   [junit4]   2> 38546 T2990 oash.SnapPuller.copyAFile SEVERE Unable to move index file
from: .\org.apache.solr.handler.TestReplicationHandler$SolrInstance-1338823592587\slave\data\index.20120604152710\_3_nrm.cfe
to: C:\Jenkins\workspace\Lucene-Solr-trunk-Windows-Java6-64\solr\build\solr-core\test\J0\org.apache.solr.handler.TestReplicationHandler$SolrInstance-1338823592587\slave\data\index.20120604152638\_3_nrm.cfe
Trying to do a copy
   [junit4]   2> 38547 T2990 oash.SnapPuller.copyAFile SEVERE Unable to copy index file
from: .\org.apache.solr.handler.TestReplicationHandler$SolrInstance-1338823592587\slave\data\index.20120604152710\_3_nrm.cfe
to: C:\Jenkins\workspace\Lucene-Solr-trunk-Windows-Java6-64\solr\build\solr-core\test\J0\org.apache.solr.handler.TestReplicationHandler$SolrInstance-1338823592587\slave\data\index.20120604152638\_3_nrm.cfe
java.io.FileNotFoundException: C:\Jenkins\workspace\Lucene-Solr-trunk-Windows-Java6-64\solr\build\solr-core\test\J0\org.apache.solr.handler.TestReplicationHandler$SolrInstance-1338823592587\slave\data\index.20120604152638\_3_nrm.cfe
(The system cannot find the path specified)
   [junit4]   2> 	at java.io.FileOutputStream.open(Native Method)
   [junit4]   2> 	at java.io.FileOutputStream.<init>(FileOutputStream.java:194)
   [junit4]   2> 	at java.io.FileOutputStream.<init>(FileOutputStream.java:145)
   [junit4]   2> 	at org.apache.solr.util.FileUtils.copyFile(FileUtils.java:48)
   [junit4]   2> 	at org.apache.solr.handler.SnapPuller.copyAFile(SnapPuller.java:654)
   [junit4]   2> 	at org.apache.solr.handler.SnapPuller.copyIndexFiles(SnapPuller.java:691)
   [junit4]   2> 	at org.apache.solr.handler.SnapPuller.fetchLatestIndex(SnapPuller.java:371)
   [junit4]   2> 	at org.apache.solr.handler.ReplicationHandler.doFetch(ReplicationHandler.java:298)
   [junit4]   2> 	at org.apache.solr.handler.SnapPuller$1.run(SnapPuller.java:169)
   [junit4]   2> 	at java.util.concurrent.Executors$RunnableAdapter.call(Executors.java:441)
   [junit4]   2> 	at java.util.concurrent.FutureTask$Sync.innerRunAndReset(FutureTask.java:317)
   [junit4]   2> 	at java.util.concurrent.FutureTask.runAndReset(FutureTask.java:150)
   [junit4]   2> 	at java.util.concurrent.ScheduledThreadPoolExecutor$ScheduledFutureTask.access$101(ScheduledThreadPoolExecutor.java:98)
   [junit4]   2> 	at java.util.concurrent.ScheduledThreadPoolExecutor$ScheduledFutureTask.runPeriodic(ScheduledThreadPoolExecutor.java:180)
   [junit4]   2> 	at java.util.concurrent.ScheduledThreadPoolExecutor$ScheduledFutureTask.run(ScheduledThreadPoolExecutor.java:204)
   [junit4]   2> 	at java.util.concurrent.ThreadPoolExecutor$Worker.runTask(ThreadPoolExecutor.java:886)
   [junit4]   2> 	at java.util.concurrent.ThreadPoolExecutor$Worker.run(ThreadPoolExecutor.java:908)
   [junit4]   2> 	at java.lang.Thread.run(Thread.java:662)
   [junit4]   2> 
   [junit4]   2> 38576 T2982 C179 REQ [collection1] webapp=/solr path=/select params={wt=javabin&q=*:*&version=2}
hits=0 status=0 QTime=0 
   [junit4]   2> 38679 T2982 C179 REQ [collection1] webapp=/solr path=/select params={wt=javabin&q=*:*&version=2}
hits=0 status=0 QTime=0 
   [junit4]   2> 38781 T2924 oas.SolrTestCaseJ4.tearDown ###Ending test
   [junit4]   2> NOTE: reproduce with: ant test  -Dtestcase=TestReplicationHandler -Dtests.method=test
-Dtests.seed=C5571D5587CDBA9E -Dtests.locale=sk -Dtests.timezone=Africa/Banjul -Dargs="-Dfile.encoding=Cp1252"
   [junit4]   2>
   [junit4]    > (@AfterClass output)
   [junit4]   2> 38793 T2924 oasc.CoreContainer.shutdown Shutting down CoreContainer instance=1986655856
   [junit4]   2> 38794 T2924 oasc.SolrCore.close [collection1]  CLOSING SolrCore org.apache.solr.core.SolrCore@17514268
   [junit4]   2> 38795 T2924 oasc.SolrCore.closeSearcher [collection1] Closing main searcher
on request.
   [junit4]   2> 38795 T2924 oasu.DirectUpdateHandler2.close closing DirectUpdateHandler2{commits=4,autocommits=0,soft
autocommits=0,optimizes=0,rollbacks=0,expungeDeletes=0,docsPending=0,adds=0,deletesById=0,deletesByQuery=0,errors=0,cumulative_adds=997,cumulative_deletesById=0,cumulative_deletesByQuery=2,cumulative_errors=0}
   [junit4]   2> 38797 T2924 oejsh.ContextHandler.doStop stopped o.e.j.s.ServletContextHandler{/solr,null}
   [junit4]   2> 38850 T2924 oasc.CoreContainer.shutdown Shutting down CoreContainer instance=477977309
   [junit4]   2> 38850 T2924 oasc.SolrCore.close [collection1]  CLOSING SolrCore org.apache.solr.core.SolrCore@129917a0
   [junit4]   2> 38850 T2924 oasc.SolrCore.closeSearcher [collection1] Closing main searcher
on request.
   [junit4]   2> 38851 T2924 oasu.DirectUpdateHandler2.close closing DirectUpdateHandler2{commits=8,autocommits=0,soft
autocommits=0,optimizes=0,rollbacks=0,expungeDeletes=0,docsPending=0,adds=0,deletesById=0,deletesByQuery=0,errors=0,cumulative_adds=5,cumulative_deletesById=0,cumulative_deletesByQuery=0,cumulative_errors=0}
   [junit4]   2> 38851 T2924 oejsh.ContextHandler.doStop stopped o.e.j.s.ServletContextHandler{/solr,null}
   [junit4]   2> 38915 T2924 oas.SolrTestCaseJ4.deleteCore ###deleteCore
   [junit4]   2> NOTE: test params are: codec=Lucene40: {}, sim=RandomSimilarityProvider(queryNorm=true,coord=false):
{}, locale=sk, timezone=Africa/Banjul
   [junit4]   2> NOTE: Windows 7 6.1 amd64/Sun Microsystems Inc. 1.6.0_32 (64-bit)/cpus=2,threads=1,free=44222104,total=254476288
   [junit4]   2> NOTE: All tests run in this JVM: [TestDictionaryCompoundWordTokenFilterFactory,
TestTypeTokenFilterFactory, RAMDirectoryFactoryTest, TestIndexingPerformance, TestEnglishMinimalStemFilterFactory,
PrimitiveFieldTypeTest, TestUtils, DocumentBuilderTest, SuggesterWFSTTest, TestQueryUtils,
SuggesterFSTTest, LengthFilterTest, TestJmxIntegration, QueryParsingTest, TestJmxMonitoredMap,
TestDFRSimilarityFactory, RecoveryZkTest, TestQuerySenderListener, TestQuerySenderNoQuery,
SearchHandlerTest, TestUAX29URLEmailTokenizerFactory, PluginInfoTest, LegacyHTMLStripCharFilterTest,
TestDelimitedPayloadTokenFilterFactory, StatsComponentTest, DistributedQueryElevationComponentTest,
FullSolrCloudDistribCmdsTest, TestNorwegianMinimalStemFilterFactory, TermVectorComponentTest,
TestRangeQuery, TestIrishLowerCaseFilterFactory, CurrencyFieldTest, PrimUtilsTest, TestSort,
OpenExchangeRatesOrgProviderTest, TestPortugueseStemFilterFactory, TestGalicianMinimalStemFilterFactory,
TestHindiFilters, TestBrazilianStemFilterFactory, TestCodecSupport, FullSolrCloudTest, TestXIncludeConfig,
TestPluginEnable, TestCJKWidthFilterFactory, SolrIndexConfigTest, TestSwedishLightStemFilterFactory,
TestBulgarianStemFilterFactory, TestLFUCache, TestRealTimeGet, TestCJKBigramFilterFactory,
UUIDFieldTest, SuggesterTest, TestCollationField, TestConfig, TestRemoveDuplicatesTokenFilterFactory,
CommonGramsFilterFactoryTest, TestSolrXMLSerializer, TestLatvianStemFilterFactory, TestIndexSearcher,
TestIBSimilarityFactory, TestPhoneticFilterFactory, TestMergePolicyConfig, TestPerFieldSimilarity,
TestMultiCoreConfBootstrap, BadIndexSchemaTest, SimpleFacetsTest, SignatureUpdateProcessorFactoryTest,
CoreAdminHandlerTest, TestWikipediaTokenizerFactory, DirectSolrConnectionTest, TestGalicianStemFilterFactory,
TestFastLRUCache, TestCSVResponseWriter, TestExtendedDismaxParser, ZkSolrClientTest, TestDefaultSimilarityFactory,
SolrPluginUtilsTest, SolrCoreTest, DefaultValueUpdateProcessorTest, TestOmitPositions, SpellingQueryConverterTest,
TestDistributedGrouping, TestStemmerOverrideFilterFactory, RequiredFieldsTest, TestPHPSerializedResponseWriter,
TestJoin, TestValueSourceCache, TestLRUCache, TestSolrQueryParser, TestBinaryField, TestPropInjectDefaults,
TestRemoteStreaming, ShowFileRequestHandlerTest, TestTurkishLowerCaseFilterFactory, CacheHeaderTest,
TestFoldingMultitermQuery, CloudStateTest, TestQueryTypes, CommonGramsQueryFilterFactoryTest,
PeerSyncTest, JSONWriterTest, NodeStateWatcherTest, CSVRequestHandlerTest, TestFiltering,
TestThaiWordFilterFactory, TestPatternTokenizerFactory, TestStandardFactories, SolrInfoMBeanTest,
CopyFieldTest, BasicZkTest, MoreLikeThisHandlerTest, TestHashPartitioner, TestSuggestSpellingConverter,
TestGroupingSearch, SuggesterTSTTest, TestReverseStringFilterFactory, TestGermanStemFilterFactory,
TestTrie, SolrCmdDistributorTest, TestJapaneseTokenizerFactory, TestNGramFilters, ZkNodePropsTest,
TestSystemIdResolver, PingRequestHandlerTest, NumericFieldsTest, SpatialFilterTest, MinimalSchemaTest,
OverseerTest, TestCSVLoader, SpellCheckCollatorTest, FileBasedSpellCheckerTest, StandardRequestHandlerTest,
TestRandomFaceting, DOMUtilTest, BasicDistributedZkTest, TestRecovery, ReturnFieldsTest, DocumentAnalysisRequestHandlerTest,
TestJapaneseBaseFormFilterFactory, AlternateDirectoryTest, TestSolrDeletionPolicy1, TestUpdate,
TimeZoneUtilsTest, DateFieldTest, TestSearchPerf, TestKStemFilterFactory, DistributedSpellCheckComponentTest,
IndexReaderFactoryTest, TestHungarianLightStemFilterFactory, HighlighterConfigTest, SolrRequestParserTest,
TestKeepFilterFactory, BadComponentTest, AutoCommitTest, TestKeywordMarkerFilterFactory, TestPatternReplaceFilterFactory,
TestPortugueseLightStemFilterFactory, TestNumberUtils, TestCoreContainer, TestNorwegianLightStemFilterFactory,
TestLuceneMatchVersion, TestShingleFilterFactory, DateMathParserTest, TestBM25SimilarityFactory,
ConvertedLegacyTest, SortByFunctionTest, TermsComponentTest, NotRequiredUniqueKeyTest, XmlUpdateRequestHandlerTest,
TestCzechStemFilterFactory, DoubleMetaphoneFilterFactoryTest, TestCapitalizationFilterFactory,
OutputWriterTest, TestLMJelinekMercerSimilarityFactory, LeaderElectionTest, TestSolrDeletionPolicy2,
TestSpanishLightStemFilterFactory, SpellPossibilityIteratorTest, SolrCoreCheckLockOnStartupTest,
SoftAutoCommitTest, QueryElevationComponentTest, TestHTMLStripCharFilterFactory, LeaderElectionIntegrationTest,
TestGermanNormalizationFilterFactory, TestDistributedSearch, TestGermanLightStemFilterFactory,
RequestHandlersTest, XsltUpdateRequestHandlerTest, TestArabicFilters, TestStopFilterFactory,
IndexSchemaRuntimeFieldTest, SOLR749Test, TestIndonesianStemFilterFactory, TestGreekLowerCaseFilterFactory,
DisMaxRequestHandlerTest, TestFinnishLightStemFilterFactory, JsonLoaderTest, UpdateRequestProcessorFactoryTest,
TestLMDirichletSimilarityFactory, SampleTest, IndexBasedSpellCheckerTest, TestReplicationHandler]
   [junit4]   2> 
   [junit4] Completed in 38.92s, 1 test, 1 failure <<< FAILURES!
[...truncated 223 lines...]

[...truncated 13828 lines...]

[...truncated 13828 lines...]

[...truncated 13828 lines...]


Mime
View raw message