lucene-dev mailing list archives

Site index · List index
Message view « Date » · « Thread »
Top « Date » · « Thread »
From Apache Jenkins Server <jenk...@builds.apache.org>
Subject [JENKINS] Solr-4.x - Build # 15 - Still Failing
Date Wed, 20 Jun 2012 13:40:34 GMT
Build: https://builds.apache.org/job/Solr-4.x/15/

1 tests failed.
REGRESSION:  org.apache.solr.cloud.RecoveryZkTest.testDistribSearch

Error Message:
Thread threw an uncaught exception, thread: Thread[Lucene Merge Thread #2,6,]

Stack Trace:
java.lang.RuntimeException: Thread threw an uncaught exception, thread: Thread[Lucene Merge
Thread #2,6,]
	at com.carrotsearch.randomizedtesting.RunnerThreadGroup.processUncaught(RunnerThreadGroup.java:96)
	at com.carrotsearch.randomizedtesting.RandomizedRunner.runSingleTest(RandomizedRunner.java:857)
	at com.carrotsearch.randomizedtesting.RandomizedRunner.access$700(RandomizedRunner.java:132)
	at com.carrotsearch.randomizedtesting.RandomizedRunner$3$1.run(RandomizedRunner.java:669)
	at com.carrotsearch.randomizedtesting.RandomizedRunner$3.evaluate(RandomizedRunner.java:695)
	at com.carrotsearch.randomizedtesting.RandomizedRunner$4.evaluate(RandomizedRunner.java:734)
	at com.carrotsearch.randomizedtesting.RandomizedRunner$5.evaluate(RandomizedRunner.java:745)
	at com.carrotsearch.randomizedtesting.rules.SystemPropertiesRestoreRule$1.evaluate(SystemPropertiesRestoreRule.java:53)
	at org.apache.lucene.util.AbstractBeforeAfterRule$1.evaluate(AbstractBeforeAfterRule.java:45)
	at org.apache.lucene.util.TestRuleReportUncaughtExceptions$1.evaluate(TestRuleReportUncaughtExceptions.java:68)
	at org.apache.lucene.util.TestRuleStoreClassName$1.evaluate(TestRuleStoreClassName.java:38)
	at org.apache.lucene.util.TestRuleIcuHack$1.evaluate(TestRuleIcuHack.java:51)
	at com.carrotsearch.randomizedtesting.rules.SystemPropertiesInvariantRule$1.evaluate(SystemPropertiesInvariantRule.java:55)
	at org.apache.lucene.util.TestRuleNoInstanceHooksOverrides$1.evaluate(TestRuleNoInstanceHooksOverrides.java:53)
	at org.apache.lucene.util.TestRuleNoStaticHooksShadowing$1.evaluate(TestRuleNoStaticHooksShadowing.java:52)
	at org.apache.lucene.util.TestRuleAssertionsRequired$1.evaluate(TestRuleAssertionsRequired.java:36)
	at org.apache.lucene.util.TestRuleMarkFailure$1.evaluate(TestRuleMarkFailure.java:48)
	at org.apache.lucene.util.TestRuleIgnoreTestSuites$1.evaluate(TestRuleIgnoreTestSuites.java:56)
	at com.carrotsearch.randomizedtesting.RandomizedRunner.runSuite(RandomizedRunner.java:605)
	at com.carrotsearch.randomizedtesting.RandomizedRunner.access$400(RandomizedRunner.java:132)
	at com.carrotsearch.randomizedtesting.RandomizedRunner$2.run(RandomizedRunner.java:551)
Caused by: org.apache.lucene.index.MergePolicy$MergeException: org.apache.lucene.store.AlreadyClosedException:
this Directory is closed
	at __randomizedtesting.SeedInfo.seed([FF3D915D72044986]:0)
	at org.apache.lucene.index.ConcurrentMergeScheduler.handleMergeException(ConcurrentMergeScheduler.java:507)
	at org.apache.lucene.index.ConcurrentMergeScheduler$MergeThread.run(ConcurrentMergeScheduler.java:480)
Caused by: org.apache.lucene.store.AlreadyClosedException: this Directory is closed
	at org.apache.lucene.store.Directory.ensureOpen(Directory.java:244)
	at org.apache.lucene.store.FSDirectory.listAll(FSDirectory.java:241)
	at org.apache.lucene.index.IndexFileDeleter.refresh(IndexFileDeleter.java:321)
	at org.apache.lucene.index.IndexWriter.merge(IndexWriter.java:3138)
	at org.apache.lucene.index.ConcurrentMergeScheduler.doMerge(ConcurrentMergeScheduler.java:382)
	at org.apache.lucene.index.ConcurrentMergeScheduler$MergeThread.run(ConcurrentMergeScheduler.java:451)




Build Log:
[...truncated 43397 lines...]
   [junit4]   2> 27169 T2688 oasc.Overseer$CloudStateUpdater.run Starting to work on the
main queue
   [junit4]   2> 27208 T2516 oasc.CoreContainer.shutdown Shutting down CoreContainer instance=1189856813
   [junit4]   2> 27208 T2516 oasc.SolrCore.close [collection1]  CLOSING SolrCore org.apache.solr.core.SolrCore@157283b5
   [junit4]   2> 27209 T2516 oasc.SolrCore.closeSearcher [collection1] Closing main searcher
on request.
   [junit4]   2> 27210 T2516 oasu.DirectUpdateHandler2.close closing DirectUpdateHandler2{commits=3,autocommits=0,soft
autocommits=0,optimizes=0,rollbacks=0,expungeDeletes=0,docsPending=0,adds=0,deletesById=0,deletesByQuery=0,errors=0,cumulative_adds=1615,cumulative_deletesById=805,cumulative_deletesByQuery=0,cumulative_errors=0}
   [junit4]   2> 27211 T2521 oazs.PrepRequestProcessor.pRequest Processed session termination
for sessionid: 0x1380a124d240003
   [junit4]   2> 27212 T2549 oascc.ZkStateReader$3.process Updating live nodes
   [junit4]   2> 27212 T2569 oascc.ZkStateReader$3.process Updating live nodes
   [junit4]   2> 27212 T2565 oascc.ZkStateReader$3.process Updating live nodes
   [junit4]   2> 27212 T2518 oazs.NIOServerCnxn.closeSock Closed socket connection for
client /140.211.11.196:29205 which had sessionid 0x1380a124d240003
   [junit4]   2> 27212 T2549 oascc.ZkStateReader$3.process WARNING ZooKeeper watch triggered,
but Solr cannot talk to ZK
   [junit4]   2> 27212 T2516 oaz.ZooKeeper.close Session: 0x1380a124d240003 closed
   [junit4]   2> 27213 T2549 oaz.ClientCnxn$EventThread.run EventThread shut down
   [junit4]   2> 27213 T2516 oejsh.ContextHandler.doStop stopped o.e.j.s.ServletContextHandler{/solr,null}
   [junit4]   2> 27213 T2617 oascc.SolrZkClient.makePath makePath: /overseer_elect/leader
   [junit4]   2> 27215 T2617 oasc.Overseer.<init> Overseer (id=87831266453618695-127.0.0.1:29207_solr-n_0000000004)
starting
   [junit4]   2> 27215 T2521 oazs.PrepRequestProcessor.pRequest Got user-level KeeperException
when processing sessionid:0x1380a124d240007 type:create cxid:0x45 zxid:0xfffffffffffffffe
txntype:unknown reqpath:n/a Error Path:/solr/overseer Error:KeeperErrorCode = NodeExists for
/solr/overseer
   [junit4]   2> 27216 T2521 oazs.PrepRequestProcessor.pRequest Got user-level KeeperException
when processing sessionid:0x1380a124d240007 type:create cxid:0x46 zxid:0xfffffffffffffffe
txntype:unknown reqpath:n/a Error Path:/solr/overseer Error:KeeperErrorCode = NodeExists for
/solr/overseer
   [junit4]   2> 27217 T2521 oazs.PrepRequestProcessor.pRequest Got user-level KeeperException
when processing sessionid:0x1380a124d240007 type:create cxid:0x47 zxid:0xfffffffffffffffe
txntype:unknown reqpath:n/a Error Path:/solr/overseer Error:KeeperErrorCode = NodeExists for
/solr/overseer
   [junit4]   2> 27219 T2617 oascc.ZkStateReader$3.process Updating live nodes
   [junit4]   2> 27219 T2689 oasc.Overseer$CloudStateUpdater.run Starting to work on the
main queue
   [junit4]   2> 27219 T2617 oasc.RecoveryStrategy.close WARNING Stopping recovery for
core collection1 zkNodeName=127.0.0.1:29207_solr_collection1
   [junit4]   2> 27221 T2617 oascc.SolrZkClient.makePath makePath: /collections/collection1/leaders/shard1
   [junit4]   2> 27223 T2537 oasc.Overseer$CloudStateUpdater.amILeader WARNING  org.apache.zookeeper.KeeperException$SessionExpiredException:
KeeperErrorCode = Session expired for /overseer_elect/leader
   [junit4]   2> 	at org.apache.zookeeper.KeeperException.create(KeeperException.java:118)
   [junit4]   2> 	at org.apache.zookeeper.KeeperException.create(KeeperException.java:42)
   [junit4]   2> 	at org.apache.zookeeper.ZooKeeper.getData(ZooKeeper.java:927)
   [junit4]   2> 	at org.apache.solr.common.cloud.SolrZkClient$7.execute(SolrZkClient.java:289)
   [junit4]   2> 	at org.apache.solr.common.cloud.SolrZkClient$7.execute(SolrZkClient.java:286)
   [junit4]   2> 	at org.apache.solr.common.cloud.ZkCmdExecutor.retryOperation(ZkCmdExecutor.java:65)
   [junit4]   2> 	at org.apache.solr.common.cloud.SolrZkClient.getData(SolrZkClient.java:286)
   [junit4]   2> 	at org.apache.solr.cloud.Overseer$CloudStateUpdater.amILeader(Overseer.java:186)
   [junit4]   2> 	at org.apache.solr.cloud.Overseer$CloudStateUpdater.run(Overseer.java:111)
   [junit4]   2> 	at java.lang.Thread.run(Thread.java:679)
   [junit4]   2> 
   [junit4]   2> 27223 T2537 oasc.Overseer$CloudStateUpdater.amILeader According to ZK
I (id=87831266453618690-127.0.0.1:29202_solr-n_0000000000) am no longer a leader.
   [junit4]   2> 27223 T2521 oazs.PrepRequestProcessor.pRequest Got user-level KeeperException
when processing sessionid:0x1380a124d240007 type:create cxid:0x57 zxid:0xfffffffffffffffe
txntype:unknown reqpath:n/a Error Path:/solr/overseer Error:KeeperErrorCode = NodeExists for
/solr/overseer
   [junit4]   2> 27265 T2516 oasc.CoreContainer.shutdown Shutting down CoreContainer instance=588949883
   [junit4]   2> 27265 T2516 oasc.RecoveryStrategy.close WARNING Stopping recovery for
core collection1 zkNodeName=127.0.0.1:29207_solr_collection1
   [junit4]   2> 27265 T2516 oasc.SolrCore.close [collection1]  CLOSING SolrCore org.apache.solr.core.SolrCore@71a4b0de
   [junit4]   2> 27267 T2516 oasc.SolrCore.closeSearcher [collection1] Closing main searcher
on request.
   [junit4]   2> 27268 T2516 oasu.DirectUpdateHandler2.close closing DirectUpdateHandler2{commits=3,autocommits=0,soft
autocommits=0,optimizes=0,rollbacks=0,expungeDeletes=0,docsPending=0,adds=0,deletesById=0,deletesByQuery=0,errors=0,cumulative_adds=834,cumulative_deletesById=419,cumulative_deletesByQuery=0,cumulative_errors=0}
   [junit4]   2> 27269 T2516 oasc.RecoveryStrategy.close WARNING Stopping recovery for
core collection1 zkNodeName=127.0.0.1:29207_solr_collection1
   [junit4]   2> 27270 T2521 oazs.PrepRequestProcessor.pRequest Processed session termination
for sessionid: 0x1380a124d240007
   [junit4]   2> 27271 T2617 oascc.ZkStateReader$3.process Updating live nodes
   [junit4]   2> 27271 T2569 oascc.ZkStateReader$3.process Updating live nodes
   [junit4]   2> 27271 T2565 oascc.ZkStateReader$3.process Updating live nodes
   [junit4]   2> 27271 T2518 oazs.NIOServerCnxn.closeSock Closed socket connection for
client /140.211.11.196:29225 which had sessionid 0x1380a124d240007
   [junit4]   2> 27271 T2617 oascc.ZkStateReader$3.process WARNING ZooKeeper watch triggered,
but Solr cannot talk to ZK
   [junit4]   2> 27271 T2516 oaz.ZooKeeper.close Session: 0x1380a124d240007 closed
   [junit4]   2> 27271 T2617 oaz.ClientCnxn$EventThread.run EventThread shut down
   [junit4]   2> 27272 T2516 oejsh.ContextHandler.doStop stopped o.e.j.s.ServletContextHandler{/solr,null}
   [junit4]   2> 27324 T2521 oazs.PrepRequestProcessor.pRequest Processed session termination
for sessionid: 0x1380a124d240006
   [junit4]   2> 27327 T2569 oaz.ClientCnxn$EventThread.run EventThread shut down
   [junit4]   2> 27327 T2518 oazs.NIOServerCnxn.closeSock Closed socket connection for
client /140.211.11.196:29213 which had sessionid 0x1380a124d240006
   [junit4]   2> 27327 T2516 oaz.ZooKeeper.close Session: 0x1380a124d240006 closed
   [junit4]   2> 27328 T2521 oazs.PrepRequestProcessor.pRequest Processed session termination
for sessionid: 0x1380a124d240005
   [junit4]   2> 27329 T2565 oaz.ClientCnxn$EventThread.run EventThread shut down
   [junit4]   2> 27329 T2518 oazs.NIOServerCnxn.closeSock Closed socket connection for
client /140.211.11.196:29210 which had sessionid 0x1380a124d240005
   [junit4]   2> 27329 T2516 oaz.ZooKeeper.close Session: 0x1380a124d240005 closed
   [junit4]   2> 27329 T2521 oazs.PrepRequestProcessor.run PrepRequestProcessor exited
loop!
   [junit4]   2> 27329 T2520 oazs.SyncRequestProcessor.run SyncRequestProcessor exited!
   [junit4]   2> 27330 T2516 oazs.FinalRequestProcessor.shutdown shutdown of request processor
complete
   [junit4]   2> 27667 T2518 oazs.NIOServerCnxn$Factory.run NIOServerCnxn factory exited
run method
   [junit4]   2> 27671 T2688 oasc.Overseer$CloudStateUpdater.amILeader WARNING  org.apache.zookeeper.KeeperException$SessionExpiredException:
KeeperErrorCode = Session expired for /overseer_elect/leader
   [junit4]   2> 	at org.apache.zookeeper.KeeperException.create(KeeperException.java:118)
   [junit4]   2> 	at org.apache.zookeeper.KeeperException.create(KeeperException.java:42)
   [junit4]   2> 	at org.apache.zookeeper.ZooKeeper.getData(ZooKeeper.java:927)
   [junit4]   2> 	at org.apache.solr.common.cloud.SolrZkClient$7.execute(SolrZkClient.java:289)
   [junit4]   2> 	at org.apache.solr.common.cloud.SolrZkClient$7.execute(SolrZkClient.java:286)
   [junit4]   2> 	at org.apache.solr.common.cloud.ZkCmdExecutor.retryOperation(ZkCmdExecutor.java:65)
   [junit4]   2> 	at org.apache.solr.common.cloud.SolrZkClient.getData(SolrZkClient.java:286)
   [junit4]   2> 	at org.apache.solr.cloud.Overseer$CloudStateUpdater.amILeader(Overseer.java:186)
   [junit4]   2> 	at org.apache.solr.cloud.Overseer$CloudStateUpdater.run(Overseer.java:111)
   [junit4]   2> 	at java.lang.Thread.run(Thread.java:679)
   [junit4]   2> 
   [junit4]   2> 27671 T2516 oazs.FinalRequestProcessor.shutdown shutdown of request processor
complete
   [junit4]   2> 27671 T2688 oasc.Overseer$CloudStateUpdater.amILeader According to ZK
I (id=87831266453618691-127.0.0.1:29204_solr-n_0000000001) am no longer a leader.
   [junit4]   2> 27721 T2689 oasc.Overseer$CloudStateUpdater.amILeader WARNING  org.apache.zookeeper.KeeperException$SessionExpiredException:
KeeperErrorCode = Session expired for /overseer_elect/leader
   [junit4]   2> 	at org.apache.zookeeper.KeeperException.create(KeeperException.java:118)
   [junit4]   2> 	at org.apache.zookeeper.KeeperException.create(KeeperException.java:42)
   [junit4]   2> 	at org.apache.zookeeper.ZooKeeper.getData(ZooKeeper.java:927)
   [junit4]   2> 	at org.apache.solr.common.cloud.SolrZkClient$7.execute(SolrZkClient.java:289)
   [junit4]   2> 	at org.apache.solr.common.cloud.SolrZkClient$7.execute(SolrZkClient.java:286)
   [junit4]   2> 	at org.apache.solr.common.cloud.ZkCmdExecutor.retryOperation(ZkCmdExecutor.java:65)
   [junit4]   2> 	at org.apache.solr.common.cloud.SolrZkClient.getData(SolrZkClient.java:286)
   [junit4]   2> 	at org.apache.solr.cloud.Overseer$CloudStateUpdater.amILeader(Overseer.java:186)
   [junit4]   2> 	at org.apache.solr.cloud.Overseer$CloudStateUpdater.run(Overseer.java:111)
   [junit4]   2> 	at java.lang.Thread.run(Thread.java:679)
   [junit4]   2> 
   [junit4]   2> 27721 T2689 oasc.Overseer$CloudStateUpdater.amILeader According to ZK
I (id=87831266453618695-127.0.0.1:29207_solr-n_0000000004) am no longer a leader.
   [junit4]   2> 27735 T2516 oas.SolrTestCaseJ4.tearDown ###Ending testDistribSearch
   [junit4]   2> NOTE: reproduce with: ant test  -Dtestcase=RecoveryZkTest -Dtests.method=testDistribSearch
-Dtests.seed=FF3D915D72044986 -Dtests.locale=ar_OM -Dtests.timezone=Pacific/Efate -Dargs="-Dfile.encoding=ISO8859-1"
   [junit4]   2>
   [junit4]    > (@AfterClass output)
   [junit4]   2> 27767 T2516 oas.SolrTestCaseJ4.deleteCore ###deleteCore
   [junit4]   2> NOTE: test params are: codec=Lucene40: {}, sim=DefaultSimilarity, locale=ar_OM,
timezone=Pacific/Efate
   [junit4]   2> NOTE: FreeBSD 9.0-RELEASE amd64/Sun Microsystems Inc. 1.6.0_32 (64-bit)/cpus=16,threads=4,free=119752008,total=339083264
   [junit4]   2> NOTE: All tests run in this JVM: [DefaultValueUpdateProcessorTest, TestGreekLowerCaseFilterFactory,
DocumentAnalysisRequestHandlerTest, ReturnFieldsTest, SpellPossibilityIteratorTest, JSONWriterTest,
TestSearchPerf, TestJmxMonitoredMap, TestPortugueseLightStemFilterFactory, TestRealTimeGet,
SuggesterTest, TestGalicianStemFilterFactory, TestQuerySenderNoQuery, PolyFieldTest, TestArbitraryIndexDir,
DisMaxRequestHandlerTest, SuggesterWFSTTest, SimpleFacetsTest, QueryElevationComponentTest,
TestFrenchLightStemFilterFactory, SampleTest, ZkSolrClientTest, DebugComponentTest, TestSuggestSpellingConverter,
CacheHeaderTest, TestFaceting, TestGermanNormalizationFilterFactory, DOMUtilTest, AlternateDirectoryTest,
BadComponentTest, LukeRequestHandlerTest, SpellingQueryConverterTest, NumericFieldsTest, TestChineseFilterFactory,
TestPortugueseMinimalStemFilterFactory, SolrPluginUtilsTest, SoftAutoCommitTest, BinaryUpdateRequestHandlerTest,
TestRecovery, AutoCommitTest, SystemInfoHandlerTest, TestUtils, TestMergePolicyConfig, TestPortugueseStemFilterFactory,
CurrencyFieldTest, TestRussianLightStemFilterFactory, TestStandardFactories, TestFastLRUCache,
BasicFunctionalityTest, TestTrimFilterFactory, CloudStateTest, TestKeywordMarkerFilterFactory,
DistributedTermsComponentTest, UpdateRequestProcessorFactoryTest, TestBulgarianStemFilterFactory,
TestPropInjectDefaults, XmlUpdateRequestHandlerTest, DirectSolrSpellCheckerTest, TestSynonymMap,
TestConfig, TestCJKBigramFilterFactory, TestLuceneMatchVersion, CommonGramsFilterFactoryTest,
TestHindiFilters, ZkControllerTest, TestGroupingSearch, CloudStateUpdateTest, TestGermanLightStemFilterFactory,
TestItalianLightStemFilterFactory, SolrInfoMBeanTest, IndexSchemaTest, TestStopFilterFactory,
UniqFieldsUpdateProcessorFactoryTest, TestHTMLStripCharFilterFactory, TestLMJelinekMercerSimilarityFactory,
TestNorwegianLightStemFilterFactory, TestFinnishLightStemFilterFactory, BadIndexSchemaTest,
TestPatternReplaceFilterFactory, SolrIndexConfigTest, TestJapaneseTokenizerFactory, TestBinaryField,
TestFiltering, TestSynonymFilterFactory, PrimitiveFieldTypeTest, DoubleMetaphoneFilterFactoryTest,
TestNumberUtils, ZkNodePropsTest, NoCacheHeaderTest, TestSolrXMLSerializer, TestSort, TestQueryTypes,
CSVRequestHandlerTest, BasicZkTest, CommonGramsQueryFilterFactoryTest, IndexSchemaRuntimeFieldTest,
SolrCmdDistributorTest, TestPhoneticFilterFactory, UpdateParamsTest, QueryEqualityTest, DocumentBuilderTest,
TestCollationField, ResourceLoaderTest, DirectUpdateHandlerTest, TestRemoteStreaming, EchoParamsTest,
SuggesterTSTTest, TestCzechStemFilterFactory, SuggesterFSTTest, TestReverseStringFilterFactory,
TestPHPSerializedResponseWriter, TestHyphenationCompoundWordTokenFilterFactory, TestBrazilianStemFilterFactory,
TestJoin, OverseerTest, TestUpdate, TestTypeTokenFilterFactory, HighlighterTest, LengthFilterTest,
NotRequiredUniqueKeyTest, TestCSVLoader, TestQueryUtils, TestWordDelimiterFilterFactory, StatsComponentTest,
FullSolrCloudDistribCmdsTest, OpenExchangeRatesOrgProviderTest, TestCJKTokenizerFactory, TestBM25SimilarityFactory,
TestThaiWordFilterFactory, IndexReaderFactoryTest, TestShingleFilterFactory, FieldMutatingUpdateProcessorTest,
TestFrenchMinimalStemFilterFactory, TestCollationKeyRangeQueries, DistributedQueryElevationComponentTest,
FieldAnalysisRequestHandlerTest, ConvertedLegacyTest, TestNorwegianMinimalStemFilterFactory,
TestBadConfig, DateMathParserTest, LeaderElectionIntegrationTest, SignatureUpdateProcessorFactoryTest,
SolrRequestParserTest, TestExtendedDismaxParser, MultiTermTest, FileBasedSpellCheckerTest,
StandardRequestHandlerTest, TestJapaneseBaseFormFilterFactory, TestJapaneseKatakanaStemFilterFactory,
TestFoldingMultitermQuery, IndexBasedSpellCheckerTest, TestSpanishLightStemFilterFactory,
TestHunspellStemFilterFactory, TestRandomFaceting, TestTrie, TestCSVResponseWriter, LeaderElectionTest,
TestXIncludeConfig, SearchHandlerTest, RecoveryZkTest]
   [junit4]   2> 
   [junit4] Completed in 27.79s, 1 test, 1 error <<< FAILURES!
[...truncated 404 lines...]

[...truncated 43902 lines...]

[...truncated 43902 lines...]

[...truncated 43902 lines...]

[...truncated 43902 lines...]

[...truncated 43902 lines...]



Mime
View raw message