lucene-dev mailing list archives

Site index · List index
Message view « Date » · « Thread »
Top « Date » · « Thread »
From Apache Jenkins Server <jenk...@builds.apache.org>
Subject [JENKINS] Lucene-Solr-tests-only-trunk-java7 - Build # 2763 - Failure
Date Mon, 04 Jun 2012 13:34:58 GMT
Build: https://builds.apache.org/job/Lucene-Solr-tests-only-trunk-java7/2763/

1 tests failed.
FAILED:  junit.framework.TestSuite.org.apache.solr.handler.TestReplicationHandler

Error Message:
ERROR: SolrIndexSearcher opens=74 closes=73

Stack Trace:
java.lang.AssertionError: ERROR: SolrIndexSearcher opens=74 closes=73
	at __randomizedtesting.SeedInfo.seed([53F76BC991FDF6A]:0)
	at org.junit.Assert.fail(Assert.java:93)
	at org.apache.solr.SolrTestCaseJ4.endTrackingSearchers(SolrTestCaseJ4.java:190)
	at org.apache.solr.SolrTestCaseJ4.afterClass(SolrTestCaseJ4.java:82)
	at sun.reflect.GeneratedMethodAccessor16.invoke(Unknown Source)
	at sun.reflect.DelegatingMethodAccessorImpl.invoke(DelegatingMethodAccessorImpl.java:43)
	at java.lang.reflect.Method.invoke(Method.java:601)
	at com.carrotsearch.randomizedtesting.RandomizedRunner.invoke(RandomizedRunner.java:1969)
	at com.carrotsearch.randomizedtesting.RandomizedRunner.access$1100(RandomizedRunner.java:132)
	at com.carrotsearch.randomizedtesting.RandomizedRunner$5.evaluate(RandomizedRunner.java:752)
	at com.carrotsearch.randomizedtesting.rules.SystemPropertiesRestoreRule$1.evaluate(SystemPropertiesRestoreRule.java:53)
	at org.apache.lucene.util.AbstractBeforeAfterRule$1.evaluate(AbstractBeforeAfterRule.java:45)
	at org.apache.lucene.util.TestRuleReportUncaughtExceptions$1.evaluate(TestRuleReportUncaughtExceptions.java:68)
	at org.apache.lucene.util.TestRuleStoreClassName$1.evaluate(TestRuleStoreClassName.java:38)
	at org.apache.lucene.util.TestRuleIcuHack$1.evaluate(TestRuleIcuHack.java:51)
	at com.carrotsearch.randomizedtesting.rules.SystemPropertiesInvariantRule$1.evaluate(SystemPropertiesInvariantRule.java:55)
	at org.apache.lucene.util.TestRuleNoInstanceHooksOverrides$1.evaluate(TestRuleNoInstanceHooksOverrides.java:53)
	at org.apache.lucene.util.TestRuleNoStaticHooksShadowing$1.evaluate(TestRuleNoStaticHooksShadowing.java:52)
	at org.apache.lucene.util.TestRuleAssertionsRequired$1.evaluate(TestRuleAssertionsRequired.java:36)
	at org.apache.lucene.util.TestRuleMarkFailure$1.evaluate(TestRuleMarkFailure.java:48)
	at org.apache.lucene.util.TestRuleIgnoreTestSuites$1.evaluate(TestRuleIgnoreTestSuites.java:56)
	at com.carrotsearch.randomizedtesting.RandomizedRunner.runSuite(RandomizedRunner.java:605)
	at com.carrotsearch.randomizedtesting.RandomizedRunner.access$400(RandomizedRunner.java:132)
	at com.carrotsearch.randomizedtesting.RandomizedRunner$2.run(RandomizedRunner.java:551)




Build Log:
[...truncated 11052 lines...]
   [junit4]   2> 208 T2020 oasc.RequestHandlers.initHandlersFromConfig created standard:
solr.StandardRequestHandler
   [junit4]   2> 208 T2020 oasc.RequestHandlers.initHandlersFromConfig created defaults:
solr.StandardRequestHandler
   [junit4]   2> 209 T2020 oasc.RequestHandlers.initHandlersFromConfig adding lazy requestHandler:
solr.StandardRequestHandler
   [junit4]   2> 209 T2020 oasc.RequestHandlers.initHandlersFromConfig created lazy: solr.StandardRequestHandler
   [junit4]   2> 209 T2020 oasc.RequestHandlers.initHandlersFromConfig created /update:
solr.UpdateRequestHandler
   [junit4]   2> 209 T2020 oasc.RequestHandlers.initHandlersFromConfig created /replication:
solr.ReplicationHandler
   [junit4]   2> 210 T2020 oashl.XMLLoader.init xsltCacheLifetimeSeconds=60
   [junit4]   2> 212 T2020 oass.SolrIndexSearcher.<init> Opening Searcher@1f1dfa97
main
   [junit4]   2> 212 T2020 oasu.CommitTracker.<init> Hard AutoCommit: disabled
   [junit4]   2> 212 T2020 oasu.CommitTracker.<init> Soft AutoCommit: disabled
   [junit4]   2> 214 T2020 oash.SnapPuller.startExecutorService Poll Scheduled at an interval
of 1000ms
   [junit4]   2> 214 T2040 oasc.SolrCore.registerSearcher [collection1] Registered new
searcher Searcher@1f1dfa97 main{StandardDirectoryReader(segments_1:1)}
   [junit4]   2> 214 T2020 oasc.CoreContainer.register registering core: collection1
   [junit4]   2> 214 T2020 oass.SolrDispatchFilter.init user.dir=/usr/home/hudson/hudson-slave/workspace/Lucene-Solr-tests-only-trunk-java7/checkout/solr/build/solr-core/test/J0
   [junit4]   2> 214 T2020 oass.SolrDispatchFilter.init SolrDispatchFilter.init() done
   [junit4]   2> 215 T2020 oascsi.HttpClientUtil.createClient Creating new http client,
config:maxConnections=128&maxConnectionsPerHost=32&followRedirects=false
   [junit4]   2> 
   [junit4]    > (@AfterClass output)
   [junit4]   2> 27365 T2020 oasc.CoreContainer.shutdown Shutting down CoreContainer instance=1637263305
   [junit4]   2> 27365 T2020 oasc.SolrCore.close [collection1]  CLOSING SolrCore org.apache.solr.core.SolrCore@6d0077a9
   [junit4]   2> 27365 T2020 oasc.SolrCore.closeSearcher [collection1] Closing main searcher
on request.
   [junit4]   2> 27365 T2020 oasu.DirectUpdateHandler2.close closing DirectUpdateHandler2{commits=1,autocommits=0,soft
autocommits=0,optimizes=0,rollbacks=0,expungeDeletes=0,docsPending=0,adds=0,deletesById=0,deletesByQuery=0,errors=0,cumulative_adds=493,cumulative_deletesById=0,cumulative_deletesByQuery=1,cumulative_errors=0}
   [junit4]   2> 27367 T2020 oejsh.ContextHandler.doStop stopped o.e.j.s.ServletContextHandler{/solr,null}
   [junit4]   2> 27419 T2020 oasc.CoreContainer.shutdown Shutting down CoreContainer instance=1551457822
   [junit4]   2> 27419 T2020 oasc.SolrCore.close [collection1]  CLOSING SolrCore org.apache.solr.core.SolrCore@ebe92eb
   [junit4]   2> 27420 T2020 oasc.SolrCore.closeSearcher [collection1] Closing main searcher
on request.
   [junit4]   2> 27420 T2020 oasu.DirectUpdateHandler2.close closing DirectUpdateHandler2{commits=2,autocommits=0,soft
autocommits=0,optimizes=0,rollbacks=0,expungeDeletes=0,docsPending=0,adds=0,deletesById=0,deletesByQuery=0,errors=0,cumulative_adds=1,cumulative_deletesById=0,cumulative_deletesByQuery=0,cumulative_errors=0}
   [junit4]   2> 27421 T2020 oejsh.ContextHandler.doStop stopped o.e.j.s.ServletContextHandler{/solr,null}
   [junit4]   2> 27478 T2020 oas.SolrTestCaseJ4.deleteCore ###deleteCore
   [junit4]   2> 30362 T2223 oash.SnapPuller.fetchLatestIndex SEVERE Master at: http://localhost:28601/solr/replication
is not available. Index fetch failed. Exception: Connect to localhost:28601 timed out
   [junit4]   2> 30362 T2223 oash.SnapPuller.logReplicationTimeAndConfFiles WARNING Exception
while updating statistics java.io.FileNotFoundException: ./org.apache.solr.handler.TestReplicationHandler$SolrInstance-1338816643753/slave/data/replication.properties
(No such file or directory)
   [junit4]   2> 	at java.io.FileOutputStream.open(Native Method)
   [junit4]   2> 	at java.io.FileOutputStream.<init>(FileOutputStream.java:212)
   [junit4]   2> 	at java.io.FileOutputStream.<init>(FileOutputStream.java:165)
   [junit4]   2> 	at org.apache.solr.handler.SnapPuller.logReplicationTimeAndConfFiles(SnapPuller.java:469)
   [junit4]   2> 	at org.apache.solr.handler.SnapPuller.fetchLatestIndex(SnapPuller.java:395)
   [junit4]   2> 	at org.apache.solr.handler.ReplicationHandler.doFetch(ReplicationHandler.java:298)
   [junit4]   2> 	at org.apache.solr.handler.SnapPuller$1.run(SnapPuller.java:169)
   [junit4]   2> 	at java.util.concurrent.Executors$RunnableAdapter.call(Executors.java:471)
   [junit4]   2> 	at java.util.concurrent.FutureTask$Sync.innerRunAndReset(FutureTask.java:351)
   [junit4]   2> 	at java.util.concurrent.FutureTask.runAndReset(FutureTask.java:178)
   [junit4]   2> 	at java.util.concurrent.ScheduledThreadPoolExecutor$ScheduledFutureTask.access$301(ScheduledThreadPoolExecutor.java:178)
   [junit4]   2> 	at java.util.concurrent.ScheduledThreadPoolExecutor$ScheduledFutureTask.run(ScheduledThreadPoolExecutor.java:293)
   [junit4]   2> 	at java.util.concurrent.ThreadPoolExecutor.runWorker(ThreadPoolExecutor.java:1110)
   [junit4]   2> 	at java.util.concurrent.ThreadPoolExecutor$Worker.run(ThreadPoolExecutor.java:603)
   [junit4]   2> 	at java.lang.Thread.run(Thread.java:722)
   [junit4]   2> 
   [junit4]   2> 37452 T368 oaz.ClientCnxn$SendThread.run Client session timed out, have
not heard from server in 12001ms for sessionid 0x137b7a9535d0010, closing socket connection
and attempting reconnect
   [junit4]   2> 39116 T368 oaz.ClientCnxn$SendThread.startConnect Opening socket connection
to server localhost/127.0.0.1:55428
   [junit4]   2> 49554 T368 oaz.ClientCnxn$SendThread.run Client session timed out, have
not heard from server in 12001ms for sessionid 0x137b7a9535d0010, closing socket connection
and attempting reconnect
   [junit4]   2> 50703 T368 oaz.ClientCnxn$SendThread.startConnect Opening socket connection
to server localhost/127.0.0.1:55428
   [junit4]   2> 61656 T368 oaz.ClientCnxn$SendThread.run Client session timed out, have
not heard from server in 12001ms for sessionid 0x137b7a9535d0010, closing socket connection
and attempting reconnect
   [junit4]   2> 63050 T368 oaz.ClientCnxn$SendThread.startConnect Opening socket connection
to server localhost/127.0.0.1:55428
   [junit4]   2> 73758 T368 oaz.ClientCnxn$SendThread.run Client session timed out, have
not heard from server in 12001ms for sessionid 0x137b7a9535d0010, closing socket connection
and attempting reconnect
   [junit4]   2> 74958 T368 oaz.ClientCnxn$SendThread.startConnect Opening socket connection
to server localhost/127.0.0.1:55428
   [junit4]   2> 85860 T368 oaz.ClientCnxn$SendThread.run Client session timed out, have
not heard from server in 12001ms for sessionid 0x137b7a9535d0010, closing socket connection
and attempting reconnect
   [junit4]   2> 87295 T368 oaz.ClientCnxn$SendThread.startConnect Opening socket connection
to server localhost/127.0.0.1:55428
   [junit4]   2> 97962 T368 oaz.ClientCnxn$SendThread.run Client session timed out, have
not heard from server in 12001ms for sessionid 0x137b7a9535d0010, closing socket connection
and attempting reconnect
   [junit4]   2> 99283 T368 oaz.ClientCnxn$SendThread.startConnect Opening socket connection
to server localhost/127.0.0.1:55428
   [junit4]   2> 110064 T368 oaz.ClientCnxn$SendThread.run Client session timed out, have
not heard from server in 12001ms for sessionid 0x137b7a9535d0010, closing socket connection
and attempting reconnect
   [junit4]   2> 112038 T368 oaz.ClientCnxn$SendThread.startConnect Opening socket connection
to server localhost/127.0.0.1:55428
   [junit4]   2> 122166 T368 oaz.ClientCnxn$SendThread.run Client session timed out, have
not heard from server in 12001ms for sessionid 0x137b7a9535d0010, closing socket connection
and attempting reconnect
   [junit4]   2> 123874 T368 oaz.ClientCnxn$SendThread.startConnect Opening socket connection
to server localhost/127.0.0.1:55428
   [junit4]   2> 134268 T368 oaz.ClientCnxn$SendThread.run Client session timed out, have
not heard from server in 12001ms for sessionid 0x137b7a9535d0010, closing socket connection
and attempting reconnect
   [junit4]   2> 135429 T368 oaz.ClientCnxn$SendThread.startConnect Opening socket connection
to server localhost/127.0.0.1:55428
   [junit4]   2> 146370 T368 oaz.ClientCnxn$SendThread.run Client session timed out, have
not heard from server in 12001ms for sessionid 0x137b7a9535d0010, closing socket connection
and attempting reconnect
   [junit4]   2> 148466 T368 oaz.ClientCnxn$SendThread.startConnect Opening socket connection
to server localhost/127.0.0.1:55428
   [junit4]   2> 148599 T2020 oas.SolrTestCaseJ4.endTrackingSearchers SEVERE ERROR: SolrIndexSearcher
opens=74 closes=73
   [junit4]   2> NOTE: test params are: codec=Lucene40: {}, sim=RandomSimilarityProvider(queryNorm=false,coord=true):
{}, locale=ar_DZ, timezone=Europe/Kaliningrad
   [junit4]   2> NOTE: FreeBSD 9.0-RELEASE amd64/Oracle Corporation 1.7.0_02 (64-bit)/cpus=16,threads=1,free=323668240,total=536870912
   [junit4]   2> NOTE: All tests run in this JVM: [TestWordDelimiterFilterFactory, LoggingHandlerTest,
TestTurkishLowerCaseFilterFactory, TestUAX29URLEmailTokenizerFactory, TestGermanStemFilterFactory,
MinimalSchemaTest, TestCJKWidthFilterFactory, TestReversedWildcardFilterFactory, TestOmitPositions,
PrimUtilsTest, StandardRequestHandlerTest, TestNumberUtils, TestNorwegianLightStemFilterFactory,
BadIndexSchemaTest, TestDistributedSearch, TestReverseStringFilterFactory, TestCoreContainer,
PrimitiveFieldTypeTest, FieldAnalysisRequestHandlerTest, TestDictionaryCompoundWordTokenFilterFactory,
HighlighterTest, TestGermanNormalizationFilterFactory, TestRemoveDuplicatesTokenFilterFactory,
TestKeepFilterFactory, TestQuerySenderNoQuery, JsonLoaderTest, TestStandardFactories, TestStopFilterFactory,
FullSolrCloudTest, TestMultiCoreConfBootstrap, TestHindiFilters, SampleTest, TestFrenchMinimalStemFilterFactory,
TestJoin, SpatialFilterTest, BasicZkTest, TestIndexSearcher, LeaderElectionTest, TestCSVLoader,
TestJmxMonitoredMap, TestStemmerOverrideFilterFactory, TestShingleFilterFactory, TestArbitraryIndexDir,
RequestHandlersTest, StatsComponentTest, TestDocSet, TestFoldingMultitermQuery, LengthFilterTest,
TestPseudoReturnFields, TestKStemFilterFactory, DirectUpdateHandlerOptimizeTest, LegacyHTMLStripCharFilterTest,
BinaryUpdateRequestHandlerTest, CommonGramsFilterFactoryTest, PluginInfoTest, DateFieldTest,
TestTrie, DistributedTermsComponentTest, TestDelimitedPayloadTokenFilterFactory, MultiTermTest,
ZkControllerTest, FullSolrCloudDistribCmdsTest, TestItalianLightStemFilterFactory, DirectSolrConnectionTest,
TestSwedishLightStemFilterFactory, HighlighterConfigTest, TestDFRSimilarityFactory, OpenExchangeRatesOrgProviderTest,
DateMathParserTest, TestUpdate, NotRequiredUniqueKeyTest, TestUtils, FieldMutatingUpdateProcessorTest,
TestWriterPerf, TestIrishLowerCaseFilterFactory, TestPhoneticFilterFactory, TestHTMLStripCharFilterFactory,
ShowFileRequestHandlerTest, FastVectorHighlighterTest, TestBrazilianStemFilterFactory, TestLMJelinekMercerSimilarityFactory,
TestQuerySenderListener, TestEnglishMinimalStemFilterFactory, TestMergePolicyConfig, CSVRequestHandlerTest,
LeaderElectionIntegrationTest, SolrCmdDistributorTest, DirectUpdateHandlerTest, BasicFunctionalityTest,
LukeRequestHandlerTest, TestPatternReplaceCharFilterFactory, TestFastLRUCache, UpdateParamsTest,
TestBeiderMorseFilterFactory, TestLMDirichletSimilarityFactory, TestHunspellStemFilterFactory,
TestJapanesePartOfSpeechStopFilterFactory, PeerSyncTest, TermVectorComponentTest, DoubleMetaphoneFilterFactoryTest,
RecoveryZkTest, BasicDistributedZkTest, TestReplicationHandler]
   [junit4]   2> NOTE: reproduce with: ant test  -Dtestcase=TestReplicationHandler -Dtests.seed=53F76BC991FDF6A
-Dtests.multiplier=3 -Dtests.locale=ar_DZ -Dtests.timezone=Europe/Kaliningrad -Dargs="-Dfile.encoding=US-ASCII"
   [junit4]   2> 
   [junit4] ERROR   0.00s J0 | TestReplicationHandler (suite)
   [junit4]    > Throwable #1: java.lang.AssertionError: ERROR: SolrIndexSearcher opens=74
closes=73
   [junit4]    > 	at __randomizedtesting.SeedInfo.seed([53F76BC991FDF6A]:0)
   [junit4]    > 	at org.junit.Assert.fail(Assert.java:93)
   [junit4]    > 	at org.apache.solr.SolrTestCaseJ4.endTrackingSearchers(SolrTestCaseJ4.java:190)
   [junit4]    > 	at org.apache.solr.SolrTestCaseJ4.afterClass(SolrTestCaseJ4.java:82)
   [junit4]    > 	at sun.reflect.GeneratedMethodAccessor16.invoke(Unknown Source)
   [junit4]    > 	at sun.reflect.DelegatingMethodAccessorImpl.invoke(DelegatingMethodAccessorImpl.java:43)
   [junit4]    > 	at java.lang.reflect.Method.invoke(Method.java:601)
   [junit4]    > 	at com.carrotsearch.randomizedtesting.RandomizedRunner.invoke(RandomizedRunner.java:1969)
   [junit4]    > 	at com.carrotsearch.randomizedtesting.RandomizedRunner.access$1100(RandomizedRunner.java:132)
   [junit4]    > 	at com.carrotsearch.randomizedtesting.RandomizedRunner$5.evaluate(RandomizedRunner.java:752)
   [junit4]    > 	at com.carrotsearch.randomizedtesting.rules.SystemPropertiesRestoreRule$1.evaluate(SystemPropertiesRestoreRule.java:53)
   [junit4]    > 	at org.apache.lucene.util.AbstractBeforeAfterRule$1.evaluate(AbstractBeforeAfterRule.java:45)
   [junit4]    > 	at org.apache.lucene.util.TestRuleReportUncaughtExceptions$1.evaluate(TestRuleReportUncaughtExceptions.java:68)
   [junit4]    > 	at org.apache.lucene.util.TestRuleStoreClassName$1.evaluate(TestRuleStoreClassName.java:38)
   [junit4]    > 	at org.apache.lucene.util.TestRuleIcuHack$1.evaluate(TestRuleIcuHack.java:51)
   [junit4]    > 	at com.carrotsearch.randomizedtesting.rules.SystemPropertiesInvariantRule$1.evaluate(SystemPropertiesInvariantRule.java:55)
   [junit4]    > 	at org.apache.lucene.util.TestRuleNoInstanceHooksOverrides$1.evaluate(TestRuleNoInstanceHooksOverrides.java:53)
   [junit4]    > 	at org.apache.lucene.util.TestRuleNoStaticHooksShadowing$1.evaluate(TestRuleNoStaticHooksShadowing.java:52)
   [junit4]    > 	at org.apache.lucene.util.TestRuleAssertionsRequired$1.evaluate(TestRuleAssertionsRequired.java:36)
   [junit4]    > 	at org.apache.lucene.util.TestRuleMarkFailure$1.evaluate(TestRuleMarkFailure.java:48)
   [junit4]    > 	at org.apache.lucene.util.TestRuleIgnoreTestSuites$1.evaluate(TestRuleIgnoreTestSuites.java:56)
   [junit4]    > 	at com.carrotsearch.randomizedtesting.RandomizedRunner.runSuite(RandomizedRunner.java:605)
   [junit4]    > 	at com.carrotsearch.randomizedtesting.RandomizedRunner.access$400(RandomizedRunner.java:132)
   [junit4]    > 	at com.carrotsearch.randomizedtesting.RandomizedRunner$2.run(RandomizedRunner.java:551)
   [junit4]    >
   [junit4] Completed on J0 in 148.63s, 1 test, 1 failure <<< FAILURES!
[...truncated 193 lines...]

[...truncated 11346 lines...]

[...truncated 11346 lines...]

[...truncated 11346 lines...]


Mime
View raw message