lucene-dev mailing list archives

Site index · List index
Message view « Date » · « Thread »
Top « Date » · « Thread »
From Apache Jenkins Server <jenk...@builds.apache.org>
Subject [JENKINS] Solr-trunk - Build # 1877 - Failure
Date Wed, 06 Jun 2012 09:07:00 GMT
Build: https://builds.apache.org/job/Solr-trunk/1877/

1 tests failed.
REGRESSION:  org.apache.solr.cloud.RecoveryZkTest.testDistribSearch

Error Message:
Thread threw an uncaught exception, thread: Thread[Lucene Merge Thread #2,6,]

Stack Trace:
java.lang.RuntimeException: Thread threw an uncaught exception, thread: Thread[Lucene Merge
Thread #2,6,]
	at com.carrotsearch.randomizedtesting.RunnerThreadGroup.processUncaught(RunnerThreadGroup.java:96)
	at com.carrotsearch.randomizedtesting.RandomizedRunner.runSingleTest(RandomizedRunner.java:857)
	at com.carrotsearch.randomizedtesting.RandomizedRunner.access$700(RandomizedRunner.java:132)
	at com.carrotsearch.randomizedtesting.RandomizedRunner$3$1.run(RandomizedRunner.java:669)
	at com.carrotsearch.randomizedtesting.RandomizedRunner$3.evaluate(RandomizedRunner.java:695)
	at com.carrotsearch.randomizedtesting.RandomizedRunner$4.evaluate(RandomizedRunner.java:734)
	at com.carrotsearch.randomizedtesting.RandomizedRunner$5.evaluate(RandomizedRunner.java:745)
	at com.carrotsearch.randomizedtesting.rules.SystemPropertiesRestoreRule$1.evaluate(SystemPropertiesRestoreRule.java:53)
	at org.apache.lucene.util.AbstractBeforeAfterRule$1.evaluate(AbstractBeforeAfterRule.java:45)
	at org.apache.lucene.util.TestRuleReportUncaughtExceptions$1.evaluate(TestRuleReportUncaughtExceptions.java:68)
	at org.apache.lucene.util.TestRuleStoreClassName$1.evaluate(TestRuleStoreClassName.java:38)
	at org.apache.lucene.util.TestRuleIcuHack$1.evaluate(TestRuleIcuHack.java:51)
	at com.carrotsearch.randomizedtesting.rules.SystemPropertiesInvariantRule$1.evaluate(SystemPropertiesInvariantRule.java:55)
	at org.apache.lucene.util.TestRuleNoInstanceHooksOverrides$1.evaluate(TestRuleNoInstanceHooksOverrides.java:53)
	at org.apache.lucene.util.TestRuleNoStaticHooksShadowing$1.evaluate(TestRuleNoStaticHooksShadowing.java:52)
	at org.apache.lucene.util.TestRuleAssertionsRequired$1.evaluate(TestRuleAssertionsRequired.java:36)
	at org.apache.lucene.util.TestRuleMarkFailure$1.evaluate(TestRuleMarkFailure.java:48)
	at org.apache.lucene.util.TestRuleIgnoreTestSuites$1.evaluate(TestRuleIgnoreTestSuites.java:56)
	at com.carrotsearch.randomizedtesting.RandomizedRunner.runSuite(RandomizedRunner.java:605)
	at com.carrotsearch.randomizedtesting.RandomizedRunner.access$400(RandomizedRunner.java:132)
	at com.carrotsearch.randomizedtesting.RandomizedRunner$2.run(RandomizedRunner.java:551)
Caused by: org.apache.lucene.index.MergePolicy$MergeException: org.apache.lucene.store.AlreadyClosedException:
this Directory is closed
	at __randomizedtesting.SeedInfo.seed([69092B9C265A21E2]:0)
	at org.apache.lucene.index.ConcurrentMergeScheduler.handleMergeException(ConcurrentMergeScheduler.java:507)
	at org.apache.lucene.index.ConcurrentMergeScheduler$MergeThread.run(ConcurrentMergeScheduler.java:480)
Caused by: org.apache.lucene.store.AlreadyClosedException: this Directory is closed
	at org.apache.lucene.store.Directory.ensureOpen(Directory.java:244)
	at org.apache.lucene.store.FSDirectory.listAll(FSDirectory.java:241)
	at org.apache.lucene.index.IndexFileDeleter.refresh(IndexFileDeleter.java:321)
	at org.apache.lucene.index.IndexWriter.merge(IndexWriter.java:3127)
	at org.apache.lucene.index.ConcurrentMergeScheduler.doMerge(ConcurrentMergeScheduler.java:382)
	at org.apache.lucene.index.ConcurrentMergeScheduler$MergeThread.run(ConcurrentMergeScheduler.java:451)




Build Log:
[...truncated 43128 lines...]
   [junit4]   2> 30179 T2702 oascc.SolrZkClient.makePath makePath: /overseer_elect/leader
   [junit4]   2> 30181 T2702 oasc.Overseer.<init> Constructing new Overseer id=87750950681116675-127.0.0.1:58685_solr-n_0000000001
   [junit4]   2> 30182 T2702 oasc.Overseer.processLeaderNodesChanged Leader nodes changed
for collection: collection1 nodes now:[shard1]
   [junit4]   2> 30183 T2702 oasc.Overseer.announceLeader Leader change pooled: http://127.0.0.1:58685/solr/collection1/
   [junit4]   2> 30183 T2702 oasc.Overseer.processLeaderNodesChanged Leader nodes changed
for collection: control_collection nodes now:[]
   [junit4]   2> 30184 T2702 oasc.Overseer.coreChanged Core change pooled: 127.0.0.1:58685_solr
states:[coll:collection1 core:collection1 props:{num_shards=1, shard=shard1, state=active,
core=collection1, collection=collection1, node_name=127.0.0.1:58685_solr, base_url=http://127.0.0.1:58685/solr}]
   [junit4]   2> 30185 T2702 oasc.Overseer.coreChanged Core change pooled: 127.0.0.1:58687_solr
states:[coll:collection1 core:collection1 props:{num_shards=1, shard=shard1, state=active,
core=collection1, collection=collection1, node_name=127.0.0.1:58687_solr, base_url=http://127.0.0.1:58687/solr}]
   [junit4]   2> 30185 T2827 oascc.ZkStateReader.updateCloudState Manual update of cluster
state initiated
   [junit4]   2> 30186 T2827 oascc.ZkStateReader.updateCloudState Updating cloud state
from ZooKeeper... 
   [junit4]   2> 30187 T2827 oasc.Overseer$CloudStateUpdater.run Announcing new cluster
state
   [junit4]   2> 30189 T2718 oascc.ZkStateReader$2.process A cluster state change has occurred
   [junit4]   2> 30189 T2722 oascc.ZkStateReader$2.process A cluster state change has occurred
   [junit4]   2> 30189 T2702 oascc.ZkStateReader$2.process A cluster state change has occurred
   [junit4]   2> 30189 T2768 oascc.ZkStateReader$2.process A cluster state change has occurred
   [junit4]   2> 30209 T2690 oasc.Overseer$CloudStateUpdater.amILeader WARNING  org.apache.zookeeper.KeeperException$SessionExpiredException:
KeeperErrorCode = Session expired for /overseer_elect/leader
   [junit4]   2> 	at org.apache.zookeeper.KeeperException.create(KeeperException.java:118)
   [junit4]   2> 	at org.apache.zookeeper.KeeperException.create(KeeperException.java:42)
   [junit4]   2> 	at org.apache.zookeeper.ZooKeeper.getData(ZooKeeper.java:927)
   [junit4]   2> 	at org.apache.solr.common.cloud.SolrZkClient$7.execute(SolrZkClient.java:289)
   [junit4]   2> 	at org.apache.solr.common.cloud.SolrZkClient$7.execute(SolrZkClient.java:286)
   [junit4]   2> 	at org.apache.solr.common.cloud.ZkCmdExecutor.retryOperation(ZkCmdExecutor.java:65)
   [junit4]   2> 	at org.apache.solr.common.cloud.SolrZkClient.getData(SolrZkClient.java:286)
   [junit4]   2> 	at org.apache.solr.cloud.Overseer$CloudStateUpdater.amILeader(Overseer.java:174)
   [junit4]   2> 	at org.apache.solr.cloud.Overseer$CloudStateUpdater.run(Overseer.java:104)
   [junit4]   2> 	at java.lang.Thread.run(Thread.java:679)
   [junit4]   2> 
   [junit4]   2> 30209 T2690 oasc.Overseer$CloudStateUpdater.amILeader According to ZK
I (id=87750950681116674-127.0.0.1:58682_solr-n_0000000000) am no longer a leader.
   [junit4]   2> 30230 T2669 oasc.CoreContainer.shutdown Shutting down CoreContainer instance=1790193422
   [junit4]   2> 30230 T2669 oasc.SolrCore.close [collection1]  CLOSING SolrCore org.apache.solr.core.SolrCore@4ebb0160
   [junit4]   2> 30231 T2669 oasc.SolrCore.closeSearcher [collection1] Closing main searcher
on request.
   [junit4]   2> 30232 T2669 oasu.DirectUpdateHandler2.close closing DirectUpdateHandler2{commits=3,autocommits=0,soft
autocommits=0,optimizes=0,rollbacks=0,expungeDeletes=0,docsPending=0,adds=0,deletesById=0,deletesByQuery=0,errors=0,cumulative_adds=1557,cumulative_deletesById=752,cumulative_deletesByQuery=0,cumulative_errors=0}
   [junit4]   2> 30262 T2669 C178 P58685 oasc.SolrDeletionPolicy.onCommit SolrDeletionPolicy.onCommit:
commits:num=3
   [junit4]   2> 		commit{dir=/usr/home/hudson/hudson-slave/workspace/Solr-trunk/checkout/solr/build/solr-core/test/J0/org.apache.solr.cloud.RecoveryZkTest-1338973246472/jetty1/index,segFN=segments_3,generation=3,filenames=[_3w_nrm.cfe,
_42.fdt, _3s_nrm.cfs, _42.fdx, _3t_2.del, _40.fdx, _3w_nrm.cfs, _40.fdt, _43_Lucene40_0.tim,
_44_nrm.cfs, _3s.si, _3t_Lucene40_0.frq, _3w_Lucene40_0.frq, _3v_Lucene40_0.tim, _45.fnm,
_43_Lucene40_0.tip, _43.fnm, _3v.si, _3v_Lucene40_0.tip, _3w.si, _40_nrm.cfs, _3x.si, _3y_Lucene40_0.frq,
_45_Lucene40_0.frq, _3z_Lucene40_0.frq, _3z_nrm.cfe, _43_Lucene40_0.prx, _3s_nrm.cfe, _3z.si,
_45_nrm.cfe, _3z_nrm.cfs, _43_nrm.cfs, _3x_Lucene40_0.prx, _3t_nrm.cfe, _3w_Lucene40_0.tim,
_3w.fnm, _42.fnm, _42_Lucene40_0.prx, _42_nrm.cfs, _42.si, _3z.fnm, _3w_Lucene40_0.tip, _43_Lucene40_0.frq,
_3t_Lucene40_0.prx, _3u.fdt, _3u.fdx, _3t.fnm, _3x.fdx, _3w.fdt, _3v_Lucene40_0.frq, _3y_nrm.cfe,
_3x_nrm.cfe, _3w.fdx, _3t.fdt, _3s_Lucene40_0.frq, _45_Lucene40_0.prx, _40.fnm, _3t.fdx, _3z.fdt,
_43.si, _3t_Lucene40_0.tip, _3u.si, _3z.fdx, _43.fdx, _3t_Lucene40_0.tim, _3t_nrm.cfs, _3v_Lucene40_0.prx,
_3x_nrm.cfs, _3y_nrm.cfs, _3x.fdt, _43.fdt, _3x.fnm, _3s.fdt, _44_Lucene40_0.prx, _3u.fnm,
_3s_Lucene40_0.tim, _3s_Lucene40_0.tip, _3s.fdx, _40_Lucene40_0.tip, _3y.si, _3v_1.del, _3s_1.del,
_3z_Lucene40_0.prx, _3s.fnm, _45.fdt, _3u_Lucene40_0.tip, _45.fdx, _44.fdx, _42_nrm.cfe, _44.fdt,
_3u_Lucene40_0.tim, _44_Lucene40_0.tip, _44_Lucene40_0.tim, _3y_Lucene40_0.prx, _40.si, _44_Lucene40_0.frq,
_3u_1.del, _44.si, _3w_Lucene40_0.prx, _43_nrm.cfe, _3x_Lucene40_0.frq, _3v.fdt, _3u_Lucene40_0.frq,
_3y_Lucene40_0.tim, _3v.fdx, _3u_Lucene40_0.prx, _3y_Lucene40_0.tip, _3y.fdx, _40_nrm.cfe,
_45_Lucene40_0.tim, _44.fnm, _45_Lucene40_0.tip, _3x_Lucene40_0.tim, _3x_Lucene40_0.tip, _40_Lucene40_0.prx,
_3t.si, _3y.fdt, _3u_nrm.cfs, _3y.fnm, _42_Lucene40_0.frq, _45.si, _3v.fnm, _3s_Lucene40_0.prx,
_42_Lucene40_0.tim, _3v_nrm.cfs, _42_Lucene40_0.tip, _3v_nrm.cfe, _3u_nrm.cfe, _40_Lucene40_0.frq,
_40_Lucene40_0.tim, _44_nrm.cfe, _45_nrm.cfs, _3z_Lucene40_0.tim, _3z_Lucene40_0.tip, segments_3]
   [junit4]   2> 		commit{dir=/usr/home/hudson/hudson-slave/workspace/Solr-trunk/checkout/solr/build/solr-core/test/J0/org.apache.solr.cloud.RecoveryZkTest-1338973246472/jetty1/index,segFN=segments_4,generation=4,filenames=[_4y_Lucene40_0.frq,
_4v.si, _4r_Lucene40_0.frq, _4t_nrm.cfe, _4t_Lucene40_0.tim, _4t.si, _4t_Lucene40_0.tip, _4x.fnm,
_4s_Lucene40_0.tim, _4r_nrm.cfs, _4s.fdt, _4s_Lucene40_0.tip, _4p.fdx, _4s.fdx, _4x_Lucene40_0.prx,
_4x_Lucene40_0.frq, _4p.fdt, _4u.si, _4s_nrm.cfs, _4p_Lucene40_0.tip, _4v_Lucene40_0.frq,
_4p.si, _4q.si, _4r.si, _4r.fdx, _4o.fdt, _4v_Lucene40_0.tim, _4p_nrm.cfs, _4o.fdx, _4t.fdx,
_4t.fdt, _4r.fdt, _4v_Lucene40_0.tip, _4q_Lucene40_0.prx, _4o_1.del, _4v.fnm, _4u_Lucene40_0.prx,
_4p_nrm.cfe, _4v.fdt, _4s_nrm.cfe, _4v.fdx, _4q.fnm, _4u_Lucene40_0.frq, _4p_2.del, _4p_Lucene40_0.frq,
_4x.si, _4r_nrm.cfe, _4u_Lucene40_0.tim, _4u_Lucene40_0.tip, _4y.fdt, _4q_Lucene40_0.frq,
_4y.fdx, _4t_nrm.cfs, _4p_Lucene40_0.prx, _4q_nrm.cfs, _4o_Lucene40_0.frq, _4q.fdt, _4q.fdx,
_4v_nrm.cfs, _4v_Lucene40_0.prx, _4y_nrm.cfe, _4r_Lucene40_0.prx, _4s_Lucene40_0.frq, _4q_Lucene40_0.tim,
_4t_Lucene40_0.prx, _4q_Lucene40_0.tip, _4x_nrm.cfe, _4s.si, _4u_nrm.cfe, _4y_nrm.cfs, _4x_nrm.cfs,
_4o.fnm, _4t_Lucene40_0.frq, _4r_Lucene40_0.tip, _4r_Lucene40_0.tim, _4x_Lucene40_0.tip, _4o_nrm.cfs,
_4y.fnm, _4x_Lucene40_0.tim, _4y.si, _4o_nrm.cfe, _4y_Lucene40_0.prx, _4s.fnm, _4s_Lucene40_0.prx,
_4p_Lucene40_0.tim, _4u.fdx, _4u.fdt, _4t.fnm, _4o_Lucene40_0.tim, _4o_Lucene40_0.tip, _4o.si,
_4u_nrm.cfs, _4y_Lucene40_0.tip, _4y_Lucene40_0.tim, _4p.fnm, _4r.fnm, _4q_nrm.cfe, _4u.fnm,
_4x.fdx, _4x.fdt, _4o_Lucene40_0.prx, segments_4, _4v_nrm.cfe]
   [junit4]   2> 		commit{dir=/usr/home/hudson/hudson-slave/workspace/Solr-trunk/checkout/solr/build/solr-core/test/J0/org.apache.solr.cloud.RecoveryZkTest-1338973246472/jetty1/index,segFN=segments_5,generation=5,filenames=[_4y_Lucene40_0.frq,
_4y.si, _4w_Lucene40_0.prx, _4w.si, _4y_Lucene40_0.prx, _4y_nrm.cfe, _4w_Lucene40_0.frq, _4x.fnm,
_4w.fdx, _4x_nrm.cfe, _4w.fdt, _4y_nrm.cfs, _4x_Lucene40_0.prx, _4x_nrm.cfs, _4x_Lucene40_0.frq,
_4x.si, _4w_Lucene40_0.tip, _4w_nrm.cfe, _4w_1.del, _4y.fdt, _4y_Lucene40_0.tip, _4y_Lucene40_0.tim,
_4w_Lucene40_0.tim, _4w_nrm.cfs, _4x_Lucene40_0.tip, _4y.fdx, _4w.fnm, _4y.fnm, _4x.fdx, segments_5,
_4x_Lucene40_0.tim, _4x.fdt]
   [junit4]   2> 30263 T2669 C178 P58685 oasc.SolrDeletionPolicy.updateCommits newest commit
= 5
   [junit4]   2> 30271 T2674 oazs.PrepRequestProcessor.pRequest Processed session termination
for sessionid: 0x137c106540d0003
   [junit4]   2> 30272 T2718 oascc.ZkStateReader$3.process Updating live nodes
   [junit4]   2> 30272 T2722 oascc.ZkStateReader$3.process Updating live nodes
   [junit4]   2> 30272 T2671 oazs.NIOServerCnxn.closeSock Closed socket connection for
client /140.211.11.196:58686 which had sessionid 0x137c106540d0003
   [junit4]   2> 30272 T2669 oaz.ZooKeeper.close Session: 0x137c106540d0003 closed
   [junit4]   2> 30273 T2768 oasu.PeerSync.sync PeerSync: core=collection1 url=127.0.0.1:58679/solr
START replicas=[] nUpdates=100
   [junit4]   2> 30273 T2669 oejsh.ContextHandler.doStop stopped o.e.j.s.ServletContextHandler{/solr,null}
   [junit4]   2> 30274 T2768 oasu.PeerSync.sync PeerSync: core=collection1 url=127.0.0.1:58679/solr
DONE. sync succeeded
   [junit4]   2> 30275 T2768 oasc.SyncStrategy.syncToMe try and ask http://127.0.0.1:58685/solr/collection1/
to sync
   [junit4]   2> 30276 T2764 C179 P58687 oasu.PeerSync.sync PeerSync: core=collection1
url=127.0.0.1:58679/solr START replicas=[127.0.0.1:58687/solr/collection1/] nUpdates=100
   [junit4]   2> 30279 T2766 C179 P58687 REQ /get {distrib=false&qt=/get&wt=javabin&version=2&getVersions=100}
status=0 QTime=2 
   [junit4]   2> 30280 T2764 C179 P58687 oasu.PeerSync.handleVersions PeerSync: core=collection1
url=127.0.0.1:58679/solr  Received 100 versions from 127.0.0.1:58687/solr/collection1/
   [junit4]   2> 30280 T2764 C179 P58687 oasu.PeerSync.handleVersions PeerSync: core=collection1
url=127.0.0.1:58679/solr  Our versions are newer. ourLowThreshold=1404015240704688128 otherHigh=1404015241182838784
   [junit4]   2> 30280 T2764 C179 P58687 oasu.PeerSync.sync PeerSync: core=collection1
url=127.0.0.1:58679/solr DONE. sync succeeded
   [junit4]   2> 30281 T2764 C179 P58687 REQ /get {sync=127.0.0.1:58687/solr/collection1/&getVersions=100&distrib=false&qt=/get&wt=javabin&version=2}
status=0 QTime=5 
   [junit4]   2> 30281 T2768 oasc.RecoveryStrategy.close WARNING Stopping recovery for
core collection1 zkNodeName=127.0.0.1:58687_solr_collection1
   [junit4]   2> 30283 T2768 oascc.SolrZkClient.makePath makePath: /collections/collection1/leaders/shard1
   [junit4]   2> 30285 T2768 oascc.SolrZkClient.makePath makePath: /overseer_elect/leader
   [junit4]   2> 30293 T2768 oasc.Overseer.<init> Constructing new Overseer id=87750950681116679-127.0.0.1:58687_solr-n_0000000004
   [junit4]   2> 30294 T2768 oasc.Overseer.processLeaderNodesChanged Leader nodes changed
for collection: collection1 nodes now:[shard1]
   [junit4]   2> 30294 T2768 oasc.Overseer.announceLeader Leader change pooled: http://127.0.0.1:58687/solr/collection1/
   [junit4]   2> 30295 T2768 oasc.Overseer.processLeaderNodesChanged Leader nodes changed
for collection: control_collection nodes now:[]
   [junit4]   2> 30296 T2768 oasc.Overseer.coreChanged Core change pooled: 127.0.0.1:58687_solr
states:[coll:collection1 core:collection1 props:{num_shards=1, shard=shard1, state=active,
core=collection1, collection=collection1, node_name=127.0.0.1:58687_solr, base_url=http://127.0.0.1:58687/solr}]
   [junit4]   2> 30296 T2768 oascc.ZkStateReader$3.process Updating live nodes
   [junit4]   2> 30296 T2830 oascc.ZkStateReader.updateCloudState Manual update of cluster
state initiated
   [junit4]   2> 30296 T2830 oascc.ZkStateReader.updateCloudState Updating cloud state
from ZooKeeper... 
   [junit4]   2> 30298 T2830 oasc.Overseer$CloudStateUpdater.run Announcing new cluster
state
   [junit4]   2> 30300 T2722 oascc.ZkStateReader$2.process A cluster state change has occurred
   [junit4]   2> 30300 T2718 oascc.ZkStateReader$2.process A cluster state change has occurred
   [junit4]   2> 30300 T2768 oascc.ZkStateReader$2.process A cluster state change has occurred
   [junit4]   2> 30325 T2669 oasc.CoreContainer.shutdown Shutting down CoreContainer instance=1629886002
   [junit4]   2> 30325 T2669 oasc.RecoveryStrategy.close WARNING Stopping recovery for
core collection1 zkNodeName=127.0.0.1:58687_solr_collection1
   [junit4]   2> 30325 T2669 oasc.SolrCore.close [collection1]  CLOSING SolrCore org.apache.solr.core.SolrCore@16b1b520
   [junit4]   2> 30328 T2669 oasc.SolrCore.closeSearcher [collection1] Closing main searcher
on request.
   [junit4]   2> 30328 T2669 oasu.DirectUpdateHandler2.close closing DirectUpdateHandler2{commits=4,autocommits=0,soft
autocommits=0,optimizes=0,rollbacks=0,expungeDeletes=0,docsPending=0,adds=0,deletesById=0,deletesByQuery=0,errors=0,cumulative_adds=755,cumulative_deletesById=381,cumulative_deletesByQuery=0,cumulative_errors=0}
   [junit4]   2> 30329 T2669 oasc.RecoveryStrategy.close WARNING Stopping recovery for
core collection1 zkNodeName=127.0.0.1:58687_solr_collection1
   [junit4]   2> 30330 T2674 oazs.PrepRequestProcessor.pRequest Processed session termination
for sessionid: 0x137c106540d0007
   [junit4]   2> 30331 T2722 oascc.ZkStateReader$3.process Updating live nodes
   [junit4]   2> 30332 T2718 oascc.ZkStateReader$3.process Updating live nodes
   [junit4]   2> 30332 T2671 oazs.NIOServerCnxn.closeSock Closed socket connection for
client /140.211.11.196:58703 which had sessionid 0x137c106540d0007
   [junit4]   2> 30332 T2669 oaz.ZooKeeper.close Session: 0x137c106540d0007 closed
   [junit4]   2> 30333 T2669 oejsh.ContextHandler.doStop stopped o.e.j.s.ServletContextHandler{/solr,null}
   [junit4]   2> 30385 T2674 oazs.PrepRequestProcessor.pRequest Processed session termination
for sessionid: 0x137c106540d0006
   [junit4]   2> 30388 T2722 oaz.ClientCnxn$EventThread.run EventThread shut down
   [junit4]   2> 30389 T2671 oazs.NIOServerCnxn.closeSock Closed socket connection for
client /140.211.11.196:58693 which had sessionid 0x137c106540d0006
   [junit4]   2> 30388 T2669 oaz.ZooKeeper.close Session: 0x137c106540d0006 closed
   [junit4]   2> 30389 T2674 oazs.PrepRequestProcessor.pRequest Processed session termination
for sessionid: 0x137c106540d0005
   [junit4]   2> 30390 T2718 oaz.ClientCnxn$EventThread.run EventThread shut down
   [junit4]   2> 30390 T2671 oazs.NIOServerCnxn.closeSock Closed socket connection for
client /140.211.11.196:58690 which had sessionid 0x137c106540d0005
   [junit4]   2> 30390 T2669 oaz.ZooKeeper.close Session: 0x137c106540d0005 closed
   [junit4]   2> 30390 T2674 oazs.PrepRequestProcessor.run PrepRequestProcessor exited
loop!
   [junit4]   2> 30391 T2673 oazs.SyncRequestProcessor.run SyncRequestProcessor exited!
   [junit4]   2> 30391 T2669 oazs.FinalRequestProcessor.shutdown shutdown of request processor
complete
   [junit4]   2> 30458 T2671 oazs.NIOServerCnxn$Factory.run NIOServerCnxn factory exited
run method
   [junit4]   2> 30459 T2669 oazs.FinalRequestProcessor.shutdown shutdown of request processor
complete
   [junit4]   2> 30484 T2669 oas.SolrTestCaseJ4.tearDown ###Ending testDistribSearch
   [junit4]   2> NOTE: reproduce with: ant test  -Dtestcase=RecoveryZkTest -Dtests.method=testDistribSearch
-Dtests.seed=69092B9C265A21E2 -Dtests.locale=it_IT -Dtests.timezone=Etc/GMT+10 -Dargs="-Dfile.encoding=ISO8859-1"
   [junit4]   2>
   [junit4]    > (@AfterClass output)
   [junit4]   2> 30517 T2669 oas.SolrTestCaseJ4.deleteCore ###deleteCore
   [junit4]   2> NOTE: test params are: codec=SimpleText, sim=DefaultSimilarity, locale=it_IT,
timezone=Etc/GMT+10
   [junit4]   2> NOTE: FreeBSD 9.0-RELEASE amd64/Sun Microsystems Inc. 1.6.0_32 (64-bit)/cpus=16,threads=11,free=77356912,total=322174976
   [junit4]   2> NOTE: All tests run in this JVM: [TestBeiderMorseFilterFactory, DistanceFunctionTest,
MBeansHandlerTest, TestPhraseSuggestions, PluginInfoTest, UpdateRequestProcessorFactoryTest,
TestMappingCharFilterFactory, TestWriterPerf, CopyFieldTest, NoCacheHeaderTest, BasicDistributedZkTest,
SpellingQueryConverterTest, TestKeepFilterFactory, TestReverseStringFilterFactory, TestSystemIdResolver,
JsonLoaderTest, TestDocSet, TestReplicationHandler, TestLFUCache, TestMultiCoreConfBootstrap,
TestItalianLightStemFilterFactory, IndexReaderFactoryTest, TestNumberUtils, TestFrenchLightStemFilterFactory,
DirectUpdateHandlerOptimizeTest, TestCollationField, TestLMDirichletSimilarityFactory, SolrCoreTest,
TestLMJelinekMercerSimilarityFactory, LeaderElectionIntegrationTest, SuggesterTSTTest, SystemInfoHandlerTest,
TestHashPartitioner, TestJmxMonitoredMap, TestSolrDeletionPolicy2, TestCJKBigramFilterFactory,
WordBreakSolrSpellCheckerTest, CSVRequestHandlerTest, TestGalicianStemFilterFactory, TestCoreContainer,
TestHindiFilters, TestDelimitedPayloadTokenFilterFactory, LegacyHTMLStripCharFilterTest, DoubleMetaphoneFilterFactoryTest,
DistributedTermsComponentTest, SpatialFilterTest, TestRemoveDuplicatesTokenFilterFactory,
QueryElevationComponentTest, TestPropInjectDefaults, DisMaxRequestHandlerTest, TestConfig,
BinaryUpdateRequestHandlerTest, TestCapitalizationFilterFactory, CurrencyFieldTest, TestTurkishLowerCaseFilterFactory,
TestKStemFilterFactory, TestPortugueseLightStemFilterFactory, TestBinaryField, ResourceLoaderTest,
TestDictionaryCompoundWordTokenFilterFactory, NotRequiredUniqueKeyTest, HighlighterConfigTest,
TestFinnishLightStemFilterFactory, TestRussianLightStemFilterFactory, TestSort, LukeRequestHandlerTest,
PrimitiveFieldTypeTest, TestCodecSupport, TestSpanishLightStemFilterFactory, MinimalSchemaTest,
SpellCheckCollatorTest, SampleTest, SearchHandlerTest, MultiTermTest, TestUtils, TestCJKWidthFilterFactory,
TestElisionFilterFactory, TestHyphenationCompoundWordTokenFilterFactory, DirectSolrSpellCheckerTest,
TestPortugueseStemFilterFactory, SolrRequestParserTest, TestUAX29URLEmailTokenizerFactory,
SuggesterWFSTTest, PrimUtilsTest, TestNGramFilters, DirectUpdateHandlerTest, TestQuerySenderNoQuery,
TestUpdate, TestSynonymFilterFactory, TestPhoneticFilterFactory, PolyFieldTest, SnowballPorterFilterFactoryTest,
FullSolrCloudDistribCmdsTest, FullSolrCloudTest, TestKeywordMarkerFilterFactory, IndexSchemaTest,
HighlighterTest, TestDFRSimilarityFactory, TestSearchPerf, TestJmxIntegration, BadIndexSchemaTest,
LoggingHandlerTest, DOMUtilTest, BasicZkTest, QueryParsingTest, URLClassifyProcessorTest,
TestDistributedGrouping, DistributedQueryElevationComponentTest, SolrCmdDistributorTest, TestBulgarianStemFilterFactory,
TermsComponentTest, SOLR749Test, TestBM25SimilarityFactory, ConvertedLegacyTest, CloudStateUpdateTest,
TestJoin, TestGreekStemFilterFactory, TestFoldingMultitermQuery, TestGermanStemFilterFactory,
TestBadConfig, TestShingleFilterFactory, SimpleFacetsTest, TestRecovery, TestNorwegianLightStemFilterFactory,
TestGreekLowerCaseFilterFactory, TestFunctionQuery, TestIrishLowerCaseFilterFactory, TestHungarianLightStemFilterFactory,
SpellPossibilityIteratorTest, TestWordDelimiterFilterFactory, TestPseudoReturnFields, TestPatternTokenizerFactory,
TestTypeTokenFilterFactory, TestRealTimeGet, TestWikipediaTokenizerFactory, TestPatternReplaceFilterFactory,
TestQueryTypes, TestLuceneMatchVersion, UUIDFieldTest, UpdateParamsTest, CommonGramsFilterFactoryTest,
StatsComponentTest, SolrInfoMBeanTest, DirectSolrConnectionTest, TestGroupingSearch, SolrIndexConfigTest,
TestTrimFilterFactory, CommonGramsQueryFilterFactoryTest, TestCSVResponseWriter, TestGermanNormalizationFilterFactory,
TestOmitPositions, TestStopFilterFactory, TestMergePolicyConfig, TestBrazilianStemFilterFactory,
DebugComponentTest, BasicFunctionalityTest, IndexSchemaRuntimeFieldTest, TestStandardFactories,
SortByFunctionTest, TestJapaneseBaseFormFilterFactory, TestLatvianStemFilterFactory, TestSuggestSpellingConverter,
TestPersianNormalizationFilterFactory, CoreAdminHandlerTest, StandardRequestHandlerTest, TestThaiWordFilterFactory,
XmlUpdateRequestHandlerTest, TestRangeQuery, TestFrenchMinimalStemFilterFactory, TestQueryUtils,
TestSolrQueryParser, DocumentBuilderTest, TestArbitraryIndexDir, SpellCheckComponentTest,
TestGalicianMinimalStemFilterFactory, SolrPluginUtilsTest, TestGermanMinimalStemFilterFactory,
FieldAnalysisRequestHandlerTest, TimeZoneUtilsTest, NumericFieldsTest, FileBasedSpellCheckerTest,
BadComponentTest, ReturnFieldsTest, TestReversedWildcardFilterFactory, MoreLikeThisHandlerTest,
XsltUpdateRequestHandlerTest, TestDefaultSimilarityFactory, TestGermanLightStemFilterFactory,
TestFastLRUCache, TestRemoteStreaming, LeaderElectionTest, TestSolrDeletionPolicy1, TestXIncludeConfig,
TestPortugueseMinimalStemFilterFactory, FieldMutatingUpdateProcessorTest, TestFiltering, EchoParamsTest,
TestSurroundQueryParser, TestHTMLStripCharFilterFactory, TestIBSimilarityFactory, OverseerTest,
RecoveryZkTest]
   [junit4]   2> 
   [junit4] Completed in 30.53s, 1 test, 1 error <<< FAILURES!
[...truncated 230 lines...]

[...truncated 43459 lines...]

[...truncated 43459 lines...]

[...truncated 43459 lines...]

[...truncated 43459 lines...]

[...truncated 43459 lines...]



Mime
View raw message