lucene-dev mailing list archives

Site index · List index
Message view « Date » · « Thread »
Top « Date » · « Thread »
From jenk...@sd-datasolutions.de
Subject [JENKINS] Lucene-Solr-4.x-Linux-Java6-64 - Build # 114 - Failure!
Date Thu, 14 Jun 2012 11:18:14 GMT
Build: http://jenkins.sd-datasolutions.de/job/Lucene-Solr-4.x-Linux-Java6-64/114/

1 tests failed.
FAILED:  junit.framework.TestSuite.org.apache.solr.handler.TestReplicationHandler

Error Message:
ERROR: SolrIndexSearcher opens=74 closes=73

Stack Trace:
java.lang.AssertionError: ERROR: SolrIndexSearcher opens=74 closes=73
	at __randomizedtesting.SeedInfo.seed([E845A956CCCB28BB]:0)
	at org.junit.Assert.fail(Assert.java:93)
	at org.apache.solr.SolrTestCaseJ4.endTrackingSearchers(SolrTestCaseJ4.java:190)
	at org.apache.solr.SolrTestCaseJ4.afterClass(SolrTestCaseJ4.java:82)
	at sun.reflect.GeneratedMethodAccessor15.invoke(Unknown Source)
	at sun.reflect.DelegatingMethodAccessorImpl.invoke(DelegatingMethodAccessorImpl.java:25)
	at java.lang.reflect.Method.invoke(Method.java:597)
	at com.carrotsearch.randomizedtesting.RandomizedRunner.invoke(RandomizedRunner.java:1969)
	at com.carrotsearch.randomizedtesting.RandomizedRunner.access$1100(RandomizedRunner.java:132)
	at com.carrotsearch.randomizedtesting.RandomizedRunner$5.evaluate(RandomizedRunner.java:752)
	at com.carrotsearch.randomizedtesting.rules.SystemPropertiesRestoreRule$1.evaluate(SystemPropertiesRestoreRule.java:53)
	at org.apache.lucene.util.AbstractBeforeAfterRule$1.evaluate(AbstractBeforeAfterRule.java:45)
	at org.apache.lucene.util.TestRuleReportUncaughtExceptions$1.evaluate(TestRuleReportUncaughtExceptions.java:68)
	at org.apache.lucene.util.TestRuleStoreClassName$1.evaluate(TestRuleStoreClassName.java:38)
	at org.apache.lucene.util.TestRuleIcuHack$1.evaluate(TestRuleIcuHack.java:51)
	at com.carrotsearch.randomizedtesting.rules.SystemPropertiesInvariantRule$1.evaluate(SystemPropertiesInvariantRule.java:55)
	at org.apache.lucene.util.TestRuleNoInstanceHooksOverrides$1.evaluate(TestRuleNoInstanceHooksOverrides.java:53)
	at org.apache.lucene.util.TestRuleNoStaticHooksShadowing$1.evaluate(TestRuleNoStaticHooksShadowing.java:52)
	at org.apache.lucene.util.TestRuleAssertionsRequired$1.evaluate(TestRuleAssertionsRequired.java:36)
	at org.apache.lucene.util.TestRuleMarkFailure$1.evaluate(TestRuleMarkFailure.java:48)
	at org.apache.lucene.util.TestRuleIgnoreTestSuites$1.evaluate(TestRuleIgnoreTestSuites.java:56)
	at com.carrotsearch.randomizedtesting.RandomizedRunner.runSuite(RandomizedRunner.java:605)
	at com.carrotsearch.randomizedtesting.RandomizedRunner.access$400(RandomizedRunner.java:132)
	at com.carrotsearch.randomizedtesting.RandomizedRunner$2.run(RandomizedRunner.java:551)




Build Log:
[...truncated 9942 lines...]
   [junit4]   2> 108 T775 oejs.AbstractConnector.doStart Started SocketConnector@0.0.0.0:35739
   [junit4]   2> 108 T775 oasc.SolrResourceLoader.locateSolrHome JNDI not configured for
solr (NoInitialContextEx)
   [junit4]   2> 108 T775 oasc.SolrResourceLoader.locateSolrHome using system property
solr.solr.home: ./org.apache.solr.handler.TestReplicationHandler$SolrInstance-1339672437471/slave
   [junit4]   2> 109 T775 oasc.SolrResourceLoader.<init> new SolrResourceLoader for
deduced Solr Home: './org.apache.solr.handler.TestReplicationHandler$SolrInstance-1339672437471/slave/'
   [junit4]   2> 111 T775 oass.SolrDispatchFilter.init SolrDispatchFilter.init()
   [junit4]   2> 112 T775 oasc.SolrResourceLoader.locateSolrHome JNDI not configured for
solr (NoInitialContextEx)
   [junit4]   2> 112 T775 oasc.SolrResourceLoader.locateSolrHome using system property
solr.solr.home: ./org.apache.solr.handler.TestReplicationHandler$SolrInstance-1339672437471/slave
   [junit4]   2> 112 T775 oasc.CoreContainer$Initializer.initialize looking for solr.xml:
/mnt/ssd/jenkins/workspace/Lucene-Solr-4.x-Linux-Java6-64/checkout/solr/build/solr-core/test/J1/./org.apache.solr.handler.TestReplicationHandler$SolrInstance-1339672437471/slave/solr.xml
   [junit4]   2> 112 T775 oasc.CoreContainer.<init> New CoreContainer 1100893972
   [junit4]   2> 112 T775 oasc.CoreContainer$Initializer.initialize no solr.xml file found
- using default
   [junit4]   2> 112 T775 oasc.CoreContainer.load Loading CoreContainer using Solr Home:
'./org.apache.solr.handler.TestReplicationHandler$SolrInstance-1339672437471/slave/'
   [junit4]   2> 113 T775 oasc.SolrResourceLoader.<init> new SolrResourceLoader for
directory: './org.apache.solr.handler.TestReplicationHandler$SolrInstance-1339672437471/slave/'
   [junit4]   2> 117 T775 oasc.CoreContainer.load Registering Log Listener
   [junit4]   2> 125 T775 oashc.HttpShardHandlerFactory.getParameter Setting socketTimeout
to: 0
   [junit4]   2> 125 T775 oashc.HttpShardHandlerFactory.getParameter Setting urlScheme
to: http://
   [junit4]   2> 125 T775 oashc.HttpShardHandlerFactory.getParameter Setting connTimeout
to: 0
   [junit4]   2> 125 T775 oashc.HttpShardHandlerFactory.getParameter Setting maxConnectionsPerHost
to: 20
   [junit4]   2> 126 T775 oashc.HttpShardHandlerFactory.getParameter Setting corePoolSize
to: 0
   [junit4]   2> 126 T775 oashc.HttpShardHandlerFactory.getParameter Setting maximumPoolSize
to: 2147483647
   [junit4]   2> 126 T775 oashc.HttpShardHandlerFactory.getParameter Setting maxThreadIdleTime
to: 5
   [junit4]   2> 126 T775 oashc.HttpShardHandlerFactory.getParameter Setting sizeOfQueue
to: -1
   [junit4]   2> 126 T775 oashc.HttpShardHandlerFactory.getParameter Setting fairnessPolicy
to: false
   [junit4]   2> 126 T775 oascsi.HttpClientUtil.createClient Creating new http client,
config:maxConnectionsPerHost=20&maxConnections=10000&socketTimeout=0&connTimeout=0&retry=false
   [junit4]   2> 130 T775 oasc.CoreContainer.create Creating SolrCore 'collection1' using
instanceDir: ./org.apache.solr.handler.TestReplicationHandler$SolrInstance-1339672437471/slave/.
   [junit4]   2> 131 T775 oasc.SolrResourceLoader.<init> new SolrResourceLoader for
directory: './org.apache.solr.handler.TestReplicationHandler$SolrInstance-1339672437471/slave/./'
   [junit4]   2> 145 T775 oasc.SolrConfig.<init> Using Lucene MatchVersion: LUCENE_40
   [junit4]   2> 177 T775 oasc.SolrConfig.<init> Loaded SolrConfig: solrconfig.xml
   [junit4]   2> 178 T775 oass.IndexSchema.readSchema Reading Solr Schema
   [junit4]   2> 179 T775 oass.IndexSchema.readSchema Schema name=test
   [junit4]   2> 188 T775 oass.IndexSchema.readSchema WARNING no default search field specified
in schema.
   [junit4]   2> 189 T775 oass.IndexSchema.readSchema unique key field: id
   [junit4]   2> 190 T775 oasc.SolrCore.<init> [collection1] Opening new SolrCore
at ./org.apache.solr.handler.TestReplicationHandler$SolrInstance-1339672437471/slave/./, dataDir=./org.apache.solr.handler.TestReplicationHandler$SolrInstance-1339672437471/slave/data/
   [junit4]   2> 190 T775 oasc.SolrCore.<init> JMX monitoring not detected for core:
collection1
   [junit4]   2> 191 T775 oasc.SolrCore.getNewIndexDir WARNING New index directory detected:
old=null new=./org.apache.solr.handler.TestReplicationHandler$SolrInstance-1339672437471/slave/data/index/
   [junit4]   2> 191 T775 oasc.SolrCore.initIndex WARNING [collection1] Solr index directory
'./org.apache.solr.handler.TestReplicationHandler$SolrInstance-1339672437471/slave/data/index'
doesn't exist. Creating new index...
   [junit4]   2> 196 T775 oasc.SolrDeletionPolicy.onCommit SolrDeletionPolicy.onCommit:
commits:num=1
   [junit4]   2> 		commit{dir=/mnt/ssd/jenkins/workspace/Lucene-Solr-4.x-Linux-Java6-64/checkout/solr/build/solr-core/test/J1/org.apache.solr.handler.TestReplicationHandler$SolrInstance-1339672437471/slave/data/index,segFN=segments_1,generation=1,filenames=[segments_1]
   [junit4]   2> 197 T775 oasc.SolrDeletionPolicy.updateCommits newest commit = 1
   [junit4]   2> 197 T775 oasc.RequestHandlers.initHandlersFromConfig created standard:
solr.StandardRequestHandler
   [junit4]   2> 197 T775 oasc.RequestHandlers.initHandlersFromConfig created defaults:
solr.StandardRequestHandler
   [junit4]   2> 197 T775 oasc.RequestHandlers.initHandlersFromConfig adding lazy requestHandler:
solr.StandardRequestHandler
   [junit4]   2> 197 T775 oasc.RequestHandlers.initHandlersFromConfig created lazy: solr.StandardRequestHandler
   [junit4]   2> 198 T775 oasc.RequestHandlers.initHandlersFromConfig created /update:
solr.UpdateRequestHandler
   [junit4]   2> 198 T775 oasc.RequestHandlers.initHandlersFromConfig created /replication:
solr.ReplicationHandler
   [junit4]   2> 198 T775 oashl.XMLLoader.init xsltCacheLifetimeSeconds=60
   [junit4]   2> 200 T775 oass.SolrIndexSearcher.<init> Opening Searcher@3ced76f4
main
   [junit4]   2> 201 T775 oasu.CommitTracker.<init> Hard AutoCommit: disabled
   [junit4]   2> 201 T775 oasu.CommitTracker.<init> Soft AutoCommit: disabled
   [junit4]   2> 202 T775 oash.SnapPuller.startExecutorService Poll Scheduled at an interval
of 1000ms
   [junit4]   2> 202 T795 oasc.SolrCore.registerSearcher [collection1] Registered new searcher
Searcher@3ced76f4 main{StandardDirectoryReader(segments_1:1)}
   [junit4]   2> 202 T775 oasc.CoreContainer.register registering core: collection1
   [junit4]   2> 202 T775 oass.SolrDispatchFilter.init user.dir=/mnt/ssd/jenkins/workspace/Lucene-Solr-4.x-Linux-Java6-64/checkout/solr/build/solr-core/test/J1
   [junit4]   2> 202 T775 oass.SolrDispatchFilter.init SolrDispatchFilter.init() done
   [junit4]   2> 202 T775 oascsi.HttpClientUtil.createClient Creating new http client,
config:maxConnections=128&maxConnectionsPerHost=32&followRedirects=false
   [junit4]   2> 
   [junit4]    > (@AfterClass output)
   [junit4]   2> 27430 T775 oasc.CoreContainer.shutdown Shutting down CoreContainer instance=895052159
   [junit4]   2> 27430 T775 oasc.SolrCore.close [collection1]  CLOSING SolrCore org.apache.solr.core.SolrCore@6534f77b
   [junit4]   2> 27430 T775 oasc.SolrCore.closeSearcher [collection1] Closing main searcher
on request.
   [junit4]   2> 27431 T775 oasu.DirectUpdateHandler2.close closing DirectUpdateHandler2{commits=1,autocommits=0,soft
autocommits=0,optimizes=0,rollbacks=0,expungeDeletes=0,docsPending=0,adds=0,deletesById=0,deletesByQuery=0,errors=0,cumulative_adds=493,cumulative_deletesById=0,cumulative_deletesByQuery=1,cumulative_errors=0}
   [junit4]   2> 27431 T775 oejsh.ContextHandler.doStop stopped o.e.j.s.ServletContextHandler{/solr,null}
   [junit4]   2> 27484 T775 oasc.CoreContainer.shutdown Shutting down CoreContainer instance=331239661
   [junit4]   2> 27484 T775 oasc.SolrCore.close [collection1]  CLOSING SolrCore org.apache.solr.core.SolrCore@7842c085
   [junit4]   2> 27484 T775 oasc.SolrCore.closeSearcher [collection1] Closing main searcher
on request.
   [junit4]   2> 27484 T775 oasu.DirectUpdateHandler2.close closing DirectUpdateHandler2{commits=2,autocommits=0,soft
autocommits=0,optimizes=0,rollbacks=0,expungeDeletes=0,docsPending=0,adds=0,deletesById=0,deletesByQuery=0,errors=0,cumulative_adds=1,cumulative_deletesById=0,cumulative_deletesByQuery=0,cumulative_errors=0}
   [junit4]   2> 27485 T775 oejsh.ContextHandler.doStop stopped o.e.j.s.ServletContextHandler{/solr,null}
   [junit4]   2> 27540 T775 oas.SolrTestCaseJ4.deleteCore ###deleteCore
   [junit4]   2> 148550 T775 oas.SolrTestCaseJ4.endTrackingSearchers SEVERE ERROR: SolrIndexSearcher
opens=74 closes=73
   [junit4]   2> NOTE: test params are: codec=Lucene40: {}, sim=DefaultSimilarity, locale=tr,
timezone=Europe/Samara
   [junit4]   2> NOTE: Linux 2.6.32-41-server amd64/Sun Microsystems Inc. 1.6.0_32 (64-bit)/cpus=8,threads=1,free=188357688,total=234160128
   [junit4]   2> NOTE: All tests run in this JVM: [TestCollationField, TestHyphenationCompoundWordTokenFilterFactory,
TestJmxIntegration, TestGalicianMinimalStemFilterFactory, TestLFUCache, TestDictionaryCompoundWordTokenFilterFactory,
RecoveryZkTest, ZkSolrClientTest, TestQueryTypes, TestKeepFilterFactory, UpdateRequestProcessorFactoryTest,
SearchHandlerTest, DoubleMetaphoneFilterFactoryTest, SoftAutoCommitTest, SolrIndexConfigTest,
SuggesterTest, MoreLikeThisHandlerTest, IndexReaderFactoryTest, DirectSolrSpellCheckerTest,
TestUpdate, TestNGramFilters, TestPersianNormalizationFilterFactory, TestSolrDeletionPolicy2,
TestJapaneseKatakanaStemFilterFactory, BadComponentTest, CommonGramsQueryFilterFactoryTest,
AlternateDirectoryTest, FileUtilsTest, SolrPluginUtilsTest, NodeStateWatcherTest, TestDelimitedPayloadTokenFilterFactory,
TestStemmerOverrideFilterFactory, TestEnglishMinimalStemFilterFactory, TestMultiWordSynonyms,
XmlUpdateRequestHandlerTest, NumericFieldsTest, QueryParsingTest, TestQueryUtils, TestCollationKeyFilterFactory,
TestChineseTokenizerFactory, TestArabicFilters, TestPorterStemFilterFactory, DebugComponentTest,
CloudStateTest, LengthFilterTest, TestJapaneseTokenizerFactory, CacheHeaderTest, OutputWriterTest,
TestSolrCoreProperties, TestIrishLowerCaseFilterFactory, TestLuceneMatchVersion, SolrCoreTest,
TestGreekStemFilterFactory, TestSolrQueryParser, TestConfig, CopyFieldTest, RequiredFieldsTest,
TestSort, DistanceFunctionTest, TestNorwegianLightStemFilterFactory, TestSlowSynonymFilter,
TestBinaryResponseWriter, AutoCommitTest, TestHunspellStemFilterFactory, TestFiltering, TestSwedishLightStemFilterFactory,
CurrencyFieldTest, TestRussianLightStemFilterFactory, TestRangeQuery, TestRealTimeGet, SortByFunctionTest,
TestStopFilterFactory, TestExtendedDismaxParser, UUIDFieldTest, TestDFRSimilarityFactory,
TestGreekLowerCaseFilterFactory, CoreAdminHandlerTest, PluginInfoTest, DocumentAnalysisRequestHandlerTest,
PrimUtilsTest, SignatureUpdateProcessorFactoryTest, TestReplicationHandler]
   [junit4]   2> NOTE: reproduce with: ant test  -Dtestcase=TestReplicationHandler -Dtests.seed=E845A956CCCB28BB
-Dtests.multiplier=3 -Dtests.locale=tr -Dtests.timezone=Europe/Samara -Dargs="-Dfile.encoding=UTF-8"
   [junit4]   2> 
   [junit4] ERROR   0.00s J1 | TestReplicationHandler (suite)
   [junit4]    > Throwable #1: java.lang.AssertionError: ERROR: SolrIndexSearcher opens=74
closes=73
   [junit4]    > 	at __randomizedtesting.SeedInfo.seed([E845A956CCCB28BB]:0)
   [junit4]    > 	at org.junit.Assert.fail(Assert.java:93)
   [junit4]    > 	at org.apache.solr.SolrTestCaseJ4.endTrackingSearchers(SolrTestCaseJ4.java:190)
   [junit4]    > 	at org.apache.solr.SolrTestCaseJ4.afterClass(SolrTestCaseJ4.java:82)
   [junit4]    > 	at sun.reflect.GeneratedMethodAccessor15.invoke(Unknown Source)
   [junit4]    > 	at sun.reflect.DelegatingMethodAccessorImpl.invoke(DelegatingMethodAccessorImpl.java:25)
   [junit4]    > 	at java.lang.reflect.Method.invoke(Method.java:597)
   [junit4]    > 	at com.carrotsearch.randomizedtesting.RandomizedRunner.invoke(RandomizedRunner.java:1969)
   [junit4]    > 	at com.carrotsearch.randomizedtesting.RandomizedRunner.access$1100(RandomizedRunner.java:132)
   [junit4]    > 	at com.carrotsearch.randomizedtesting.RandomizedRunner$5.evaluate(RandomizedRunner.java:752)
   [junit4]    > 	at com.carrotsearch.randomizedtesting.rules.SystemPropertiesRestoreRule$1.evaluate(SystemPropertiesRestoreRule.java:53)
   [junit4]    > 	at org.apache.lucene.util.AbstractBeforeAfterRule$1.evaluate(AbstractBeforeAfterRule.java:45)
   [junit4]    > 	at org.apache.lucene.util.TestRuleReportUncaughtExceptions$1.evaluate(TestRuleReportUncaughtExceptions.java:68)
   [junit4]    > 	at org.apache.lucene.util.TestRuleStoreClassName$1.evaluate(TestRuleStoreClassName.java:38)
   [junit4]    > 	at org.apache.lucene.util.TestRuleIcuHack$1.evaluate(TestRuleIcuHack.java:51)
   [junit4]    > 	at com.carrotsearch.randomizedtesting.rules.SystemPropertiesInvariantRule$1.evaluate(SystemPropertiesInvariantRule.java:55)
   [junit4]    > 	at org.apache.lucene.util.TestRuleNoInstanceHooksOverrides$1.evaluate(TestRuleNoInstanceHooksOverrides.java:53)
   [junit4]    > 	at org.apache.lucene.util.TestRuleNoStaticHooksShadowing$1.evaluate(TestRuleNoStaticHooksShadowing.java:52)
   [junit4]    > 	at org.apache.lucene.util.TestRuleAssertionsRequired$1.evaluate(TestRuleAssertionsRequired.java:36)
   [junit4]    > 	at org.apache.lucene.util.TestRuleMarkFailure$1.evaluate(TestRuleMarkFailure.java:48)
   [junit4]    > 	at org.apache.lucene.util.TestRuleIgnoreTestSuites$1.evaluate(TestRuleIgnoreTestSuites.java:56)
   [junit4]    > 	at com.carrotsearch.randomizedtesting.RandomizedRunner.runSuite(RandomizedRunner.java:605)
   [junit4]    > 	at com.carrotsearch.randomizedtesting.RandomizedRunner.access$400(RandomizedRunner.java:132)
   [junit4]    > 	at com.carrotsearch.randomizedtesting.RandomizedRunner$2.run(RandomizedRunner.java:551)
   [junit4]    >
   [junit4] Completed on J1 in 148.57s, 1 test, 1 failure <<< FAILURES!
[...truncated 415 lines...]

[...truncated 10458 lines...]

[...truncated 10458 lines...]

[...truncated 10458 lines...]

[...truncated 10458 lines...]

[...truncated 10458 lines...]



Mime
View raw message