lucene-dev mailing list archives

Site index · List index
Message view « Date » · « Thread »
Top « Date » · « Thread »
From jenk...@sd-datasolutions.de
Subject [JENKINS] Lucene-Solr-4.x-Windows-Java7-64 - Build # 37 - Failure!
Date Sun, 10 Jun 2012 23:26:39 GMT
Build: http://jenkins.sd-datasolutions.de/job/Lucene-Solr-4.x-Windows-Java7-64/37/

1 tests failed.
REGRESSION:  org.apache.solr.handler.TestReplicationHandler.test

Error Message:
expected:<498> but was:<0>

Stack Trace:
java.lang.AssertionError: expected:<498> but was:<0>
	at __randomizedtesting.SeedInfo.seed([2601050ECD32A47F:AE553AD463CEC987]:0)
	at org.junit.Assert.fail(Assert.java:93)
	at org.junit.Assert.failNotEquals(Assert.java:647)
	at org.junit.Assert.assertEquals(Assert.java:128)
	at org.junit.Assert.assertEquals(Assert.java:472)
	at org.junit.Assert.assertEquals(Assert.java:456)
	at org.apache.solr.handler.TestReplicationHandler.doTestIndexAndConfigReplication(TestReplicationHandler.java:391)
	at org.apache.solr.handler.TestReplicationHandler.test(TestReplicationHandler.java:250)
	at sun.reflect.NativeMethodAccessorImpl.invoke0(Native Method)
	at sun.reflect.NativeMethodAccessorImpl.invoke(NativeMethodAccessorImpl.java:57)
	at sun.reflect.DelegatingMethodAccessorImpl.invoke(DelegatingMethodAccessorImpl.java:43)
	at java.lang.reflect.Method.invoke(Method.java:601)
	at com.carrotsearch.randomizedtesting.RandomizedRunner.invoke(RandomizedRunner.java:1969)
	at com.carrotsearch.randomizedtesting.RandomizedRunner.access$1100(RandomizedRunner.java:132)
	at com.carrotsearch.randomizedtesting.RandomizedRunner$6.evaluate(RandomizedRunner.java:814)
	at com.carrotsearch.randomizedtesting.RandomizedRunner$7.evaluate(RandomizedRunner.java:875)
	at com.carrotsearch.randomizedtesting.RandomizedRunner$8.evaluate(RandomizedRunner.java:889)
	at com.carrotsearch.randomizedtesting.rules.SystemPropertiesRestoreRule$1.evaluate(SystemPropertiesRestoreRule.java:53)
	at org.apache.lucene.util.TestRuleSetupTeardownChained$1.evaluate(TestRuleSetupTeardownChained.java:50)
	at org.apache.lucene.util.TestRuleFieldCacheSanity$1.evaluate(TestRuleFieldCacheSanity.java:32)
	at org.apache.lucene.util.AbstractBeforeAfterRule$1.evaluate(AbstractBeforeAfterRule.java:45)
	at com.carrotsearch.randomizedtesting.rules.SystemPropertiesInvariantRule$1.evaluate(SystemPropertiesInvariantRule.java:55)
	at org.apache.lucene.util.TestRuleReportUncaughtExceptions$1.evaluate(TestRuleReportUncaughtExceptions.java:68)
	at org.apache.lucene.util.TestRuleThreadAndTestName$1.evaluate(TestRuleThreadAndTestName.java:48)
	at org.apache.lucene.util.TestRuleMarkFailure$1.evaluate(TestRuleMarkFailure.java:48)
	at com.carrotsearch.randomizedtesting.RandomizedRunner.runSingleTest(RandomizedRunner.java:821)
	at com.carrotsearch.randomizedtesting.RandomizedRunner.access$700(RandomizedRunner.java:132)
	at com.carrotsearch.randomizedtesting.RandomizedRunner$3$1.run(RandomizedRunner.java:669)
	at com.carrotsearch.randomizedtesting.RandomizedRunner$3.evaluate(RandomizedRunner.java:695)
	at com.carrotsearch.randomizedtesting.RandomizedRunner$4.evaluate(RandomizedRunner.java:734)
	at com.carrotsearch.randomizedtesting.RandomizedRunner$5.evaluate(RandomizedRunner.java:745)
	at com.carrotsearch.randomizedtesting.rules.SystemPropertiesRestoreRule$1.evaluate(SystemPropertiesRestoreRule.java:53)
	at org.apache.lucene.util.AbstractBeforeAfterRule$1.evaluate(AbstractBeforeAfterRule.java:45)
	at org.apache.lucene.util.TestRuleReportUncaughtExceptions$1.evaluate(TestRuleReportUncaughtExceptions.java:68)
	at org.apache.lucene.util.TestRuleStoreClassName$1.evaluate(TestRuleStoreClassName.java:38)
	at org.apache.lucene.util.TestRuleIcuHack$1.evaluate(TestRuleIcuHack.java:51)
	at com.carrotsearch.randomizedtesting.rules.SystemPropertiesInvariantRule$1.evaluate(SystemPropertiesInvariantRule.java:55)
	at org.apache.lucene.util.TestRuleNoInstanceHooksOverrides$1.evaluate(TestRuleNoInstanceHooksOverrides.java:53)
	at org.apache.lucene.util.TestRuleNoStaticHooksShadowing$1.evaluate(TestRuleNoStaticHooksShadowing.java:52)
	at org.apache.lucene.util.TestRuleAssertionsRequired$1.evaluate(TestRuleAssertionsRequired.java:36)
	at org.apache.lucene.util.TestRuleMarkFailure$1.evaluate(TestRuleMarkFailure.java:48)
	at org.apache.lucene.util.TestRuleIgnoreTestSuites$1.evaluate(TestRuleIgnoreTestSuites.java:56)
	at com.carrotsearch.randomizedtesting.RandomizedRunner.runSuite(RandomizedRunner.java:605)
	at com.carrotsearch.randomizedtesting.RandomizedRunner.access$400(RandomizedRunner.java:132)
	at com.carrotsearch.randomizedtesting.RandomizedRunner$2.run(RandomizedRunner.java:551)




Build Log:
[...truncated 14685 lines...]
   [junit4]   2> 
   [junit4]   2> 41277 T2912 C201 REQ [collection1] webapp=/solr path=/replication params={command=filecontent&checksum=true&generation=7&wt=filestream&file=_3_nrm.cfs}
status=0 QTime=0 
   [junit4]   2> 41282 T2912 C201 REQ [collection1] webapp=/solr path=/replication params={command=filecontent&checksum=true&generation=7&wt=filestream&file=_3_Lucene40_0.tip}
status=0 QTime=0 
   [junit4]   2> 41292 T2912 C201 REQ [collection1] webapp=/solr path=/replication params={command=filecontent&checksum=true&generation=7&wt=filestream&file=segments_7}
status=0 QTime=0 
   [junit4]   2> 41300 T2912 C201 REQ [collection1] webapp=/solr path=/replication params={command=filecontent&checksum=true&generation=7&wt=filestream&file=_3_Lucene40_0.tim}
status=0 QTime=0 
   [junit4]   2> 41306 T2912 C201 REQ [collection1] webapp=/solr path=/replication params={command=filecontent&checksum=true&generation=7&wt=filestream&file=_3_Lucene40_0.frq}
status=0 QTime=0 
   [junit4]   2> 41311 T2912 C201 REQ [collection1] webapp=/solr path=/replication params={command=filecontent&checksum=true&generation=7&wt=filestream&file=_3.si}
status=0 QTime=0 
   [junit4]   2> 41316 T2912 C201 REQ [collection1] webapp=/solr path=/replication params={command=filecontent&checksum=true&generation=7&wt=filestream&file=_3.fnm}
status=0 QTime=0 
   [junit4]   2> 41321 T2912 C201 REQ [collection1] webapp=/solr path=/replication params={command=filecontent&checksum=true&generation=7&wt=filestream&file=_3.fdt}
status=0 QTime=0 
   [junit4]   2> 41324 T2929 oash.SnapPuller.fetchLatestIndex Total time taken for download
: 0 secs
   [junit4]   2> 41329 T2929 oash.SnapPuller.copyAFile SEVERE Unable to move index file
from: .\org.apache.solr.handler.TestReplicationHandler$SolrInstance-1339370658672\slave\data\index.20120611062459\_3_nrm.cfe
to: C:\Jenkins\workspace\Lucene-Solr-4.x-Windows-Java7-64\solr\build\solr-core\test\J0\org.apache.solr.handler.TestReplicationHandler$SolrInstance-1339370658672\slave\data\index.20120611062425\_3_nrm.cfe
Trying to do a copy
   [junit4]   2> 41330 T2929 oash.SnapPuller.copyAFile SEVERE Unable to copy index file
from: .\org.apache.solr.handler.TestReplicationHandler$SolrInstance-1339370658672\slave\data\index.20120611062459\_3_nrm.cfe
to: C:\Jenkins\workspace\Lucene-Solr-4.x-Windows-Java7-64\solr\build\solr-core\test\J0\org.apache.solr.handler.TestReplicationHandler$SolrInstance-1339370658672\slave\data\index.20120611062425\_3_nrm.cfe
java.io.FileNotFoundException: C:\Jenkins\workspace\Lucene-Solr-4.x-Windows-Java7-64\solr\build\solr-core\test\J0\org.apache.solr.handler.TestReplicationHandler$SolrInstance-1339370658672\slave\data\index.20120611062425\_3_nrm.cfe
(The system cannot find the path specified)
   [junit4]   2> 	at java.io.FileOutputStream.open(Native Method)
   [junit4]   2> 	at java.io.FileOutputStream.<init>(FileOutputStream.java:212)
   [junit4]   2> 	at java.io.FileOutputStream.<init>(FileOutputStream.java:165)
   [junit4]   2> 	at org.apache.solr.util.FileUtils.copyFile(FileUtils.java:48)
   [junit4]   2> 	at org.apache.solr.handler.SnapPuller.copyAFile(SnapPuller.java:654)
   [junit4]   2> 	at org.apache.solr.handler.SnapPuller.copyIndexFiles(SnapPuller.java:691)
   [junit4]   2> 	at org.apache.solr.handler.SnapPuller.fetchLatestIndex(SnapPuller.java:371)
   [junit4]   2> 	at org.apache.solr.handler.ReplicationHandler.doFetch(ReplicationHandler.java:298)
   [junit4]   2> 	at org.apache.solr.handler.SnapPuller$1.run(SnapPuller.java:169)
   [junit4]   2> 	at java.util.concurrent.Executors$RunnableAdapter.call(Executors.java:471)
   [junit4]   2> 	at java.util.concurrent.FutureTask$Sync.innerRunAndReset(FutureTask.java:351)
   [junit4]   2> 	at java.util.concurrent.FutureTask.runAndReset(FutureTask.java:178)
   [junit4]   2> 	at java.util.concurrent.ScheduledThreadPoolExecutor$ScheduledFutureTask.access$301(ScheduledThreadPoolExecutor.java:178)
   [junit4]   2> 	at java.util.concurrent.ScheduledThreadPoolExecutor$ScheduledFutureTask.run(ScheduledThreadPoolExecutor.java:293)
   [junit4]   2> 	at java.util.concurrent.ThreadPoolExecutor.runWorker(ThreadPoolExecutor.java:1110)
   [junit4]   2> 	at java.util.concurrent.ThreadPoolExecutor$Worker.run(ThreadPoolExecutor.java:603)
   [junit4]   2> 	at java.lang.Thread.run(Thread.java:722)
   [junit4]   2> 
   [junit4]   2> 41409 T2922 C202 REQ [collection1] webapp=/solr path=/select params={wt=javabin&q=*:*&version=2}
hits=0 status=0 QTime=0 
   [junit4]   2> 41543 T2922 C202 REQ [collection1] webapp=/solr path=/select params={wt=javabin&q=*:*&version=2}
hits=0 status=0 QTime=0 
   [junit4]   2> 41676 T2922 C202 REQ [collection1] webapp=/solr path=/select params={wt=javabin&q=*:*&version=2}
hits=0 status=0 QTime=0 
   [junit4]   2> 41809 T2922 C202 REQ [collection1] webapp=/solr path=/select params={wt=javabin&q=*:*&version=2}
hits=0 status=0 QTime=0 
   [junit4]   2> 41943 T2922 C202 REQ [collection1] webapp=/solr path=/select params={wt=javabin&q=*:*&version=2}
hits=0 status=0 QTime=0 
   [junit4]   2> 42076 T2922 C202 REQ [collection1] webapp=/solr path=/select params={wt=javabin&q=*:*&version=2}
hits=0 status=0 QTime=0 
   [junit4]   2> 42214 T2922 C202 REQ [collection1] webapp=/solr path=/select params={wt=javabin&q=*:*&version=2}
hits=0 status=0 QTime=0 
   [junit4]   2> 42338 T2912 C201 REQ [collection1] webapp=/solr path=/replication params={command=indexversion&wt=javabin}
status=0 QTime=0 
   [junit4]   2> 42338 T2929 oash.SnapPuller.fetchLatestIndex Master's generation: 7
   [junit4]   2> 42338 T2929 oash.SnapPuller.fetchLatestIndex Slave's generation: 6
   [junit4]   2> 42338 T2929 oash.SnapPuller.fetchLatestIndex Starting replication process
   [junit4]   2> 42345 T2912 C201 REQ [collection1] webapp=/solr path=/replication params={command=filelist&wt=javabin&generation=7}
status=0 QTime=3 
   [junit4]   2> 42345 T2929 oash.SnapPuller.fetchLatestIndex Number of files in latest
index in master: 10
   [junit4]   2> 42347 T2922 C202 REQ [collection1] webapp=/solr path=/select params={wt=javabin&q=*:*&version=2}
hits=0 status=0 QTime=0 
   [junit4]   2> 42354 T2912 C201 REQ [collection1] webapp=/solr path=/replication params={command=filecontent&checksum=true&generation=7&wt=filestream&file=_3_nrm.cfe}
status=0 QTime=0 
   [junit4]   2> 42362 T2912 C201 REQ [collection1] webapp=/solr path=/replication params={command=filecontent&checksum=true&generation=7&wt=filestream&file=_3.fdx}
status=0 QTime=0 
   [junit4]   2> 42371 T2912 C201 REQ [collection1] webapp=/solr path=/replication params={command=filecontent&checksum=true&generation=7&wt=filestream&file=_3_nrm.cfs}
status=0 QTime=0 
   [junit4]   2> 42376 T2912 C201 REQ [collection1] webapp=/solr path=/replication params={command=filecontent&checksum=true&generation=7&wt=filestream&file=_3_Lucene40_0.tip}
status=0 QTime=0 
   [junit4]   2> 42382 T2912 C201 REQ [collection1] webapp=/solr path=/replication params={command=filecontent&checksum=true&generation=7&wt=filestream&file=segments_7}
status=0 QTime=0 
   [junit4]   2> 42387 T2912 C201 REQ [collection1] webapp=/solr path=/replication params={command=filecontent&checksum=true&generation=7&wt=filestream&file=_3_Lucene40_0.tim}
status=0 QTime=0 
   [junit4]   2> 42393 T2912 C201 REQ [collection1] webapp=/solr path=/replication params={command=filecontent&checksum=true&generation=7&wt=filestream&file=_3_Lucene40_0.frq}
status=0 QTime=0 
   [junit4]   2> 42402 T2912 C201 REQ [collection1] webapp=/solr path=/replication params={command=filecontent&checksum=true&generation=7&wt=filestream&file=_3.si}
status=0 QTime=0 
   [junit4]   2> 42408 T2912 C201 REQ [collection1] webapp=/solr path=/replication params={command=filecontent&checksum=true&generation=7&wt=filestream&file=_3.fnm}
status=0 QTime=0 
   [junit4]   2> 42413 T2912 C201 REQ [collection1] webapp=/solr path=/replication params={command=filecontent&checksum=true&generation=7&wt=filestream&file=_3.fdt}
status=0 QTime=0 
   [junit4]   2> 42416 T2929 oash.SnapPuller.fetchLatestIndex Total time taken for download
: 0 secs
   [junit4]   2> 42417 T2929 oash.SnapPuller.copyAFile SEVERE Unable to move index file
from: .\org.apache.solr.handler.TestReplicationHandler$SolrInstance-1339370658672\slave\data\index.20120611062500\_3_nrm.cfe
to: C:\Jenkins\workspace\Lucene-Solr-4.x-Windows-Java7-64\solr\build\solr-core\test\J0\org.apache.solr.handler.TestReplicationHandler$SolrInstance-1339370658672\slave\data\index.20120611062425\_3_nrm.cfe
Trying to do a copy
   [junit4]   2> 42418 T2929 oash.SnapPuller.copyAFile SEVERE Unable to copy index file
from: .\org.apache.solr.handler.TestReplicationHandler$SolrInstance-1339370658672\slave\data\index.20120611062500\_3_nrm.cfe
to: C:\Jenkins\workspace\Lucene-Solr-4.x-Windows-Java7-64\solr\build\solr-core\test\J0\org.apache.solr.handler.TestReplicationHandler$SolrInstance-1339370658672\slave\data\index.20120611062425\_3_nrm.cfe
java.io.FileNotFoundException: C:\Jenkins\workspace\Lucene-Solr-4.x-Windows-Java7-64\solr\build\solr-core\test\J0\org.apache.solr.handler.TestReplicationHandler$SolrInstance-1339370658672\slave\data\index.20120611062425\_3_nrm.cfe
(The system cannot find the path specified)
   [junit4]   2> 	at java.io.FileOutputStream.open(Native Method)
   [junit4]   2> 	at java.io.FileOutputStream.<init>(FileOutputStream.java:212)
   [junit4]   2> 	at java.io.FileOutputStream.<init>(FileOutputStream.java:165)
   [junit4]   2> 	at org.apache.solr.util.FileUtils.copyFile(FileUtils.java:48)
   [junit4]   2> 	at org.apache.solr.handler.SnapPuller.copyAFile(SnapPuller.java:654)
   [junit4]   2> 	at org.apache.solr.handler.SnapPuller.copyIndexFiles(SnapPuller.java:691)
   [junit4]   2> 	at org.apache.solr.handler.SnapPuller.fetchLatestIndex(SnapPuller.java:371)
   [junit4]   2> 	at org.apache.solr.handler.ReplicationHandler.doFetch(ReplicationHandler.java:298)
   [junit4]   2> 	at org.apache.solr.handler.SnapPuller$1.run(SnapPuller.java:169)
   [junit4]   2> 	at java.util.concurrent.Executors$RunnableAdapter.call(Executors.java:471)
   [junit4]   2> 	at java.util.concurrent.FutureTask$Sync.innerRunAndReset(FutureTask.java:351)
   [junit4]   2> 	at java.util.concurrent.FutureTask.runAndReset(FutureTask.java:178)
   [junit4]   2> 	at java.util.concurrent.ScheduledThreadPoolExecutor$ScheduledFutureTask.access$301(ScheduledThreadPoolExecutor.java:178)
   [junit4]   2> 	at java.util.concurrent.ScheduledThreadPoolExecutor$ScheduledFutureTask.run(ScheduledThreadPoolExecutor.java:293)
   [junit4]   2> 	at java.util.concurrent.ThreadPoolExecutor.runWorker(ThreadPoolExecutor.java:1110)
   [junit4]   2> 	at java.util.concurrent.ThreadPoolExecutor$Worker.run(ThreadPoolExecutor.java:603)
   [junit4]   2> 	at java.lang.Thread.run(Thread.java:722)
   [junit4]   2> 
   [junit4]   2> 42481 T2922 C202 REQ [collection1] webapp=/solr path=/select params={wt=javabin&q=*:*&version=2}
hits=0 status=0 QTime=0 
   [junit4]   2> 42614 T2922 C202 REQ [collection1] webapp=/solr path=/select params={wt=javabin&q=*:*&version=2}
hits=0 status=0 QTime=0 
   [junit4]   2> 42747 T2922 C202 REQ [collection1] webapp=/solr path=/select params={wt=javabin&q=*:*&version=2}
hits=0 status=0 QTime=0 
   [junit4]   2> 42799 T662 oaz.ClientCnxn$SendThread.startConnect Opening socket connection
to server 127.0.0.1/127.0.0.1:60215
   [junit4]   2> 42880 T2922 C202 REQ [collection1] webapp=/solr path=/select params={wt=javabin&q=*:*&version=2}
hits=0 status=0 QTime=0 
   [junit4]   2> 43012 T2922 C202 REQ [collection1] webapp=/solr path=/select params={wt=javabin&q=*:*&version=2}
hits=0 status=0 QTime=0 
   [junit4]   2> 43142 T2863 oas.SolrTestCaseJ4.tearDown ###Ending test
   [junit4]   2> NOTE: reproduce with: ant test  -Dtestcase=TestReplicationHandler -Dtests.method=test
-Dtests.seed=2601050ECD32A47F -Dtests.locale=fr_CA -Dtests.timezone=Etc/GMT-7 -Dargs="-Dfile.encoding=Cp1252"
   [junit4]   2>
   [junit4]    > (@AfterClass output)
   [junit4]   2> 43163 T2863 oasc.CoreContainer.shutdown Shutting down CoreContainer instance=1482656111
   [junit4]   2> 43163 T2863 oasc.SolrCore.close [collection1]  CLOSING SolrCore org.apache.solr.core.SolrCore@6a1d3e50
   [junit4]   2> 43164 T2863 oasc.SolrCore.closeSearcher [collection1] Closing main searcher
on request.
   [junit4]   2> 43165 T2863 oasu.DirectUpdateHandler2.close closing DirectUpdateHandler2{commits=4,autocommits=0,soft
autocommits=0,optimizes=0,rollbacks=0,expungeDeletes=0,docsPending=0,adds=0,deletesById=0,deletesByQuery=0,errors=0,cumulative_adds=997,cumulative_deletesById=0,cumulative_deletesByQuery=2,cumulative_errors=0}
   [junit4]   2> 43172 T2863 oejsh.ContextHandler.doStop stopped o.e.j.s.ServletContextHandler{/solr,null}
   [junit4]   2> 43233 T2863 oasc.CoreContainer.shutdown Shutting down CoreContainer instance=78864349
   [junit4]   2> 43234 T2863 oasc.SolrCore.close [collection1]  CLOSING SolrCore org.apache.solr.core.SolrCore@60bdf386
   [junit4]   2> 43234 T2863 oasc.SolrCore.closeSearcher [collection1] Closing main searcher
on request.
   [junit4]   2> 43236 T2863 oasu.DirectUpdateHandler2.close closing DirectUpdateHandler2{commits=8,autocommits=0,soft
autocommits=0,optimizes=0,rollbacks=0,expungeDeletes=0,docsPending=0,adds=0,deletesById=0,deletesByQuery=0,errors=0,cumulative_adds=5,cumulative_deletesById=0,cumulative_deletesByQuery=0,cumulative_errors=0}
   [junit4]   2> 43238 T2863 oejsh.ContextHandler.doStop stopped o.e.j.s.ServletContextHandler{/solr,null}
   [junit4]   2> 43308 T2863 oas.SolrTestCaseJ4.deleteCore ###deleteCore
   [junit4]   2> NOTE: test params are: codec=Lucene40: {}, sim=DefaultSimilarity, locale=fr_CA,
timezone=Etc/GMT-7
   [junit4]   2> NOTE: Windows 7 6.1 amd64/Oracle Corporation 1.7.0_04 (64-bit)/cpus=2,threads=1,free=95621496,total=267649024
   [junit4]   2> NOTE: All tests run in this JVM: [TestArabicFilters, TestUpdate, TestRussianFilters,
MoreLikeThisHandlerTest, TestRemoveDuplicatesTokenFilterFactory, TestFrenchMinimalStemFilterFactory,
TestSuggestSpellingConverter, JsonLoaderTest, TestDFRSimilarityFactory, TestFrenchLightStemFilterFactory,
SuggesterTSTTest, MBeansHandlerTest, TestDistributedSearch, JSONWriterTest, TestUtils, CoreAdminHandlerTest,
TestSolrQueryParser, LukeRequestHandlerTest, TestPropInject, TestXIncludeConfig, TestItalianLightStemFilterFactory,
LeaderElectionIntegrationTest, TestValueSourceCache, TestDocSet, LengthFilterTest, TestDefaultSimilarityFactory,
TestSlowSynonymFilter, TestIBSimilarityFactory, SpellCheckComponentTest, TestJmxIntegration,
TestSwedishLightStemFilterFactory, DirectUpdateHandlerTest, AlternateDirectoryTest, TestKStemFilterFactory,
ShowFileRequestHandlerTest, CommonGramsFilterFactoryTest, TestKeepFilterFactory, LoggingHandlerTest,
TestRandomFaceting, StatsComponentTest, RequiredFieldsTest, DefaultValueUpdateProcessorTest,
HighlighterConfigTest, TestSynonymFilterFactory, NodeStateWatcherTest, CacheHeaderTest, SolrRequestParserTest,
CopyFieldTest, TestCzechStemFilterFactory, DistributedTermsComponentTest, SolrIndexConfigTest,
TestIndexingPerformance, TestTrie, TestRangeQuery, TestNorwegianLightStemFilterFactory, FullSolrCloudTest,
PluginInfoTest, TestNorwegianMinimalStemFilterFactory, TestLatvianStemFilterFactory, BasicFunctionalityTest,
SolrCoreCheckLockOnStartupTest, PingRequestHandlerTest, TestBinaryResponseWriter, DebugComponentTest,
XsltUpdateRequestHandlerTest, UpdateRequestProcessorFactoryTest, SampleTest, TestGermanStemFilterFactory,
NumericFieldsTest, TestJmxMonitoredMap, DoubleMetaphoneFilterFactoryTest, TestSolrCoreProperties,
TestWriterPerf, TestMergePolicyConfig, TestShingleFilterFactory, SignatureUpdateProcessorFactoryTest,
TestPortugueseMinimalStemFilterFactory, TestFastLRUCache, QueryParsingTest, QueryElevationComponentTest,
TestLMJelinekMercerSimilarityFactory, TestHyphenationCompoundWordTokenFilterFactory, TestQueryUtils,
TestLFUCache, TestQueryTypes, TestSolrXMLSerializer, SolrPluginUtilsTest, SnowballPorterFilterFactoryTest,
TestGermanMinimalStemFilterFactory, CurrencyFieldTest, TestCoreContainer, TestGreekStemFilterFactory,
SuggesterTest, TestReverseStringFilterFactory, TestNGramFilters, TestJoin, NoCacheHeaderTest,
TestCJKWidthFilterFactory, TestConfig, TestCollationKeyRangeQueries, IndexBasedSpellCheckerTest,
TestSynonymMap, DirectSolrConnectionTest, FileBasedSpellCheckerTest, TestFiltering, TestChineseFilterFactory,
TestGermanLightStemFilterFactory, TestHungarianLightStemFilterFactory, TestTurkishLowerCaseFilterFactory,
DistributedSpellCheckComponentTest, TestTrimFilterFactory, UUIDFieldTest, TestGroupingSearch,
TestSort, TermVectorComponentTest, TestQuerySenderListener, PrimUtilsTest, TestSurroundQueryParser,
DistributedQueryElevationComponentTest, SortByFunctionTest, SolrInfoMBeanTest, TimeZoneUtilsTest,
TestPorterStemFilterFactory, TestHindiFilters, TestJapaneseReadingFormFilterFactory, AutoCommitTest,
DirectUpdateHandlerOptimizeTest, TestRemoteStreaming, FastVectorHighlighterTest, TestPatternReplaceCharFilterFactory,
BinaryUpdateRequestHandlerTest, TestGermanNormalizationFilterFactory, WordBreakSolrSpellCheckerTest,
TestSearchPerf, TestIrishLowerCaseFilterFactory, TestPatternReplaceFilterFactory, DistanceFunctionTest,
TestPhoneticFilterFactory, ZkControllerTest, TestPluginEnable, FieldAnalysisRequestHandlerTest,
TestElisionFilterFactory, UpdateParamsTest, TestDistributedGrouping, ResourceLoaderTest, TestCollationKeyFilterFactory,
CSVRequestHandlerTest, TestDictionaryCompoundWordTokenFilterFactory, TestFinnishLightStemFilterFactory,
TestGalicianStemFilterFactory, TestHTMLStripCharFilterFactory, DateFieldTest, TestJapaneseKatakanaStemFilterFactory,
BasicZkTest, TestReversedWildcardFilterFactory, DirectSolrSpellCheckerTest, SOLR749Test, RequestHandlersTest,
TestJapanesePartOfSpeechStopFilterFactory, SuggesterWFSTTest, StandardRequestHandlerTest,
TestCollationField, TestExtendedDismaxParser, SystemInfoHandlerTest, SuggesterFSTTest, TestPersianNormalizationFilterFactory,
SpellingQueryConverterTest, SpatialFilterTest, BadComponentTest, TestJapaneseBaseFormFilterFactory,
ConvertedLegacyTest, OpenExchangeRatesOrgProviderTest, TestSystemIdResolver, TestFaceting,
RAMDirectoryFactoryTest, TestLuceneMatchVersion, TestFoldingMultitermQuery, UniqFieldsUpdateProcessorFactoryTest,
TestRecovery, HighlighterTest, TestPropInjectDefaults, SearchHandlerTest, TestBM25SimilarityFactory,
TestBrazilianStemFilterFactory, NotRequiredUniqueKeyTest, SimpleFacetsTest, IndexSchemaTest,
SoftAutoCommitTest, IndexReaderFactoryTest, TestFunctionQuery, TestLRUCache, TestWordDelimiterFilterFactory,
TestSolrDeletionPolicy1, TestCapitalizationFilterFactory, TestIndexSearcher, CloudStateUpdateTest,
FileUtilsTest, PrimitiveFieldTypeTest, LeaderElectionTest, TestThaiWordFilterFactory, ZkNodePropsTest,
TestBeiderMorseFilterFactory, TestBinaryField, TermsComponentTest, TestPseudoReturnFields,
TestRealTimeGet, FullSolrCloudDistribCmdsTest, OverseerTest, RecoveryZkTest, BasicDistributedZkTest,
TestReplicationHandler]
   [junit4]   2> 
   [junit4] Completed in 43.31s, 1 test, 1 failure <<< FAILURES!
[...truncated 220 lines...]

[...truncated 15006 lines...]

[...truncated 15006 lines...]

[...truncated 15006 lines...]

[...truncated 15006 lines...]

[...truncated 15006 lines...]



Mime
View raw message