lucene-dev mailing list archives

Site index · List index
Message view « Date » · « Thread »
Top « Date » · « Thread »
From jenk...@sd-datasolutions.de
Subject [JENKINS] Lucene-Solr-trunk-Windows-Java7-64 - Build # 232 - Still Failing!
Date Mon, 04 Jun 2012 20:54:19 GMT
Build: http://jenkins.sd-datasolutions.de/job/Lucene-Solr-trunk-Windows-Java7-64/232/

3 tests failed.
REGRESSION:  org.apache.solr.handler.component.DistributedSpellCheckComponentTest.testDistribSearch

Error Message:
Server at http://localhost:50997/solr returned non ok status:500, message:Server Error

Stack Trace:
org.apache.solr.common.SolrException: Server at http://localhost:50997/solr returned non ok status:500, message:Server Error
	at __randomizedtesting.SeedInfo.seed([DB2A91C8FCE71C59:5ACC1FD08BB87C65]:0)
	at org.apache.solr.client.solrj.impl.HttpSolrServer.request(HttpSolrServer.java:375)
	at org.apache.solr.client.solrj.impl.HttpSolrServer.request(HttpSolrServer.java:182)
	at org.apache.solr.client.solrj.request.QueryRequest.process(QueryRequest.java:90)
	at org.apache.solr.client.solrj.SolrServer.query(SolrServer.java:323)
	at org.apache.solr.BaseDistributedSearchTestCase.query(BaseDistributedSearchTestCase.java:385)
	at org.apache.solr.handler.component.DistributedSpellCheckComponentTest.doTest(DistributedSpellCheckComponentTest.java:152)
	at org.apache.solr.BaseDistributedSearchTestCase.testDistribSearch(BaseDistributedSearchTestCase.java:686)
	at sun.reflect.NativeMethodAccessorImpl.invoke0(Native Method)
	at sun.reflect.NativeMethodAccessorImpl.invoke(NativeMethodAccessorImpl.java:57)
	at sun.reflect.DelegatingMethodAccessorImpl.invoke(DelegatingMethodAccessorImpl.java:43)
	at java.lang.reflect.Method.invoke(Method.java:601)
	at com.carrotsearch.randomizedtesting.RandomizedRunner.invoke(RandomizedRunner.java:1969)
	at com.carrotsearch.randomizedtesting.RandomizedRunner.access$1100(RandomizedRunner.java:132)
	at com.carrotsearch.randomizedtesting.RandomizedRunner$6.evaluate(RandomizedRunner.java:814)
	at com.carrotsearch.randomizedtesting.RandomizedRunner$7.evaluate(RandomizedRunner.java:875)
	at com.carrotsearch.randomizedtesting.RandomizedRunner$8.evaluate(RandomizedRunner.java:889)
	at com.carrotsearch.randomizedtesting.rules.SystemPropertiesRestoreRule$1.evaluate(SystemPropertiesRestoreRule.java:53)
	at org.apache.lucene.util.TestRuleSetupTeardownChained$1.evaluate(TestRuleSetupTeardownChained.java:50)
	at org.apache.lucene.util.TestRuleFieldCacheSanity$1.evaluate(TestRuleFieldCacheSanity.java:32)
	at org.apache.lucene.util.AbstractBeforeAfterRule$1.evaluate(AbstractBeforeAfterRule.java:45)
	at com.carrotsearch.randomizedtesting.rules.SystemPropertiesInvariantRule$1.evaluate(SystemPropertiesInvariantRule.java:55)
	at org.apache.lucene.util.TestRuleReportUncaughtExceptions$1.evaluate(TestRuleReportUncaughtExceptions.java:68)
	at org.apache.lucene.util.TestRuleThreadAndTestName$1.evaluate(TestRuleThreadAndTestName.java:48)
	at org.apache.lucene.util.TestRuleMarkFailure$1.evaluate(TestRuleMarkFailure.java:48)
	at com.carrotsearch.randomizedtesting.RandomizedRunner.runSingleTest(RandomizedRunner.java:821)
	at com.carrotsearch.randomizedtesting.RandomizedRunner.access$700(RandomizedRunner.java:132)
	at com.carrotsearch.randomizedtesting.RandomizedRunner$3$1.run(RandomizedRunner.java:669)
	at com.carrotsearch.randomizedtesting.RandomizedRunner$3.evaluate(RandomizedRunner.java:695)
	at com.carrotsearch.randomizedtesting.RandomizedRunner$4.evaluate(RandomizedRunner.java:734)
	at com.carrotsearch.randomizedtesting.RandomizedRunner$5.evaluate(RandomizedRunner.java:745)
	at com.carrotsearch.randomizedtesting.rules.SystemPropertiesRestoreRule$1.evaluate(SystemPropertiesRestoreRule.java:53)
	at org.apache.lucene.util.AbstractBeforeAfterRule$1.evaluate(AbstractBeforeAfterRule.java:45)
	at org.apache.lucene.util.TestRuleReportUncaughtExceptions$1.evaluate(TestRuleReportUncaughtExceptions.java:68)
	at org.apache.lucene.util.TestRuleStoreClassName$1.evaluate(TestRuleStoreClassName.java:38)
	at org.apache.lucene.util.TestRuleIcuHack$1.evaluate(TestRuleIcuHack.java:51)
	at com.carrotsearch.randomizedtesting.rules.SystemPropertiesInvariantRule$1.evaluate(SystemPropertiesInvariantRule.java:55)
	at org.apache.lucene.util.TestRuleNoInstanceHooksOverrides$1.evaluate(TestRuleNoInstanceHooksOverrides.java:53)
	at org.apache.lucene.util.TestRuleNoStaticHooksShadowing$1.evaluate(TestRuleNoStaticHooksShadowing.java:52)
	at org.apache.lucene.util.TestRuleAssertionsRequired$1.evaluate(TestRuleAssertionsRequired.java:36)
	at org.apache.lucene.util.TestRuleMarkFailure$1.evaluate(TestRuleMarkFailure.java:48)
	at org.apache.lucene.util.TestRuleIgnoreTestSuites$1.evaluate(TestRuleIgnoreTestSuites.java:56)
	at com.carrotsearch.randomizedtesting.RandomizedRunner.runSuite(RandomizedRunner.java:605)
	at com.carrotsearch.randomizedtesting.RandomizedRunner.access$400(RandomizedRunner.java:132)
	at com.carrotsearch.randomizedtesting.RandomizedRunner$2.run(RandomizedRunner.java:551)


REGRESSION:  org.apache.solr.spelling.WordBreakSolrSpellCheckerTest.testInConjunction

Error Message:
Exception during query

Stack Trace:
java.lang.RuntimeException: Exception during query
	at __randomizedtesting.SeedInfo.seed([DB2A91C8FCE71C59:9E9E3983A4087A25]:0)
	at org.apache.solr.SolrTestCaseJ4.assertQ(SolrTestCaseJ4.java:459)
	at org.apache.solr.SolrTestCaseJ4.assertQ(SolrTestCaseJ4.java:426)
	at org.apache.solr.spelling.WordBreakSolrSpellCheckerTest.testInConjunction(WordBreakSolrSpellCheckerTest.java:126)
	at sun.reflect.NativeMethodAccessorImpl.invoke0(Native Method)
	at sun.reflect.NativeMethodAccessorImpl.invoke(NativeMethodAccessorImpl.java:57)
	at sun.reflect.DelegatingMethodAccessorImpl.invoke(DelegatingMethodAccessorImpl.java:43)
	at java.lang.reflect.Method.invoke(Method.java:601)
	at com.carrotsearch.randomizedtesting.RandomizedRunner.invoke(RandomizedRunner.java:1969)
	at com.carrotsearch.randomizedtesting.RandomizedRunner.access$1100(RandomizedRunner.java:132)
	at com.carrotsearch.randomizedtesting.RandomizedRunner$6.evaluate(RandomizedRunner.java:814)
	at com.carrotsearch.randomizedtesting.RandomizedRunner$7.evaluate(RandomizedRunner.java:875)
	at com.carrotsearch.randomizedtesting.RandomizedRunner$8.evaluate(RandomizedRunner.java:889)
	at com.carrotsearch.randomizedtesting.rules.SystemPropertiesRestoreRule$1.evaluate(SystemPropertiesRestoreRule.java:53)
	at org.apache.lucene.util.TestRuleSetupTeardownChained$1.evaluate(TestRuleSetupTeardownChained.java:50)
	at org.apache.lucene.util.TestRuleFieldCacheSanity$1.evaluate(TestRuleFieldCacheSanity.java:32)
	at org.apache.lucene.util.AbstractBeforeAfterRule$1.evaluate(AbstractBeforeAfterRule.java:45)
	at com.carrotsearch.randomizedtesting.rules.SystemPropertiesInvariantRule$1.evaluate(SystemPropertiesInvariantRule.java:55)
	at org.apache.lucene.util.TestRuleReportUncaughtExceptions$1.evaluate(TestRuleReportUncaughtExceptions.java:68)
	at org.apache.lucene.util.TestRuleThreadAndTestName$1.evaluate(TestRuleThreadAndTestName.java:48)
	at org.apache.lucene.util.TestRuleMarkFailure$1.evaluate(TestRuleMarkFailure.java:48)
	at com.carrotsearch.randomizedtesting.RandomizedRunner.runSingleTest(RandomizedRunner.java:821)
	at com.carrotsearch.randomizedtesting.RandomizedRunner.access$700(RandomizedRunner.java:132)
	at com.carrotsearch.randomizedtesting.RandomizedRunner$3$1.run(RandomizedRunner.java:669)
	at com.carrotsearch.randomizedtesting.RandomizedRunner$3.evaluate(RandomizedRunner.java:695)
	at com.carrotsearch.randomizedtesting.RandomizedRunner$4.evaluate(RandomizedRunner.java:734)
	at com.carrotsearch.randomizedtesting.RandomizedRunner$5.evaluate(RandomizedRunner.java:745)
	at com.carrotsearch.randomizedtesting.rules.SystemPropertiesRestoreRule$1.evaluate(SystemPropertiesRestoreRule.java:53)
	at org.apache.lucene.util.AbstractBeforeAfterRule$1.evaluate(AbstractBeforeAfterRule.java:45)
	at org.apache.lucene.util.TestRuleReportUncaughtExceptions$1.evaluate(TestRuleReportUncaughtExceptions.java:68)
	at org.apache.lucene.util.TestRuleStoreClassName$1.evaluate(TestRuleStoreClassName.java:38)
	at org.apache.lucene.util.TestRuleIcuHack$1.evaluate(TestRuleIcuHack.java:51)
	at com.carrotsearch.randomizedtesting.rules.SystemPropertiesInvariantRule$1.evaluate(SystemPropertiesInvariantRule.java:55)
	at org.apache.lucene.util.TestRuleNoInstanceHooksOverrides$1.evaluate(TestRuleNoInstanceHooksOverrides.java:53)
	at org.apache.lucene.util.TestRuleNoStaticHooksShadowing$1.evaluate(TestRuleNoStaticHooksShadowing.java:52)
	at org.apache.lucene.util.TestRuleAssertionsRequired$1.evaluate(TestRuleAssertionsRequired.java:36)
	at org.apache.lucene.util.TestRuleMarkFailure$1.evaluate(TestRuleMarkFailure.java:48)
	at org.apache.lucene.util.TestRuleIgnoreTestSuites$1.evaluate(TestRuleIgnoreTestSuites.java:56)
	at com.carrotsearch.randomizedtesting.RandomizedRunner.runSuite(RandomizedRunner.java:605)
	at com.carrotsearch.randomizedtesting.RandomizedRunner.access$400(RandomizedRunner.java:132)
	at com.carrotsearch.randomizedtesting.RandomizedRunner$2.run(RandomizedRunner.java:551)
Caused by: java.lang.NullPointerException
	at org.apache.solr.handler.component.SpellCheckComponent.toNamedList(SpellCheckComponent.java:566)
	at org.apache.solr.handler.component.SpellCheckComponent.process(SpellCheckComponent.java:177)
	at org.apache.solr.handler.component.SearchHandler.handleRequestBody(SearchHandler.java:204)
	at org.apache.solr.handler.RequestHandlerBase.handleRequest(RequestHandlerBase.java:129)
	at org.apache.solr.core.SolrCore.execute(SolrCore.java:1555)
	at org.apache.solr.util.TestHarness.query(TestHarness.java:357)
	at org.apache.solr.util.TestHarness.query(TestHarness.java:340)
	at org.apache.solr.SolrTestCaseJ4.assertQ(SolrTestCaseJ4.java:433)
	... 39 more


REGRESSION:  org.apache.solr.spelling.WordBreakSolrSpellCheckerTest.testCollate

Error Message:
Exception during query

Stack Trace:
java.lang.RuntimeException: Exception during query
	at __randomizedtesting.SeedInfo.seed([DB2A91C8FCE71C59:110BC8FC561F2132]:0)
	at org.apache.solr.SolrTestCaseJ4.assertQ(SolrTestCaseJ4.java:459)
	at org.apache.solr.SolrTestCaseJ4.assertQ(SolrTestCaseJ4.java:426)
	at org.apache.solr.spelling.WordBreakSolrSpellCheckerTest.testCollate(WordBreakSolrSpellCheckerTest.java:181)
	at sun.reflect.NativeMethodAccessorImpl.invoke0(Native Method)
	at sun.reflect.NativeMethodAccessorImpl.invoke(NativeMethodAccessorImpl.java:57)
	at sun.reflect.DelegatingMethodAccessorImpl.invoke(DelegatingMethodAccessorImpl.java:43)
	at java.lang.reflect.Method.invoke(Method.java:601)
	at com.carrotsearch.randomizedtesting.RandomizedRunner.invoke(RandomizedRunner.java:1969)
	at com.carrotsearch.randomizedtesting.RandomizedRunner.access$1100(RandomizedRunner.java:132)
	at com.carrotsearch.randomizedtesting.RandomizedRunner$6.evaluate(RandomizedRunner.java:814)
	at com.carrotsearch.randomizedtesting.RandomizedRunner$7.evaluate(RandomizedRunner.java:875)
	at com.carrotsearch.randomizedtesting.RandomizedRunner$8.evaluate(RandomizedRunner.java:889)
	at com.carrotsearch.randomizedtesting.rules.SystemPropertiesRestoreRule$1.evaluate(SystemPropertiesRestoreRule.java:53)
	at org.apache.lucene.util.TestRuleSetupTeardownChained$1.evaluate(TestRuleSetupTeardownChained.java:50)
	at org.apache.lucene.util.TestRuleFieldCacheSanity$1.evaluate(TestRuleFieldCacheSanity.java:32)
	at org.apache.lucene.util.AbstractBeforeAfterRule$1.evaluate(AbstractBeforeAfterRule.java:45)
	at com.carrotsearch.randomizedtesting.rules.SystemPropertiesInvariantRule$1.evaluate(SystemPropertiesInvariantRule.java:55)
	at org.apache.lucene.util.TestRuleReportUncaughtExceptions$1.evaluate(TestRuleReportUncaughtExceptions.java:68)
	at org.apache.lucene.util.TestRuleThreadAndTestName$1.evaluate(TestRuleThreadAndTestName.java:48)
	at org.apache.lucene.util.TestRuleMarkFailure$1.evaluate(TestRuleMarkFailure.java:48)
	at com.carrotsearch.randomizedtesting.RandomizedRunner.runSingleTest(RandomizedRunner.java:821)
	at com.carrotsearch.randomizedtesting.RandomizedRunner.access$700(RandomizedRunner.java:132)
	at com.carrotsearch.randomizedtesting.RandomizedRunner$3$1.run(RandomizedRunner.java:669)
	at com.carrotsearch.randomizedtesting.RandomizedRunner$3.evaluate(RandomizedRunner.java:695)
	at com.carrotsearch.randomizedtesting.RandomizedRunner$4.evaluate(RandomizedRunner.java:734)
	at com.carrotsearch.randomizedtesting.RandomizedRunner$5.evaluate(RandomizedRunner.java:745)
	at com.carrotsearch.randomizedtesting.rules.SystemPropertiesRestoreRule$1.evaluate(SystemPropertiesRestoreRule.java:53)
	at org.apache.lucene.util.AbstractBeforeAfterRule$1.evaluate(AbstractBeforeAfterRule.java:45)
	at org.apache.lucene.util.TestRuleReportUncaughtExceptions$1.evaluate(TestRuleReportUncaughtExceptions.java:68)
	at org.apache.lucene.util.TestRuleStoreClassName$1.evaluate(TestRuleStoreClassName.java:38)
	at org.apache.lucene.util.TestRuleIcuHack$1.evaluate(TestRuleIcuHack.java:51)
	at com.carrotsearch.randomizedtesting.rules.SystemPropertiesInvariantRule$1.evaluate(SystemPropertiesInvariantRule.java:55)
	at org.apache.lucene.util.TestRuleNoInstanceHooksOverrides$1.evaluate(TestRuleNoInstanceHooksOverrides.java:53)
	at org.apache.lucene.util.TestRuleNoStaticHooksShadowing$1.evaluate(TestRuleNoStaticHooksShadowing.java:52)
	at org.apache.lucene.util.TestRuleAssertionsRequired$1.evaluate(TestRuleAssertionsRequired.java:36)
	at org.apache.lucene.util.TestRuleMarkFailure$1.evaluate(TestRuleMarkFailure.java:48)
	at org.apache.lucene.util.TestRuleIgnoreTestSuites$1.evaluate(TestRuleIgnoreTestSuites.java:56)
	at com.carrotsearch.randomizedtesting.RandomizedRunner.runSuite(RandomizedRunner.java:605)
	at com.carrotsearch.randomizedtesting.RandomizedRunner.access$400(RandomizedRunner.java:132)
	at com.carrotsearch.randomizedtesting.RandomizedRunner$2.run(RandomizedRunner.java:551)
Caused by: java.lang.NullPointerException
	at org.apache.solr.handler.component.SpellCheckComponent.toNamedList(SpellCheckComponent.java:566)
	at org.apache.solr.handler.component.SpellCheckComponent.process(SpellCheckComponent.java:177)
	at org.apache.solr.handler.component.SearchHandler.handleRequestBody(SearchHandler.java:204)
	at org.apache.solr.handler.RequestHandlerBase.handleRequest(RequestHandlerBase.java:129)
	at org.apache.solr.core.SolrCore.execute(SolrCore.java:1555)
	at org.apache.solr.util.TestHarness.query(TestHarness.java:357)
	at org.apache.solr.util.TestHarness.query(TestHarness.java:340)
	at org.apache.solr.SolrTestCaseJ4.assertQ(SolrTestCaseJ4.java:433)
	... 39 more




Build Log:
[...truncated 10738 lines...]
   [junit4]   2> 		at com.carrotsearch.randomizedtesting.RandomizedRunner.invoke(RandomizedRunner.java:1969)
   [junit4]   2> 		at com.carrotsearch.randomizedtesting.RandomizedRunner.access$1100(RandomizedRunner.java:132)
   [junit4]   2> 		at com.carrotsearch.randomizedtesting.RandomizedRunner$6.evaluate(RandomizedRunner.java:814)
   [junit4]   2> 		at com.carrotsearch.randomizedtesting.RandomizedRunner$7.evaluate(RandomizedRunner.java:875)
   [junit4]   2> 		at com.carrotsearch.randomizedtesting.RandomizedRunner$8.evaluate(RandomizedRunner.java:889)
   [junit4]   2> 		at com.carrotsearch.randomizedtesting.rules.SystemPropertiesRestoreRule$1.evaluate(SystemPropertiesRestoreRule.java:53)
   [junit4]   2> 		at org.apache.lucene.util.TestRuleSetupTeardownChained$1.evaluate(TestRuleSetupTeardownChained.java:50)
   [junit4]   2> 		at org.apache.lucene.util.TestRuleFieldCacheSanity$1.evaluate(TestRuleFieldCacheSanity.java:32)
   [junit4]   2> 		at org.apache.lucene.util.AbstractBeforeAfterRule$1.evaluate(AbstractBeforeAfterRule.java:45)
   [junit4]   2> 		at com.carrotsearch.randomizedtesting.rules.SystemPropertiesInvariantRule$1.evaluate(SystemPropertiesInvariantRule.java:55)
   [junit4]   2> 		at org.apache.lucene.util.TestRuleReportUncaughtExceptions$1.evaluate(TestRuleReportUncaughtExceptions.java:68)
   [junit4]   2> 		at org.apache.lucene.util.TestRuleThreadAndTestName$1.evaluate(TestRuleThreadAndTestName.java:48)
   [junit4]   2> 		at org.apache.lucene.util.TestRuleMarkFailure$1.evaluate(TestRuleMarkFailure.java:48)
   [junit4]   2> 		at com.carrotsearch.randomizedtesting.RandomizedRunner.runSingleTest(RandomizedRunner.java:821)
   [junit4]   2> 		at com.carrotsearch.randomizedtesting.RandomizedRunner.access$700(RandomizedRunner.java:132)
   [junit4]   2> 		at com.carrotsearch.randomizedtesting.RandomizedRunner$3$1.run(RandomizedRunner.java:669)
   [junit4]   2> 		at com.carrotsearch.randomizedtesting.RandomizedRunner$3.evaluate(RandomizedRunner.java:695)
   [junit4]   2> 		at com.carrotsearch.randomizedtesting.RandomizedRunner$4.evaluate(RandomizedRunner.java:734)
   [junit4]   2> 		at com.carrotsearch.randomizedtesting.RandomizedRunner$5.evaluate(RandomizedRunner.java:745)
   [junit4]   2> 		at com.carrotsearch.randomizedtesting.rules.SystemPropertiesRestoreRule$1.evaluate(SystemPropertiesRestoreRule.java:53)
   [junit4]   2> 		at org.apache.lucene.util.AbstractBeforeAfterRule$1.evaluate(AbstractBeforeAfterRule.java:45)
   [junit4]   2> 		at org.apache.lucene.util.TestRuleReportUncaughtExceptions$1.evaluate(TestRuleReportUncaughtExceptions.java:68)
   [junit4]   2> 		at org.apache.lucene.util.TestRuleStoreClassName$1.evaluate(TestRuleStoreClassName.java:38)
   [junit4]   2> 		at org.apache.lucene.util.TestRuleIcuHack$1.evaluate(TestRuleIcuHack.java:51)
   [junit4]   2> 		at com.carrotsearch.randomizedtesting.rules.SystemPropertiesInvariantRule$1.evaluate(SystemPropertiesInvariantRule.java:55)
   [junit4]   2> 		at org.apache.lucene.util.TestRuleNoInstanceHooksOverrides$1.evaluate(TestRuleNoInstanceHooksOverrides.java:53)
   [junit4]   2> 		at org.apache.lucene.util.TestRuleNoStaticHooksShadowing$1.evaluate(TestRuleNoStaticHooksShadowing.java:52)
   [junit4]   2> 		at org.apache.lucene.util.TestRuleAssertionsRequired$1.evaluate(TestRuleAssertionsRequired.java:36)
   [junit4]   2> 		at org.apache.lucene.util.TestRuleMarkFailure$1.evaluate(TestRuleMarkFailure.java:48)
   [junit4]   2> 		at org.apache.lucene.util.TestRuleIgnoreTestSuites$1.evaluate(TestRuleIgnoreTestSuites.java:56)
   [junit4]   2> 		at com.carrotsearch.randomizedtesting.RandomizedRunner.runSuite(RandomizedRunner.java:605)
   [junit4]   2> 		at com.carrotsearch.randomizedtesting.RandomizedRunner.access$400(RandomizedRunner.java:132)
   [junit4]   2> 		at com.carrotsearch.randomizedtesting.RandomizedRunner$2.run(RandomizedRunner.java:551)
   [junit4]   2> 	
   [junit4]   2> 1485 T1379 C61 REQ [collection1] webapp=null path=null params={spellcheck=true&spellcheck.accuracy=.75&indent=true&spellcheck.collateExtendedResults=true&spellcheck.extendedResults=true&spellcheck.maxCollations=10&q=lowerfilt:(paintable+pine+apple+godness)&spellcheck.collate=true&qt=spellCheckWithWordbreak&spellcheck.build=true} hits=0 status=500 QTime=86 
   [junit4]   2> 1486 T1379 oasc.SolrException.log SEVERE REQUEST FAILED: spellcheck=true&spellcheck.accuracy=.75&indent=true&spellcheck.collateExtendedResults=true&spellcheck.extendedResults=true&spellcheck.maxCollations=10&q=lowerfilt:(paintable+pine+apple+godness)&spellcheck.collate=true&qt=spellCheckWithWordbreak&spellcheck.build=true:java.lang.NullPointerException
   [junit4]   2> 		at org.apache.solr.handler.component.SpellCheckComponent.toNamedList(SpellCheckComponent.java:566)
   [junit4]   2> 		at org.apache.solr.handler.component.SpellCheckComponent.process(SpellCheckComponent.java:177)
   [junit4]   2> 		at org.apache.solr.handler.component.SearchHandler.handleRequestBody(SearchHandler.java:204)
   [junit4]   2> 		at org.apache.solr.handler.RequestHandlerBase.handleRequest(RequestHandlerBase.java:129)
   [junit4]   2> 		at org.apache.solr.core.SolrCore.execute(SolrCore.java:1555)
   [junit4]   2> 		at org.apache.solr.util.TestHarness.query(TestHarness.java:357)
   [junit4]   2> 		at org.apache.solr.util.TestHarness.query(TestHarness.java:340)
   [junit4]   2> 		at org.apache.solr.SolrTestCaseJ4.assertQ(SolrTestCaseJ4.java:433)
   [junit4]   2> 		at org.apache.solr.SolrTestCaseJ4.assertQ(SolrTestCaseJ4.java:426)
   [junit4]   2> 		at org.apache.solr.spelling.WordBreakSolrSpellCheckerTest.testCollate(WordBreakSolrSpellCheckerTest.java:181)
   [junit4]   2> 		at sun.reflect.NativeMethodAccessorImpl.invoke0(Native Method)
   [junit4]   2> 		at sun.reflect.NativeMethodAccessorImpl.invoke(NativeMethodAccessorImpl.java:57)
   [junit4]   2> 		at sun.reflect.DelegatingMethodAccessorImpl.invoke(DelegatingMethodAccessorImpl.java:43)
   [junit4]   2> 		at java.lang.reflect.Method.invoke(Method.java:601)
   [junit4]   2> 		at com.carrotsearch.randomizedtesting.RandomizedRunner.invoke(RandomizedRunner.java:1969)
   [junit4]   2> 		at com.carrotsearch.randomizedtesting.RandomizedRunner.access$1100(RandomizedRunner.java:132)
   [junit4]   2> 		at com.carrotsearch.randomizedtesting.RandomizedRunner$6.evaluate(RandomizedRunner.java:814)
   [junit4]   2> 		at com.carrotsearch.randomizedtesting.RandomizedRunner$7.evaluate(RandomizedRunner.java:875)
   [junit4]   2> 		at com.carrotsearch.randomizedtesting.RandomizedRunner$8.evaluate(RandomizedRunner.java:889)
   [junit4]   2> 		at com.carrotsearch.randomizedtesting.rules.SystemPropertiesRestoreRule$1.evaluate(SystemPropertiesRestoreRule.java:53)
   [junit4]   2> 		at org.apache.lucene.util.TestRuleSetupTeardownChained$1.evaluate(TestRuleSetupTeardownChained.java:50)
   [junit4]   2> 		at org.apache.lucene.util.TestRuleFieldCacheSanity$1.evaluate(TestRuleFieldCacheSanity.java:32)
   [junit4]   2> 		at org.apache.lucene.util.AbstractBeforeAfterRule$1.evaluate(AbstractBeforeAfterRule.java:45)
   [junit4]   2> 		at com.carrotsearch.randomizedtesting.rules.SystemPropertiesInvariantRule$1.evaluate(SystemPropertiesInvariantRule.java:55)
   [junit4]   2> 		at org.apache.lucene.util.TestRuleReportUncaughtExceptions$1.evaluate(TestRuleReportUncaughtExceptions.java:68)
   [junit4]   2> 		at org.apache.lucene.util.TestRuleThreadAndTestName$1.evaluate(TestRuleThreadAndTestName.java:48)
   [junit4]   2> 		at org.apache.lucene.util.TestRuleMarkFailure$1.evaluate(TestRuleMarkFailure.java:48)
   [junit4]   2> 		at com.carrotsearch.randomizedtesting.RandomizedRunner.runSingleTest(RandomizedRunner.java:821)
   [junit4]   2> 		at com.carrotsearch.randomizedtesting.RandomizedRunner.access$700(RandomizedRunner.java:132)
   [junit4]   2> 		at com.carrotsearch.randomizedtesting.RandomizedRunner$3$1.run(RandomizedRunner.java:669)
   [junit4]   2> 		at com.carrotsearch.randomizedtesting.RandomizedRunner$3.evaluate(RandomizedRunner.java:695)
   [junit4]   2> 		at com.carrotsearch.randomizedtesting.RandomizedRunner$4.evaluate(RandomizedRunner.java:734)
   [junit4]   2> 		at com.carrotsearch.randomizedtesting.RandomizedRunner$5.evaluate(RandomizedRunner.java:745)
   [junit4]   2> 		at com.carrotsearch.randomizedtesting.rules.SystemPropertiesRestoreRule$1.evaluate(SystemPropertiesRestoreRule.java:53)
   [junit4]   2> 		at org.apache.lucene.util.AbstractBeforeAfterRule$1.evaluate(AbstractBeforeAfterRule.java:45)
   [junit4]   2> 		at org.apache.lucene.util.TestRuleReportUncaughtExceptions$1.evaluate(TestRuleReportUncaughtExceptions.java:68)
   [junit4]   2> 		at org.apache.lucene.util.TestRuleStoreClassName$1.evaluate(TestRuleStoreClassName.java:38)
   [junit4]   2> 		at org.apache.lucene.util.TestRuleIcuHack$1.evaluate(TestRuleIcuHack.java:51)
   [junit4]   2> 		at com.carrotsearch.randomizedtesting.rules.SystemPropertiesInvariantRule$1.evaluate(SystemPropertiesInvariantRule.java:55)
   [junit4]   2> 		at org.apache.lucene.util.TestRuleNoInstanceHooksOverrides$1.evaluate(TestRuleNoInstanceHooksOverrides.java:53)
   [junit4]   2> 		at org.apache.lucene.util.TestRuleNoStaticHooksShadowing$1.evaluate(TestRuleNoStaticHooksShadowing.java:52)
   [junit4]   2> 		at org.apache.lucene.util.TestRuleAssertionsRequired$1.evaluate(TestRuleAssertionsRequired.java:36)
   [junit4]   2> 		at org.apache.lucene.util.TestRuleMarkFailure$1.evaluate(TestRuleMarkFailure.java:48)
   [junit4]   2> 		at org.apache.lucene.util.TestRuleIgnoreTestSuites$1.evaluate(TestRuleIgnoreTestSuites.java:56)
   [junit4]   2> 		at com.carrotsearch.randomizedtesting.RandomizedRunner.runSuite(RandomizedRunner.java:605)
   [junit4]   2> 		at com.carrotsearch.randomizedtesting.RandomizedRunner.access$400(RandomizedRunner.java:132)
   [junit4]   2> 		at com.carrotsearch.randomizedtesting.RandomizedRunner$2.run(RandomizedRunner.java:551)
   [junit4]   2> 	
   [junit4]   2> 1486 T1379 oas.SolrTestCaseJ4.tearDown ###Ending testCollate
   [junit4]   2> NOTE: reproduce with: ant test  -Dtestcase=WordBreakSolrSpellCheckerTest -Dtests.method=testCollate -Dtests.seed=DB2A91C8FCE71C59 -Dtests.locale=sv -Dtests.timezone=Asia/Dili -Dargs="-Dfile.encoding=Cp1252"
   [junit4]   2>
   [junit4]    > (@AfterClass output)
   [junit4]   2> 1497 T1379 oas.SolrTestCaseJ4.deleteCore ###deleteCore
   [junit4]   2> 1497 T1379 oasc.CoreContainer.shutdown Shutting down CoreContainer instance=1315894224
   [junit4]   2> 1497 T1379 oasc.SolrCore.close [collection1]  CLOSING SolrCore org.apache.solr.core.SolrCore@c597c22
   [junit4]   2> 1498 T1379 oasc.SolrCore.closeSearcher [collection1] Closing main searcher on request.
   [junit4]   2> 1498 T1379 oasu.DirectUpdateHandler2.close closing DirectUpdateHandler2{commits=1,autocommits=0,soft autocommits=0,optimizes=0,rollbacks=0,expungeDeletes=0,docsPending=0,adds=0,deletesById=0,deletesByQuery=0,errors=0,cumulative_adds=7,cumulative_deletesById=0,cumulative_deletesByQuery=0,cumulative_errors=0}
   [junit4]   2> !!!! WARNING: best effort to remove C:\Jenkins\workspace\Lucene-Solr-trunk-Windows-Java7-64\solr\build\solr-core\test\J0\.\solrtest-WordBreakSolrSpellCheckerTest-1338842635202\spellchecker1\_2.fdt FAILED !!!!!
   [junit4]   2> !!!! WARNING: best effort to remove C:\Jenkins\workspace\Lucene-Solr-trunk-Windows-Java7-64\solr\build\solr-core\test\J0\.\solrtest-WordBreakSolrSpellCheckerTest-1338842635202\spellchecker1 FAILED !!!!!
   [junit4]   2> !!!! WARNING: best effort to remove C:\Jenkins\workspace\Lucene-Solr-trunk-Windows-Java7-64\solr\build\solr-core\test\J0\.\solrtest-WordBreakSolrSpellCheckerTest-1338842635202 FAILED !!!!!
   [junit4]   2> NOTE: test params are: codec=Lucene40: {end4=PostingsFormat(name=Lucene40WithOrds), end3=PostingsFormat(name=MockRandom), end2=PostingsFormat(name=Memory doPackFST= true), start1=PostingsFormat(name=Lucene40WithOrds), end1=Lucene40(minBlockSize=58 maxBlockSize=207), start4=PostingsFormat(name=MockSep), start2=PostingsFormat(name=MockRandom), start3=PostingsFormat(name=Memory doPackFST= false), gram2=PostingsFormat(name=Memory doPackFST= false), word=PostingsFormat(name=NestedPulsing), gram1=PostingsFormat(name=MockSep), gram4=PostingsFormat(name=Lucene40WithOrds), gram3=MockVariableIntBlock(baseBlockSize=39)}, sim=DefaultSimilarity, locale=sv, timezone=Asia/Dili
   [junit4]   2> NOTE: Windows 7 6.1 amd64/Oracle Corporation 1.7.0_04 (64-bit)/cpus=2,threads=1,free=60414296,total=222756864
   [junit4]   2> NOTE: All tests run in this JVM: [LukeRequestHandlerTest, TestBrazilianStemFilterFactory, SolrCmdDistributorTest, IndexReaderFactoryTest, SortByFunctionTest, BadComponentTest, OverseerTest, CommonGramsQueryFilterFactoryTest, IndexSchemaRuntimeFieldTest, StatsComponentTest, EchoParamsTest, TestQueryUtils, LengthFilterTest, TestCzechStemFilterFactory, TestLatvianStemFilterFactory, HighlighterTest, MinimalSchemaTest, OutputWriterTest, CopyFieldTest, HighlighterConfigTest, TestCoreContainer, ShowFileRequestHandlerTest, TestMergePolicyConfig, TestRussianLightStemFilterFactory, TestWikipediaTokenizerFactory, BasicFunctionalityTest, TestDFRSimilarityFactory, LeaderElectionTest, ResourceLoaderTest, TestNorwegianMinimalStemFilterFactory, SolrPluginUtilsTest, LoggingHandlerTest, RecoveryZkTest, TestItalianLightStemFilterFactory, LegacyHTMLStripCharFilterTest, TestNumberUtils, RAMDirectoryFactoryTest, TestDistributedGrouping, TestArbitraryIndexDir, TestFaceting, TestDictionaryCompoundWordTokenFilterFactory, CloudStateTest, SOLR749Test, TestCJKBigramFilterFactory, RequestHandlersTest, TestPropInject, TestSolrDeletionPolicy2, TestPseudoReturnFields, TestGermanNormalizationFilterFactory, TestPhraseSuggestions, TestExtendedDismaxParser, TestJmxMonitoredMap, FullSolrCloudTest, TermVectorComponentTest, TestJapaneseBaseFormFilterFactory, WordBreakSolrSpellCheckerTest]
   [junit4]   2> 
   [junit4] Completed in 1.51s, 3 tests, 2 errors <<< FAILURES!
[...truncated 1090 lines...]
   [junit4]   2> 3806 T3077 C180 REQ [collection1] webapp=/solr path=/select params={spellcheck=true&shards.qt=spellCheckCompRH_Direct&spellcheck.extendedResults=true&spellcheck.collateExtendedResults=false&spellcheck.maxCollationTries=0&spellcheck.maxCollations=1&spellcheck.collate=true&wt=javabin&version=2&fl=id,lowerfilt&shards=localhost:50999/solr&q=lowerfilt:(%2Bquock+%2Breb)&spellcheck.count=10&qt=spellCheckCompRH_Direct} status=0 QTime=20 
   [junit4]   2> 3809 T3061 C179 REQ [collection1] webapp=/solr path=/select params={spellcheck=true&spellcheck.maxResultsForSuggest=10&shards.qt=spellCheckCompRH&spellcheck.extendedResults=true&spellcheck.collateExtendedResults=true&spellcheck.maxCollationTries=10&spellcheck.maxCollations=1&distrib=false&spellcheck.collate=true&wt=javabin&version=2&fl=id,lowerfilt&q=lowerfilt:("quote+red+fox")&spellcheck.count=10&qt=spellCheckCompRH&spellcheck.alternativeTermCount=5} hits=12 status=0 QTime=1 
   [junit4]   2> 3815 T3075 C180 REQ [collection1] webapp=/solr path=/select params={spellcheck=true&shards.qt=spellCheckCompRH&spellcheck.maxCollationTries=10&distrib=false&version=2&fl=id,score&shard.url=[::1]:33332/solr|localhost:50999/solr&NOW=1338843132189&spellcheck.count=10&qt=spellCheckCompRH&fsv=true&spellcheck.alternativeTermCount=5&spellcheck.maxResultsForSuggest=10&spellcheck.extendedResults=true&spellcheck.collateExtendedResults=true&spellcheck.maxCollations=1&spellcheck.collate=true&wt=javabin&spellcheck.onlyMorePopular=false&rows=10&start=0&q=lowerfilt:("quote+red+fox")&isShard=true} hits=12 status=0 QTime=0 
   [junit4]   2> 3819 T3075 C180 REQ [collection1] webapp=/solr path=/select params={spellcheck=false&spellcheck.maxResultsForSuggest=10&spellcheck.extendedResults=true&shards.qt=spellCheckCompRH&spellcheck.collateExtendedResults=true&spellcheck.maxCollationTries=10&spellcheck.maxCollations=1&ids=21,20,19,17,22,18,15,16,13,14&distrib=false&spellcheck.collate=true&wt=javabin&spellcheck.onlyMorePopular=false&version=2&fl=id,lowerfilt&shard.url=[::1]:33332/solr|localhost:50999/solr&NOW=1338843132189&q=lowerfilt:("quote+red+fox")&spellcheck.count=10&qt=spellCheckCompRH&isShard=true&spellcheck.alternativeTermCount=5} status=0 QTime=0 
   [junit4]   2> 3820 T3077 C180 REQ [collection1] webapp=/solr path=/select params={spellcheck=true&spellcheck.maxResultsForSuggest=10&shards.qt=spellCheckCompRH&spellcheck.extendedResults=true&spellcheck.collateExtendedResults=true&spellcheck.maxCollationTries=10&spellcheck.maxCollations=1&spellcheck.collate=true&wt=javabin&version=2&fl=id,lowerfilt&shards=[::1]:33332/solr|localhost:50999/solr&q=lowerfilt:("quote+red+fox")&spellcheck.count=10&qt=spellCheckCompRH&spellcheck.alternativeTermCount=5} status=0 QTime=7 
   [junit4]   2> 3826 T3061 C179 REQ [collection1] webapp=/solr path=/select params={spellcheck=true&spellcheck.maxResultsForSuggest=10&shards.qt=spellCheckCompRH&spellcheck.extendedResults=true&spellcheck.collateExtendedResults=true&spellcheck.maxCollationTries=10&spellcheck.maxCollations=1&distrib=false&spellcheck.collate=true&wt=javabin&version=2&fl=id,lowerfilt&q=lowerfilt:("rod+fix")&spellcheck.count=10&qt=spellCheckCompRH&spellcheck.alternativeTermCount=5} hits=1 status=0 QTime=4 
   [junit4]   2> 3834 T3075 C180 REQ [collection1] webapp=/solr path=/select params={spellcheck=true&shards.qt=spellCheckCompRH&spellcheck.maxCollationTries=10&distrib=false&version=2&fl=id,score&shard.url=[::1]:33332/solr|localhost:50999/solr&NOW=1338843132204&spellcheck.count=10&qt=spellCheckCompRH&fsv=true&spellcheck.alternativeTermCount=5&spellcheck.maxResultsForSuggest=10&spellcheck.extendedResults=true&spellcheck.collateExtendedResults=true&spellcheck.maxCollations=1&spellcheck.collate=true&wt=javabin&spellcheck.onlyMorePopular=false&rows=10&start=0&q=lowerfilt:("rod+fix")&isShard=true} hits=1 status=0 QTime=3 
   [junit4]   2> 3837 T3075 C180 REQ [collection1] webapp=/solr path=/select params={spellcheck=false&spellcheck.maxResultsForSuggest=10&spellcheck.extendedResults=true&shards.qt=spellCheckCompRH&spellcheck.collateExtendedResults=true&spellcheck.maxCollationTries=10&spellcheck.maxCollations=1&ids=25&distrib=false&spellcheck.collate=true&wt=javabin&spellcheck.onlyMorePopular=false&version=2&fl=id,lowerfilt&shard.url=[::1]:33332/solr|localhost:50999/solr&NOW=1338843132204&q=lowerfilt:("rod+fix")&spellcheck.count=10&qt=spellCheckCompRH&isShard=true&spellcheck.alternativeTermCount=5} status=0 QTime=0 
   [junit4]   2> 3838 T3077 C180 oashc.SpellCheckComponent.finishStage [::1]:33332/solr|localhost:50999/solr {suggestions={rod={numFound=2,startOffset=12,endOffset=15,origFreq=1,suggestion=[{word=red,freq=13}, {word=ford,freq=1}]},fix={numFound=1,startOffset=16,endOffset=19,origFreq=1,suggestion=[{word=fox,freq=13}]},correctlySpelled=false,collation={collationQuery=lowerfilt:("red fox"),hits=13,misspellingsAndCorrections={rod=red,fix=fox},collationInternalRank=2}}}
   [junit4]   2> 3838 T3077 C180 oashc.SpellCheckComponent.finishStage [::1]:33332/solr|localhost:50999/solr null
   [junit4]   2> 3839 T3077 C180 REQ [collection1] webapp=/solr path=/select params={spellcheck=true&spellcheck.maxResultsForSuggest=10&shards.qt=spellCheckCompRH&spellcheck.extendedResults=true&spellcheck.collateExtendedResults=true&spellcheck.maxCollationTries=10&spellcheck.maxCollations=1&spellcheck.collate=true&wt=javabin&version=2&fl=id,lowerfilt&shards=[::1]:33332/solr|localhost:50999/solr&q=lowerfilt:("rod+fix")&spellcheck.count=10&qt=spellCheckCompRH&spellcheck.alternativeTermCount=5} status=0 QTime=11 
   [junit4]   2> 3863 T3061 C179 oasc.SolrException.log SEVERE java.lang.NullPointerException
   [junit4]   2> 		at org.apache.solr.handler.component.SpellCheckComponent.toNamedList(SpellCheckComponent.java:566)
   [junit4]   2> 		at org.apache.solr.handler.component.SpellCheckComponent.process(SpellCheckComponent.java:177)
   [junit4]   2> 		at org.apache.solr.handler.component.SearchHandler.handleRequestBody(SearchHandler.java:204)
   [junit4]   2> 		at org.apache.solr.handler.RequestHandlerBase.handleRequest(RequestHandlerBase.java:129)
   [junit4]   2> 		at org.apache.solr.core.SolrCore.execute(SolrCore.java:1555)
   [junit4]   2> 		at org.apache.solr.servlet.SolrDispatchFilter.execute(SolrDispatchFilter.java:442)
   [junit4]   2> 		at org.apache.solr.servlet.SolrDispatchFilter.doFilter(SolrDispatchFilter.java:263)
   [junit4]   2> 		at org.eclipse.jetty.servlet.ServletHandler$CachedChain.doFilter(ServletHandler.java:1337)
   [junit4]   2> 		at org.eclipse.jetty.servlet.ServletHandler.doHandle(ServletHandler.java:484)
   [junit4]   2> 		at org.eclipse.jetty.server.session.SessionHandler.doHandle(SessionHandler.java:231)
   [junit4]   2> 		at org.eclipse.jetty.server.handler.ScopedHandler.handle(ScopedHandler.java:119)
   [junit4]   2> 		at org.eclipse.jetty.server.handler.GzipHandler.handle(GzipHandler.java:267)
   [junit4]   2> 		at org.eclipse.jetty.server.handler.ContextHandler.doHandle(ContextHandler.java:1067)
   [junit4]   2> 		at org.eclipse.jetty.servlet.ServletHandler.doScope(ServletHandler.java:413)
   [junit4]   2> 		at org.eclipse.jetty.server.session.SessionHandler.doScope(SessionHandler.java:192)
   [junit4]   2> 		at org.eclipse.jetty.server.handler.ContextHandler.doScope(ContextHandler.java:999)
   [junit4]   2> 		at org.eclipse.jetty.server.handler.ScopedHandler.handle(ScopedHandler.java:117)
   [junit4]   2> 		at org.eclipse.jetty.server.handler.HandlerWrapper.handle(HandlerWrapper.java:111)
   [junit4]   2> 		at org.eclipse.jetty.server.Server.handle(Server.java:351)
   [junit4]   2> 		at org.eclipse.jetty.server.AbstractHttpConnection.handleRequest(AbstractHttpConnection.java:454)
   [junit4]   2> 		at org.eclipse.jetty.server.BlockingHttpConnection.handleRequest(BlockingHttpConnection.java:47)
   [junit4]   2> 		at org.eclipse.jetty.server.AbstractHttpConnection.headerComplete(AbstractHttpConnection.java:890)
   [junit4]   2> 		at org.eclipse.jetty.server.AbstractHttpConnection$RequestHandler.headerComplete(AbstractHttpConnection.java:944)
   [junit4]   2> 		at org.eclipse.jetty.http.HttpParser.parseNext(HttpParser.java:634)
   [junit4]   2> 		at org.eclipse.jetty.http.HttpParser.parseAvailable(HttpParser.java:230)
   [junit4]   2> 		at org.eclipse.jetty.server.BlockingHttpConnection.handle(BlockingHttpConnection.java:66)
   [junit4]   2> 		at org.eclipse.jetty.server.bio.SocketConnector$ConnectorEndPoint.run(SocketConnector.java:254)
   [junit4]   2> 		at org.eclipse.jetty.util.thread.QueuedThreadPool.runJob(QueuedThreadPool.java:599)
   [junit4]   2> 		at org.eclipse.jetty.util.thread.QueuedThreadPool$3.run(QueuedThreadPool.java:534)
   [junit4]   2> 		at java.lang.Thread.run(Thread.java:722)
   [junit4]   2> 	
   [junit4]   2> 3864 T3061 C179 REQ [collection1] webapp=/solr path=/select params={spellcheck=true&shards.qt=spellCheckWithWordbreak_Direct&spellcheck.extendedResults=true&spellcheck.collateExtendedResults=true&spellcheck.maxCollationTries=0&spellcheck.maxCollations=1&distrib=false&spellcheck.collate=true&wt=javabin&version=2&fl=id,lowerfilt&q=lowerfilt:(%2Bquock+%2Bredfox+%2Bjum+%2Bped)&spellcheck.count=10&qt=spellCheckWithWordbreak_Direct} hits=0 status=500 QTime=22 
   [junit4]   2> 3864 T3061 C179 oasc.SolrException.log SEVERE null:java.lang.NullPointerException
   [junit4]   2> 		at org.apache.solr.handler.component.SpellCheckComponent.toNamedList(SpellCheckComponent.java:566)
   [junit4]   2> 		at org.apache.solr.handler.component.SpellCheckComponent.process(SpellCheckComponent.java:177)
   [junit4]   2> 		at org.apache.solr.handler.component.SearchHandler.handleRequestBody(SearchHandler.java:204)
   [junit4]   2> 		at org.apache.solr.handler.RequestHandlerBase.handleRequest(RequestHandlerBase.java:129)
   [junit4]   2> 		at org.apache.solr.core.SolrCore.execute(SolrCore.java:1555)
   [junit4]   2> 		at org.apache.solr.servlet.SolrDispatchFilter.execute(SolrDispatchFilter.java:442)
   [junit4]   2> 		at org.apache.solr.servlet.SolrDispatchFilter.doFilter(SolrDispatchFilter.java:263)
   [junit4]   2> 		at org.eclipse.jetty.servlet.ServletHandler$CachedChain.doFilter(ServletHandler.java:1337)
   [junit4]   2> 		at org.eclipse.jetty.servlet.ServletHandler.doHandle(ServletHandler.java:484)
   [junit4]   2> 		at org.eclipse.jetty.server.session.SessionHandler.doHandle(SessionHandler.java:231)
   [junit4]   2> 		at org.eclipse.jetty.server.handler.ScopedHandler.handle(ScopedHandler.java:119)
   [junit4]   2> 		at org.eclipse.jetty.server.handler.GzipHandler.handle(GzipHandler.java:267)
   [junit4]   2> 		at org.eclipse.jetty.server.handler.ContextHandler.doHandle(ContextHandler.java:1067)
   [junit4]   2> 		at org.eclipse.jetty.servlet.ServletHandler.doScope(ServletHandler.java:413)
   [junit4]   2> 		at org.eclipse.jetty.server.session.SessionHandler.doScope(SessionHandler.java:192)
   [junit4]   2> 		at org.eclipse.jetty.server.handler.ContextHandler.doScope(ContextHandler.java:999)
   [junit4]   2> 		at org.eclipse.jetty.server.handler.ScopedHandler.handle(ScopedHandler.java:117)
   [junit4]   2> 		at org.eclipse.jetty.server.handler.HandlerWrapper.handle(HandlerWrapper.java:111)
   [junit4]   2> 		at org.eclipse.jetty.server.Server.handle(Server.java:351)
   [junit4]   2> 		at org.eclipse.jetty.server.AbstractHttpConnection.handleRequest(AbstractHttpConnection.java:454)
   [junit4]   2> 		at org.eclipse.jetty.server.BlockingHttpConnection.handleRequest(BlockingHttpConnection.java:47)
   [junit4]   2> 		at org.eclipse.jetty.server.AbstractHttpConnection.headerComplete(AbstractHttpConnection.java:890)
   [junit4]   2> 		at org.eclipse.jetty.server.AbstractHttpConnection$RequestHandler.headerComplete(AbstractHttpConnection.java:944)
   [junit4]   2> 		at org.eclipse.jetty.http.HttpParser.parseNext(HttpParser.java:634)
   [junit4]   2> 		at org.eclipse.jetty.http.HttpParser.parseAvailable(HttpParser.java:230)
   [junit4]   2> 		at org.eclipse.jetty.server.BlockingHttpConnection.handle(BlockingHttpConnection.java:66)
   [junit4]   2> 		at org.eclipse.jetty.server.bio.SocketConnector$ConnectorEndPoint.run(SocketConnector.java:254)
   [junit4]   2> 		at org.eclipse.jetty.util.thread.QueuedThreadPool.runJob(QueuedThreadPool.java:599)
   [junit4]   2> 		at org.eclipse.jetty.util.thread.QueuedThreadPool$3.run(QueuedThreadPool.java:534)
   [junit4]   2> 		at java.lang.Thread.run(Thread.java:722)
   [junit4]   2> 	
   [junit4]   2> 3866 T3058 oasc.CoreContainer.shutdown Shutting down CoreContainer instance=1644052996
   [junit4]   2> 3866 T3058 oasc.SolrCore.close [collection1]  CLOSING SolrCore org.apache.solr.core.SolrCore@1dd617c2
   [junit4]   2> 3869 T3058 oasc.SolrCore.closeSearcher [collection1] Closing main searcher on request.
   [junit4]   2> 3871 T3058 oasu.DirectUpdateHandler2.close closing DirectUpdateHandler2{commits=1,autocommits=0,soft autocommits=0,optimizes=0,rollbacks=0,expungeDeletes=0,docsPending=0,adds=0,deletesById=0,deletesByQuery=0,errors=0,cumulative_adds=24,cumulative_deletesById=0,cumulative_deletesByQuery=1,cumulative_errors=0}
   [junit4]   2> 3873 T3058 oejsh.ContextHandler.doStop stopped o.e.j.s.ServletContextHandler{/solr,null}
   [junit4]   2> 3926 T3058 oasc.CoreContainer.shutdown Shutting down CoreContainer instance=714310760
   [junit4]   2> 3926 T3058 oasc.SolrCore.close [collection1]  CLOSING SolrCore org.apache.solr.core.SolrCore@6bf45363
   [junit4]   2> 3930 T3058 oasc.SolrCore.closeSearcher [collection1] Closing main searcher on request.
   [junit4]   2> 3931 T3058 oasu.DirectUpdateHandler2.close closing DirectUpdateHandler2{commits=1,autocommits=0,soft autocommits=0,optimizes=0,rollbacks=0,expungeDeletes=0,docsPending=0,adds=0,deletesById=0,deletesByQuery=0,errors=0,cumulative_adds=24,cumulative_deletesById=0,cumulative_deletesByQuery=1,cumulative_errors=0}
   [junit4]   2> 3937 T3058 oejsh.ContextHandler.doStop stopped o.e.j.s.ServletContextHandler{/solr,null}
   [junit4]   2> !!!! WARNING: best effort to remove C:\Jenkins\workspace\Lucene-Solr-trunk-Windows-Java7-64\solr\build\solr-core\test\J0\.\org.apache.solr.handler.component.DistributedSpellCheckComponentTest-1338843128377\control\data\spellchecker1\_0.fdt FAILED !!!!!
   [junit4]   2> !!!! WARNING: best effort to remove C:\Jenkins\workspace\Lucene-Solr-trunk-Windows-Java7-64\solr\build\solr-core\test\J0\.\org.apache.solr.handler.component.DistributedSpellCheckComponentTest-1338843128377\control\data\spellchecker1 FAILED !!!!!
   [junit4]   2> !!!! WARNING: best effort to remove C:\Jenkins\workspace\Lucene-Solr-trunk-Windows-Java7-64\solr\build\solr-core\test\J0\.\org.apache.solr.handler.component.DistributedSpellCheckComponentTest-1338843128377\control\data FAILED !!!!!
   [junit4]   2> !!!! WARNING: best effort to remove C:\Jenkins\workspace\Lucene-Solr-trunk-Windows-Java7-64\solr\build\solr-core\test\J0\.\org.apache.solr.handler.component.DistributedSpellCheckComponentTest-1338843128377\control FAILED !!!!!
   [junit4]   2> !!!! WARNING: best effort to remove C:\Jenkins\workspace\Lucene-Solr-trunk-Windows-Java7-64\solr\build\solr-core\test\J0\.\org.apache.solr.handler.component.DistributedSpellCheckComponentTest-1338843128377 FAILED !!!!!
   [junit4]   2> 4002 T3058 oas.SolrTestCaseJ4.tearDown ###Ending testDistribSearch
   [junit4]   2> NOTE: reproduce with: ant test  -Dtestcase=DistributedSpellCheckComponentTest -Dtests.method=testDistribSearch -Dtests.seed=DB2A91C8FCE71C59 -Dtests.locale=th_TH_TH_#u-nu-thai -Dtests.timezone=Africa/Libreville -Dargs="-Dfile.encoding=Cp1252"
   [junit4]   2>
   [junit4]    > (@AfterClass output)
   [junit4]   2> 4012 T3058 oas.SolrTestCaseJ4.deleteCore ###deleteCore
   [junit4]   2> NOTE: test params are: codec=Lucene40: {end4=MockVariableIntBlock(baseBlockSize=76), end3=PostingsFormat(name=NestedPulsing), end2=MockFixedIntBlock(blockSize=1679), start1=PostingsFormat(name=Lucene40WithOrds), end1=Lucene40(minBlockSize=52 maxBlockSize=166), start4=PostingsFormat(name=MockRandom), start2=Pulsing40(freqCutoff=16 minBlockSize=52 maxBlockSize=166), start3=MockVariableIntBlock(baseBlockSize=76), gram2=PostingsFormat(name=Lucene40WithOrds), word=PostingsFormat(name=MockSep), gram1=Pulsing40(freqCutoff=16 minBlockSize=52 maxBlockSize=166), gram4=MockVariableIntBlock(baseBlockSize=76), gram3=PostingsFormat(name=NestedPulsing)}, sim=DefaultSimilarity, locale=th_TH_TH_#u-nu-thai, timezone=Africa/Libreville
   [junit4]   2> NOTE: Windows 7 6.1 amd64/Oracle Corporation 1.7.0_04 (64-bit)/cpus=2,threads=1,free=183532584,total=290258944
   [junit4]   2> NOTE: All tests run in this JVM: [LukeRequestHandlerTest, TestBrazilianStemFilterFactory, SolrCmdDistributorTest, IndexReaderFactoryTest, SortByFunctionTest, BadComponentTest, OverseerTest, CommonGramsQueryFilterFactoryTest, IndexSchemaRuntimeFieldTest, StatsComponentTest, EchoParamsTest, TestQueryUtils, LengthFilterTest, TestCzechStemFilterFactory, TestLatvianStemFilterFactory, HighlighterTest, MinimalSchemaTest, OutputWriterTest, CopyFieldTest, HighlighterConfigTest, TestCoreContainer, ShowFileRequestHandlerTest, TestMergePolicyConfig, TestRussianLightStemFilterFactory, TestWikipediaTokenizerFactory, BasicFunctionalityTest, TestDFRSimilarityFactory, LeaderElectionTest, ResourceLoaderTest, TestNorwegianMinimalStemFilterFactory, SolrPluginUtilsTest, LoggingHandlerTest, RecoveryZkTest, TestItalianLightStemFilterFactory, LegacyHTMLStripCharFilterTest, TestNumberUtils, RAMDirectoryFactoryTest, TestDistributedGrouping, TestArbitraryIndexDir, TestFaceting, TestDictionaryCompoundWordTokenFilterFactory, CloudStateTest, SOLR749Test, TestCJKBigramFilterFactory, RequestHandlersTest, TestPropInject, TestSolrDeletionPolicy2, TestPseudoReturnFields, TestGermanNormalizationFilterFactory, TestPhraseSuggestions, TestExtendedDismaxParser, TestJmxMonitoredMap, FullSolrCloudTest, TermVectorComponentTest, TestJapaneseBaseFormFilterFactory, WordBreakSolrSpellCheckerTest, QueryParsingTest, PrimUtilsTest, MBeansHandlerTest, XsltUpdateRequestHandlerTest, TestTurkishLowerCaseFilterFactory, TestDistributedSearch, TestTypeTokenFilterFactory, TestMultiCoreConfBootstrap, JSONWriterTest, TestGalicianMinimalStemFilterFactory, DirectUpdateHandlerOptimizeTest, SuggesterFSTTest, TestSpanishLightStemFilterFactory, CSVRequestHandlerTest, TestRangeQuery, TestCodecSupport, SolrIndexConfigTest, CloudStateUpdateTest, TestDocSet, SolrCoreTest, TestPorterStemFilterFactory, TestFastLRUCache, TestEnglishMinimalStemFilterFactory, TestGermanMinimalStemFilterFactory, TestFiltering, TestGalicianStemFilterFactory, TestIndexingPerformance, MoreLikeThisHandlerTest, JsonLoaderTest, TestStopFilterFactory, TestPhoneticFilterFactory, UUIDFieldTest, FastVectorHighlighterTest, DirectSolrConnectionTest, PingRequestHandlerTest, TestSolrXMLSerializer, SignatureUpdateProcessorFactoryTest, DisMaxRequestHandlerTest, OpenExchangeRatesOrgProviderTest, SoftAutoCommitTest, URLClassifyProcessorTest, DistanceFunctionTest, RequiredFieldsTest, TestCSVLoader, TestLuceneMatchVersion, TestNGramFilters, TestSearchPerf, TestRecovery, TimeZoneUtilsTest, TestReverseStringFilterFactory, UniqFieldsUpdateProcessorFactoryTest, TestHyphenationCompoundWordTokenFilterFactory, TestPerFieldSimilarity, TestGermanStemFilterFactory, SpellCheckCollatorTest, TestStandardFactories, TestFinnishLightStemFilterFactory, TestCollationField, TestPatternReplaceFilterFactory, AutoCommitTest, TestRemoteStreaming, TestDefaultSimilarityFactory, SimpleFacetsTest, AlternateDirectoryTest, TestPortugueseStemFilterFactory, TestReplicationHandler, TestPHPSerializedResponseWriter, TestPortugueseMinimalStemFilterFactory, DateMathParserTest, StandardRequestHandlerTest, TestSort, TestSystemIdResolver, TestThaiWordFilterFactory, IndexBasedSpellCheckerTest, FieldAnalysisRequestHandlerTest, PluginInfoTest, TestReversedWildcardFilterFactory, TestHungarianLightStemFilterFactory, TestHashPartitioner, NodeStateWatcherTest, SuggesterTSTTest, TestBinaryField, TestSolrDeletionPolicy1, TestSolrQueryParser, TestQueryTypes, BasicZkTest, TestRemoveDuplicatesTokenFilterFactory, TestValueSourceCache, TestPropInjectDefaults, TestPatternReplaceCharFilterFactory, DirectSolrSpellCheckerTest, TestLRUCache, TestHunspellStemFilterFactory, IndexSchemaTest, TestSynonymFilterFactory, CommonGramsFilterFactoryTest, XmlUpdateRequestHandlerTest, TestPortugueseLightStemFilterFactory, TestRealTimeGet, TestSwedishLightStemFilterFactory, TestQuerySenderListener, TestIBSimilarityFactory, TestPluginEnable, TestLMJelinekMercerSimilarityFactory, TestXIncludeConfig, TestBinaryResponseWriter, TestMultiWordSynonyms, DefaultValueUpdateProcessorTest, TestSolrCoreProperties, TestUtils, TestJapanesePartOfSpeechStopFilterFactory, MultiTermTest, DateFieldTest, TestWordDelimiterFilterFactory, TestJmxIntegration, SuggesterWFSTTest, SpellCheckComponentTest, PrimitiveFieldTypeTest, TestBM25SimilarityFactory, DocumentBuilderTest, BadIndexSchemaTest, TestIndexSearcher, SystemInfoHandlerTest, TestFunctionQuery, TestHindiFilters, TestBadConfig, LeaderElectionIntegrationTest, NoCacheHeaderTest, FileBasedSpellCheckerTest, ZkControllerTest, TestFrenchLightStemFilterFactory, TestKeywordMarkerFilterFactory, TestConfig, TestBeiderMorseFilterFactory, TestKStemFilterFactory, TestIndonesianStemFilterFactory, TestCJKWidthFilterFactory, TestSurroundQueryParser, TestArabicFilters, TestRandomFaceting, BasicDistributedZkTest, TestGreekLowerCaseFilterFactory, FullSolrCloudDistribCmdsTest, ZkSolrClientTest, DistributedSpellCheckComponentTest]
   [junit4]   2> 
   [junit4] Completed in 4.02s, 1 test, 1 error <<< FAILURES!
[...truncated 220 lines...]

[...truncated 12250 lines...]

[...truncated 12250 lines...]

[...truncated 12250 lines...]


Mime
View raw message