lucene-dev mailing list archives

Site index · List index
Message view « Date » · « Thread »
Top « Date » · « Thread »
From Apache Jenkins Server <jenk...@builds.apache.org>
Subject [JENKINS] Lucene-Solr-tests-only-4.x - Build # 9 - Failure
Date Thu, 07 Jun 2012 12:58:40 GMT
Build: https://builds.apache.org/job/Lucene-Solr-tests-only-4.x/9/

1 tests failed.
FAILED:  junit.framework.TestSuite.org.apache.solr.handler.TestReplicationHandler

Error Message:
ERROR: SolrIndexSearcher opens=74 closes=73

Stack Trace:
java.lang.AssertionError: ERROR: SolrIndexSearcher opens=74 closes=73
	at __randomizedtesting.SeedInfo.seed([507D895F3623C6D]:0)
	at org.junit.Assert.fail(Assert.java:93)
	at org.apache.solr.SolrTestCaseJ4.endTrackingSearchers(SolrTestCaseJ4.java:190)
	at org.apache.solr.SolrTestCaseJ4.afterClass(SolrTestCaseJ4.java:82)
	at sun.reflect.GeneratedMethodAccessor13.invoke(Unknown Source)
	at sun.reflect.DelegatingMethodAccessorImpl.invoke(DelegatingMethodAccessorImpl.java:43)
	at java.lang.reflect.Method.invoke(Method.java:616)
	at com.carrotsearch.randomizedtesting.RandomizedRunner.invoke(RandomizedRunner.java:1969)
	at com.carrotsearch.randomizedtesting.RandomizedRunner.access$1100(RandomizedRunner.java:132)
	at com.carrotsearch.randomizedtesting.RandomizedRunner$5.evaluate(RandomizedRunner.java:752)
	at com.carrotsearch.randomizedtesting.rules.SystemPropertiesRestoreRule$1.evaluate(SystemPropertiesRestoreRule.java:53)
	at org.apache.lucene.util.AbstractBeforeAfterRule$1.evaluate(AbstractBeforeAfterRule.java:45)
	at org.apache.lucene.util.TestRuleReportUncaughtExceptions$1.evaluate(TestRuleReportUncaughtExceptions.java:68)
	at org.apache.lucene.util.TestRuleStoreClassName$1.evaluate(TestRuleStoreClassName.java:38)
	at org.apache.lucene.util.TestRuleIcuHack$1.evaluate(TestRuleIcuHack.java:51)
	at com.carrotsearch.randomizedtesting.rules.SystemPropertiesInvariantRule$1.evaluate(SystemPropertiesInvariantRule.java:55)
	at org.apache.lucene.util.TestRuleNoInstanceHooksOverrides$1.evaluate(TestRuleNoInstanceHooksOverrides.java:53)
	at org.apache.lucene.util.TestRuleNoStaticHooksShadowing$1.evaluate(TestRuleNoStaticHooksShadowing.java:52)
	at org.apache.lucene.util.TestRuleAssertionsRequired$1.evaluate(TestRuleAssertionsRequired.java:36)
	at org.apache.lucene.util.TestRuleMarkFailure$1.evaluate(TestRuleMarkFailure.java:48)
	at org.apache.lucene.util.TestRuleIgnoreTestSuites$1.evaluate(TestRuleIgnoreTestSuites.java:56)
	at com.carrotsearch.randomizedtesting.RandomizedRunner.runSuite(RandomizedRunner.java:605)
	at com.carrotsearch.randomizedtesting.RandomizedRunner.access$400(RandomizedRunner.java:132)
	at com.carrotsearch.randomizedtesting.RandomizedRunner$2.run(RandomizedRunner.java:551)




Build Log:
[...truncated 9986 lines...]
   [junit4]   2> 114 T1790 oashc.HttpShardHandlerFactory.getParameter Setting corePoolSize
to: 0
   [junit4]   2> 114 T1790 oashc.HttpShardHandlerFactory.getParameter Setting maximumPoolSize
to: 2147483647
   [junit4]   2> 115 T1790 oashc.HttpShardHandlerFactory.getParameter Setting maxThreadIdleTime
to: 5
   [junit4]   2> 115 T1790 oashc.HttpShardHandlerFactory.getParameter Setting sizeOfQueue
to: -1
   [junit4]   2> 115 T1790 oashc.HttpShardHandlerFactory.getParameter Setting fairnessPolicy
to: false
   [junit4]   2> 115 T1790 oascsi.HttpClientUtil.createClient Creating new http client,
config:maxConnectionsPerHost=20&maxConnections=10000&socketTimeout=0&connTimeout=0&retry=false
   [junit4]   2> 124 T1790 oasc.CoreContainer.create Creating SolrCore 'collection1' using
instanceDir: ./org.apache.solr.handler.TestReplicationHandler$SolrInstance-1339073537416/slave/.
   [junit4]   2> 124 T1790 oasc.SolrResourceLoader.<init> new SolrResourceLoader
for directory: './org.apache.solr.handler.TestReplicationHandler$SolrInstance-1339073537416/slave/./'
   [junit4]   2> 136 T1790 oasc.SolrConfig.<init> Using Lucene MatchVersion: LUCENE_40
   [junit4]   2> 159 T1790 oasc.SolrConfig.<init> Loaded SolrConfig: solrconfig.xml
   [junit4]   2> 159 T1790 oass.IndexSchema.readSchema Reading Solr Schema
   [junit4]   2> 161 T1790 oass.IndexSchema.readSchema Schema name=test
   [junit4]   2> 168 T1790 oass.IndexSchema.readSchema WARNING no default search field
specified in schema.
   [junit4]   2> 169 T1790 oass.IndexSchema.readSchema unique key field: id
   [junit4]   2> 170 T1790 oasc.SolrCore.<init> [collection1] Opening new SolrCore
at ./org.apache.solr.handler.TestReplicationHandler$SolrInstance-1339073537416/slave/./, dataDir=./org.apache.solr.handler.TestReplicationHandler$SolrInstance-1339073537416/slave/data/
   [junit4]   2> 170 T1790 oasc.SolrCore.<init> JMX monitoring not detected for core:
collection1
   [junit4]   2> 171 T1790 oasc.SolrCore.initIndex WARNING [collection1] Solr index directory
'./org.apache.solr.handler.TestReplicationHandler$SolrInstance-1339073537416/slave/data/index'
doesn't exist. Creating new index...
   [junit4]   2> 173 T1790 oasc.SolrDeletionPolicy.onCommit SolrDeletionPolicy.onCommit:
commits:num=1
   [junit4]   2> 		commit{dir=/usr/home/hudson/hudson-slave/workspace/Lucene-Solr-tests-only-4.x/checkout/solr/build/solr-core/test/J1/org.apache.solr.handler.TestReplicationHandler$SolrInstance-1339073537416/slave/data/index,segFN=segments_1,generation=1,filenames=[segments_1]
   [junit4]   2> 174 T1790 oasc.SolrDeletionPolicy.updateCommits newest commit = 1
   [junit4]   2> 174 T1790 oasc.RequestHandlers.initHandlersFromConfig created standard:
solr.StandardRequestHandler
   [junit4]   2> 174 T1790 oasc.RequestHandlers.initHandlersFromConfig created defaults:
solr.StandardRequestHandler
   [junit4]   2> 175 T1790 oasc.RequestHandlers.initHandlersFromConfig adding lazy requestHandler:
solr.StandardRequestHandler
   [junit4]   2> 175 T1790 oasc.RequestHandlers.initHandlersFromConfig created lazy: solr.StandardRequestHandler
   [junit4]   2> 175 T1790 oasc.RequestHandlers.initHandlersFromConfig created /update:
solr.UpdateRequestHandler
   [junit4]   2> 175 T1790 oasc.RequestHandlers.initHandlersFromConfig created /replication:
solr.ReplicationHandler
   [junit4]   2> 176 T1790 oashl.XMLLoader.init xsltCacheLifetimeSeconds=60
   [junit4]   2> 177 T1790 oass.SolrIndexSearcher.<init> Opening Searcher@f40f91d
main
   [junit4]   2> 178 T1790 oasu.CommitTracker.<init> Hard AutoCommit: disabled
   [junit4]   2> 178 T1790 oasu.CommitTracker.<init> Soft AutoCommit: disabled
   [junit4]   2> 179 T1790 oash.SnapPuller.startExecutorService Poll Scheduled at an interval
of 1000ms
   [junit4]   2> 179 T1790 oasc.CoreContainer.register registering core: collection1
   [junit4]   2> 179 T1810 oasc.SolrCore.registerSearcher [collection1] Registered new
searcher Searcher@f40f91d main{StandardDirectoryReader(segments_1:1)}
   [junit4]   2> 179 T1790 oass.SolrDispatchFilter.init user.dir=/usr/home/hudson/hudson-slave/workspace/Lucene-Solr-tests-only-4.x/checkout/solr/build/solr-core/test/J1
   [junit4]   2> 180 T1790 oass.SolrDispatchFilter.init SolrDispatchFilter.init() done
   [junit4]   2> 180 T1790 oascsi.HttpClientUtil.createClient Creating new http client,
config:maxConnections=128&maxConnectionsPerHost=32&followRedirects=false
   [junit4]   2> 
   [junit4]    > (@AfterClass output)
   [junit4]   2> 27799 T1790 oasc.CoreContainer.shutdown Shutting down CoreContainer instance=592687930
   [junit4]   2> 27800 T1790 oasc.SolrCore.close [collection1]  CLOSING SolrCore org.apache.solr.core.SolrCore@30111774
   [junit4]   2> 27800 T1790 oasc.SolrCore.closeSearcher [collection1] Closing main searcher
on request.
   [junit4]   2> 27800 T1790 oasu.DirectUpdateHandler2.close closing DirectUpdateHandler2{commits=1,autocommits=0,soft
autocommits=0,optimizes=0,rollbacks=0,expungeDeletes=0,docsPending=0,adds=0,deletesById=0,deletesByQuery=0,errors=0,cumulative_adds=493,cumulative_deletesById=0,cumulative_deletesByQuery=1,cumulative_errors=0}
   [junit4]   2> 27801 T1790 oejsh.ContextHandler.doStop stopped o.e.j.s.ServletContextHandler{/solr,null}
   [junit4]   2> 27853 T1790 oasc.CoreContainer.shutdown Shutting down CoreContainer instance=703675302
   [junit4]   2> 27853 T1790 oasc.SolrCore.close [collection1]  CLOSING SolrCore org.apache.solr.core.SolrCore@6347e1e9
   [junit4]   2> 27853 T1790 oasc.SolrCore.closeSearcher [collection1] Closing main searcher
on request.
   [junit4]   2> 27853 T1790 oasu.DirectUpdateHandler2.close closing DirectUpdateHandler2{commits=2,autocommits=0,soft
autocommits=0,optimizes=0,rollbacks=0,expungeDeletes=0,docsPending=0,adds=0,deletesById=0,deletesByQuery=0,errors=0,cumulative_adds=1,cumulative_deletesById=0,cumulative_deletesByQuery=0,cumulative_errors=0}
   [junit4]   2> 27854 T1790 oejsh.ContextHandler.doStop stopped o.e.j.s.ServletContextHandler{/solr,null}
   [junit4]   2> 27913 T1790 oas.SolrTestCaseJ4.deleteCore ###deleteCore
   [junit4]   2> 30683 T1992 oash.SnapPuller.fetchLatestIndex SEVERE Master at: http://localhost:26308/solr/replication
is not available. Index fetch failed. Exception: Connect to localhost:26308 timed out
   [junit4]   2> 30684 T1992 oash.SnapPuller.logReplicationTimeAndConfFiles WARNING Exception
while updating statistics java.io.FileNotFoundException: ./org.apache.solr.handler.TestReplicationHandler$SolrInstance-1339073537416/slave/data/replication.properties
(No such file or directory)
   [junit4]   2> 	at java.io.FileOutputStream.open(Native Method)
   [junit4]   2> 	at java.io.FileOutputStream.<init>(FileOutputStream.java:209)
   [junit4]   2> 	at java.io.FileOutputStream.<init>(FileOutputStream.java:160)
   [junit4]   2> 	at org.apache.solr.handler.SnapPuller.logReplicationTimeAndConfFiles(SnapPuller.java:469)
   [junit4]   2> 	at org.apache.solr.handler.SnapPuller.fetchLatestIndex(SnapPuller.java:395)
   [junit4]   2> 	at org.apache.solr.handler.ReplicationHandler.doFetch(ReplicationHandler.java:298)
   [junit4]   2> 	at org.apache.solr.handler.SnapPuller$1.run(SnapPuller.java:169)
   [junit4]   2> 	at java.util.concurrent.Executors$RunnableAdapter.call(Executors.java:471)
   [junit4]   2> 	at java.util.concurrent.FutureTask$Sync.innerRunAndReset(FutureTask.java:351)
   [junit4]   2> 	at java.util.concurrent.FutureTask.runAndReset(FutureTask.java:178)
   [junit4]   2> 	at java.util.concurrent.ScheduledThreadPoolExecutor$ScheduledFutureTask.access$201(ScheduledThreadPoolExecutor.java:165)
   [junit4]   2> 	at java.util.concurrent.ScheduledThreadPoolExecutor$ScheduledFutureTask.run(ScheduledThreadPoolExecutor.java:267)
   [junit4]   2> 	at java.util.concurrent.ThreadPoolExecutor.runWorker(ThreadPoolExecutor.java:1110)
   [junit4]   2> 	at java.util.concurrent.ThreadPoolExecutor$Worker.run(ThreadPoolExecutor.java:603)
   [junit4]   2> 	at java.lang.Thread.run(Thread.java:679)
   [junit4]   2> 
   [junit4]   2> 149034 T1790 oas.SolrTestCaseJ4.endTrackingSearchers SEVERE ERROR: SolrIndexSearcher
opens=74 closes=73
   [junit4]   2> NOTE: test params are: codec=Lucene40: {}, sim=RandomSimilarityProvider(queryNorm=false,coord=false):
{}, locale=lv, timezone=Europe/Vilnius
   [junit4]   2> NOTE: FreeBSD 9.0-RELEASE amd64/Sun Microsystems Inc. 1.6.0_32 (64-bit)/cpus=16,threads=1,free=99304512,total=167444480
   [junit4]   2> NOTE: All tests run in this JVM: [TestUAX29URLEmailTokenizerFactory, SignatureUpdateProcessorFactoryTest,
TestRangeQuery, CopyFieldTest, DateFieldTest, TestLMJelinekMercerSimilarityFactory, TestIndexingPerformance,
FileBasedSpellCheckerTest, MoreLikeThisHandlerTest, TestCJKTokenizerFactory, TestSolrDeletionPolicy2,
SystemInfoHandlerTest, TestFiltering, DocumentAnalysisRequestHandlerTest, DateMathParserTest,
TermsComponentTest, TestRussianLightStemFilterFactory, TestHyphenationCompoundWordTokenFilterFactory,
TestSynonymFilterFactory, TestTypeTokenFilterFactory, SOLR749Test, CacheHeaderTest, TestJapaneseBaseFormFilterFactory,
TestJapaneseTokenizerFactory, TestLFUCache, TestDelimitedPayloadTokenFilterFactory, TestSolrQueryParser,
IndexSchemaTest, TestGreekStemFilterFactory, JSONWriterTest, CloudStateTest, TestNorwegianLightStemFilterFactory,
TestIrishLowerCaseFilterFactory, TestUpdate, TestQueryTypes, RecoveryZkTest, CoreAdminHandlerTest,
NumericFieldsTest, TestSolrCoreProperties, TestDefaultSimilarityFactory, TestBinaryResponseWriter,
TestRecovery, RAMDirectoryFactoryTest, TestArabicFilters, TestSolrDeletionPolicy1, TestXIncludeConfig,
TestDistributedGrouping, TestStemmerOverrideFilterFactory, SearchHandlerTest, OpenExchangeRatesOrgProviderTest,
TestHTMLStripCharFilterFactory, UpdateRequestProcessorFactoryTest, TestKeywordMarkerFilterFactory,
SortByFunctionTest, SimpleFacetsTest, TestQueryUtils, TestTurkishLowerCaseFilterFactory, TestPorterStemFilterFactory,
OverseerTest, CommonGramsQueryFilterFactoryTest, TestCollationField, QueryElevationComponentTest,
TestMultiWordSynonyms, DebugComponentTest, TestDFRSimilarityFactory, TestSort, TestValueSourceCache,
TestPhraseSuggestions, TestSearchPerf, TestConfig, PluginInfoTest, PingRequestHandlerTest,
SolrPluginUtilsTest, TestPersianNormalizationFilterFactory, TestRealTimeGet, SuggesterTSTTest,
DistributedQueryElevationComponentTest, SolrRequestParserTest, TestGroupingSearch, TestGermanStemFilterFactory,
FileUtilsTest, TestCollationKeyFilterFactory, RequiredFieldsTest, LengthFilterTest, TestGreekLowerCaseFilterFactory,
TestEnglishMinimalStemFilterFactory, NodeStateWatcherTest, TestReplicationHandler]
   [junit4]   2> NOTE: reproduce with: ant test  -Dtestcase=TestReplicationHandler -Dtests.seed=507D895F3623C6D
-Dtests.multiplier=3 -Dtests.locale=lv -Dtests.timezone=Europe/Vilnius -Dargs="-Dfile.encoding=ISO8859-1"
   [junit4]   2> 
   [junit4] ERROR   0.00s J1 | TestReplicationHandler (suite)
   [junit4]    > Throwable #1: java.lang.AssertionError: ERROR: SolrIndexSearcher opens=74
closes=73
   [junit4]    > 	at __randomizedtesting.SeedInfo.seed([507D895F3623C6D]:0)
   [junit4]    > 	at org.junit.Assert.fail(Assert.java:93)
   [junit4]    > 	at org.apache.solr.SolrTestCaseJ4.endTrackingSearchers(SolrTestCaseJ4.java:190)
   [junit4]    > 	at org.apache.solr.SolrTestCaseJ4.afterClass(SolrTestCaseJ4.java:82)
   [junit4]    > 	at sun.reflect.GeneratedMethodAccessor13.invoke(Unknown Source)
   [junit4]    > 	at sun.reflect.DelegatingMethodAccessorImpl.invoke(DelegatingMethodAccessorImpl.java:43)
   [junit4]    > 	at java.lang.reflect.Method.invoke(Method.java:616)
   [junit4]    > 	at com.carrotsearch.randomizedtesting.RandomizedRunner.invoke(RandomizedRunner.java:1969)
   [junit4]    > 	at com.carrotsearch.randomizedtesting.RandomizedRunner.access$1100(RandomizedRunner.java:132)
   [junit4]    > 	at com.carrotsearch.randomizedtesting.RandomizedRunner$5.evaluate(RandomizedRunner.java:752)
   [junit4]    > 	at com.carrotsearch.randomizedtesting.rules.SystemPropertiesRestoreRule$1.evaluate(SystemPropertiesRestoreRule.java:53)
   [junit4]    > 	at org.apache.lucene.util.AbstractBeforeAfterRule$1.evaluate(AbstractBeforeAfterRule.java:45)
   [junit4]    > 	at org.apache.lucene.util.TestRuleReportUncaughtExceptions$1.evaluate(TestRuleReportUncaughtExceptions.java:68)
   [junit4]    > 	at org.apache.lucene.util.TestRuleStoreClassName$1.evaluate(TestRuleStoreClassName.java:38)
   [junit4]    > 	at org.apache.lucene.util.TestRuleIcuHack$1.evaluate(TestRuleIcuHack.java:51)
   [junit4]    > 	at com.carrotsearch.randomizedtesting.rules.SystemPropertiesInvariantRule$1.evaluate(SystemPropertiesInvariantRule.java:55)
   [junit4]    > 	at org.apache.lucene.util.TestRuleNoInstanceHooksOverrides$1.evaluate(TestRuleNoInstanceHooksOverrides.java:53)
   [junit4]    > 	at org.apache.lucene.util.TestRuleNoStaticHooksShadowing$1.evaluate(TestRuleNoStaticHooksShadowing.java:52)
   [junit4]    > 	at org.apache.lucene.util.TestRuleAssertionsRequired$1.evaluate(TestRuleAssertionsRequired.java:36)
   [junit4]    > 	at org.apache.lucene.util.TestRuleMarkFailure$1.evaluate(TestRuleMarkFailure.java:48)
   [junit4]    > 	at org.apache.lucene.util.TestRuleIgnoreTestSuites$1.evaluate(TestRuleIgnoreTestSuites.java:56)
   [junit4]    > 	at com.carrotsearch.randomizedtesting.RandomizedRunner.runSuite(RandomizedRunner.java:605)
   [junit4]    > 	at com.carrotsearch.randomizedtesting.RandomizedRunner.access$400(RandomizedRunner.java:132)
   [junit4]    > 	at com.carrotsearch.randomizedtesting.RandomizedRunner$2.run(RandomizedRunner.java:551)
   [junit4]    >
   [junit4] Completed on J1 in 149.06s, 1 test, 1 failure <<< FAILURES!
[...truncated 393 lines...]

[...truncated 10480 lines...]

[...truncated 10480 lines...]

[...truncated 10480 lines...]

[...truncated 10480 lines...]

[...truncated 10480 lines...]



Mime
View raw message