lucene-dev mailing list archives

Site index · List index
Message view « Date » · « Thread »
Top « Date » · « Thread »
From jenk...@sd-datasolutions.de
Subject [JENKINS] Lucene-Solr-trunk-Windows-Java6-64 - Build # 411 - Still Failing!
Date Mon, 04 Jun 2012 16:04:36 GMT
Build: http://jenkins.sd-datasolutions.de/job/Lucene-Solr-trunk-Windows-Java6-64/411/

1 tests failed.
FAILED:  junit.framework.TestSuite.org.apache.solr.cloud.BasicDistributedZkTest

Error Message:
ERROR: SolrIndexSearcher opens=418 closes=417

Stack Trace:
java.lang.AssertionError: ERROR: SolrIndexSearcher opens=418 closes=417
	at __randomizedtesting.SeedInfo.seed([14D0BE9A870A96F8]:0)
	at org.junit.Assert.fail(Assert.java:93)
	at org.apache.solr.SolrTestCaseJ4.endTrackingSearchers(SolrTestCaseJ4.java:190)
	at org.apache.solr.SolrTestCaseJ4.afterClass(SolrTestCaseJ4.java:82)
	at sun.reflect.GeneratedMethodAccessor15.invoke(Unknown Source)
	at sun.reflect.DelegatingMethodAccessorImpl.invoke(DelegatingMethodAccessorImpl.java:25)
	at java.lang.reflect.Method.invoke(Method.java:597)
	at com.carrotsearch.randomizedtesting.RandomizedRunner.invoke(RandomizedRunner.java:1969)
	at com.carrotsearch.randomizedtesting.RandomizedRunner.access$1100(RandomizedRunner.java:132)
	at com.carrotsearch.randomizedtesting.RandomizedRunner$5.evaluate(RandomizedRunner.java:752)
	at com.carrotsearch.randomizedtesting.rules.SystemPropertiesRestoreRule$1.evaluate(SystemPropertiesRestoreRule.java:53)
	at org.apache.lucene.util.AbstractBeforeAfterRule$1.evaluate(AbstractBeforeAfterRule.java:45)
	at org.apache.lucene.util.TestRuleReportUncaughtExceptions$1.evaluate(TestRuleReportUncaughtExceptions.java:68)
	at org.apache.lucene.util.TestRuleStoreClassName$1.evaluate(TestRuleStoreClassName.java:38)
	at org.apache.lucene.util.TestRuleIcuHack$1.evaluate(TestRuleIcuHack.java:51)
	at com.carrotsearch.randomizedtesting.rules.SystemPropertiesInvariantRule$1.evaluate(SystemPropertiesInvariantRule.java:55)
	at org.apache.lucene.util.TestRuleNoInstanceHooksOverrides$1.evaluate(TestRuleNoInstanceHooksOverrides.java:53)
	at org.apache.lucene.util.TestRuleNoStaticHooksShadowing$1.evaluate(TestRuleNoStaticHooksShadowing.java:52)
	at org.apache.lucene.util.TestRuleAssertionsRequired$1.evaluate(TestRuleAssertionsRequired.java:36)
	at org.apache.lucene.util.TestRuleMarkFailure$1.evaluate(TestRuleMarkFailure.java:48)
	at org.apache.lucene.util.TestRuleIgnoreTestSuites$1.evaluate(TestRuleIgnoreTestSuites.java:56)
	at com.carrotsearch.randomizedtesting.RandomizedRunner.runSuite(RandomizedRunner.java:605)
	at com.carrotsearch.randomizedtesting.RandomizedRunner.access$400(RandomizedRunner.java:132)
	at com.carrotsearch.randomizedtesting.RandomizedRunner$2.run(RandomizedRunner.java:551)




Build Log:
[...truncated 10461 lines...]
   [junit4]   2> 141786 T995 oaz.ClientCnxn$SendThread.run WARNING Session 0x137b8326ceb0010
for server null, unexpected error, closing socket connection and attempting reconnect java.net.ConnectException:
Connection refused: no further information
   [junit4]   2> 	at sun.nio.ch.SocketChannelImpl.checkConnect(Native Method)
   [junit4]   2> 	at sun.nio.ch.SocketChannelImpl.finishConnect(SocketChannelImpl.java:599)
   [junit4]   2> 	at org.apache.zookeeper.ClientCnxn$SendThread.run(ClientCnxn.java:1146)
   [junit4]   2> 
   [junit4]   2> 143232 T995 oaz.ClientCnxn$SendThread.startConnect Opening socket connection
to server 127.0.0.1/127.0.0.1:64321
   [junit4]   2> 144419 T995 oaz.ClientCnxn$SendThread.run WARNING Session 0x137b8326ceb0010
for server null, unexpected error, closing socket connection and attempting reconnect java.net.ConnectException:
Connection refused: no further information
   [junit4]   2> 	at sun.nio.ch.SocketChannelImpl.checkConnect(Native Method)
   [junit4]   2> 	at sun.nio.ch.SocketChannelImpl.finishConnect(SocketChannelImpl.java:599)
   [junit4]   2> 	at org.apache.zookeeper.ClientCnxn$SendThread.run(ClientCnxn.java:1146)
   [junit4]   2> 
   [junit4]   2> 146724 T995 oaz.ClientCnxn$SendThread.startConnect Opening socket connection
to server 127.0.0.1/127.0.0.1:64321
   [junit4]   2> 147793 T995 oaz.ClientCnxn$SendThread.run WARNING Session 0x137b8326ceb0010
for server null, unexpected error, closing socket connection and attempting reconnect java.net.ConnectException:
Connection refused: no further information
   [junit4]   2> 	at sun.nio.ch.SocketChannelImpl.checkConnect(Native Method)
   [junit4]   2> 	at sun.nio.ch.SocketChannelImpl.finishConnect(SocketChannelImpl.java:599)
   [junit4]   2> 	at org.apache.zookeeper.ClientCnxn$SendThread.run(ClientCnxn.java:1146)
   [junit4]   2> 
   [junit4]   2> 149059 T995 oaz.ClientCnxn$SendThread.startConnect Opening socket connection
to server 127.0.0.1/127.0.0.1:64321
   [junit4]   2> 150129 T995 oaz.ClientCnxn$SendThread.run WARNING Session 0x137b8326ceb0010
for server null, unexpected error, closing socket connection and attempting reconnect java.net.ConnectException:
Connection refused: no further information
   [junit4]   2> 	at sun.nio.ch.SocketChannelImpl.checkConnect(Native Method)
   [junit4]   2> 	at sun.nio.ch.SocketChannelImpl.finishConnect(SocketChannelImpl.java:599)
   [junit4]   2> 	at org.apache.zookeeper.ClientCnxn$SendThread.run(ClientCnxn.java:1146)
   [junit4]   2> 
   [junit4]   2> 151926 T995 oaz.ClientCnxn$SendThread.startConnect Opening socket connection
to server 127.0.0.1/127.0.0.1:64321
   [junit4]   2> 152994 T995 oaz.ClientCnxn$SendThread.run WARNING Session 0x137b8326ceb0010
for server null, unexpected error, closing socket connection and attempting reconnect java.net.ConnectException:
Connection refused: no further information
   [junit4]   2> 	at sun.nio.ch.SocketChannelImpl.checkConnect(Native Method)
   [junit4]   2> 	at sun.nio.ch.SocketChannelImpl.finishConnect(SocketChannelImpl.java:599)
   [junit4]   2> 	at org.apache.zookeeper.ClientCnxn$SendThread.run(ClientCnxn.java:1146)
   [junit4]   2> 
   [junit4]   2> 154378 T995 oaz.ClientCnxn$SendThread.startConnect Opening socket connection
to server 127.0.0.1/127.0.0.1:64321
   [junit4]   2> 155447 T995 oaz.ClientCnxn$SendThread.run WARNING Session 0x137b8326ceb0010
for server null, unexpected error, closing socket connection and attempting reconnect java.net.ConnectException:
Connection refused: no further information
   [junit4]   2> 	at sun.nio.ch.SocketChannelImpl.checkConnect(Native Method)
   [junit4]   2> 	at sun.nio.ch.SocketChannelImpl.finishConnect(SocketChannelImpl.java:599)
   [junit4]   2> 	at org.apache.zookeeper.ClientCnxn$SendThread.run(ClientCnxn.java:1146)
   [junit4]   2> 
   [junit4]   2> 157447 T995 oaz.ClientCnxn$SendThread.startConnect Opening socket connection
to server 127.0.0.1/127.0.0.1:64321
   [junit4]   2> 158403 T995 oaz.ClientCnxn$SendThread.run WARNING Session 0x137b8326ceb0010
for server null, unexpected error, closing socket connection and attempting reconnect java.net.ConnectException:
Connection refused: no further information
   [junit4]   2> 	at sun.nio.ch.SocketChannelImpl.checkConnect(Native Method)
   [junit4]   2> 	at sun.nio.ch.SocketChannelImpl.finishConnect(SocketChannelImpl.java:599)
   [junit4]   2> 	at org.apache.zookeeper.ClientCnxn$SendThread.run(ClientCnxn.java:1146)
   [junit4]   2> 
   [junit4]   2> 159224 T996 oascc.ZkStateReader$2.process WARNING ZooKeeper watch triggered,
but Solr cannot talk to ZK
   [junit4]   2> 159825 T995 oaz.ClientCnxn$SendThread.startConnect Opening socket connection
to server 127.0.0.1/127.0.0.1:64321
   [junit4]   2> 160789 T995 oaz.ClientCnxn$SendThread.run WARNING Session 0x137b8326ceb0010
for server null, unexpected error, closing socket connection and attempting reconnect java.net.ConnectException:
Connection refused: no further information
   [junit4]   2> 	at sun.nio.ch.SocketChannelImpl.checkConnect(Native Method)
   [junit4]   2> 	at sun.nio.ch.SocketChannelImpl.finishConnect(SocketChannelImpl.java:599)
   [junit4]   2> 	at org.apache.zookeeper.ClientCnxn$SendThread.run(ClientCnxn.java:1146)
   [junit4]   2> 
   [junit4]   2> 162377 T995 oaz.ClientCnxn$SendThread.startConnect Opening socket connection
to server 127.0.0.1/127.0.0.1:64321
   [junit4]   2> 163339 T995 oaz.ClientCnxn$SendThread.run WARNING Session 0x137b8326ceb0010
for server null, unexpected error, closing socket connection and attempting reconnect java.net.ConnectException:
Connection refused: no further information
   [junit4]   2> 	at sun.nio.ch.SocketChannelImpl.checkConnect(Native Method)
   [junit4]   2> 	at sun.nio.ch.SocketChannelImpl.finishConnect(SocketChannelImpl.java:599)
   [junit4]   2> 	at org.apache.zookeeper.ClientCnxn$SendThread.run(ClientCnxn.java:1146)
   [junit4]   2> 
   [junit4]   2> 165249 T995 oaz.ClientCnxn$SendThread.startConnect Opening socket connection
to server 127.0.0.1/127.0.0.1:64321
   [junit4]   2> 166162 T995 oaz.ClientCnxn$SendThread.run WARNING Session 0x137b8326ceb0010
for server null, unexpected error, closing socket connection and attempting reconnect java.net.ConnectException:
Connection refused: no further information
   [junit4]   2> 	at sun.nio.ch.SocketChannelImpl.checkConnect(Native Method)
   [junit4]   2> 	at sun.nio.ch.SocketChannelImpl.finishConnect(SocketChannelImpl.java:599)
   [junit4]   2> 	at org.apache.zookeeper.ClientCnxn$SendThread.run(ClientCnxn.java:1146)
   [junit4]   2> 
   [junit4]   2> 167858 T995 oaz.ClientCnxn$SendThread.startConnect Opening socket connection
to server 127.0.0.1/127.0.0.1:64321
   [junit4]   2> 168726 T995 oaz.ClientCnxn$SendThread.run WARNING Session 0x137b8326ceb0010
for server null, unexpected error, closing socket connection and attempting reconnect java.net.ConnectException:
Connection refused: no further information
   [junit4]   2> 	at sun.nio.ch.SocketChannelImpl.checkConnect(Native Method)
   [junit4]   2> 	at sun.nio.ch.SocketChannelImpl.finishConnect(SocketChannelImpl.java:599)
   [junit4]   2> 	at org.apache.zookeeper.ClientCnxn$SendThread.run(ClientCnxn.java:1146)
   [junit4]   2> 
   [junit4]   2> 170353 T995 oaz.ClientCnxn$SendThread.startConnect Opening socket connection
to server 127.0.0.1/127.0.0.1:64321
   [junit4]   2> 170671 T2569 oas.SolrTestCaseJ4.endTrackingSearchers SEVERE ERROR: SolrIndexSearcher
opens=418 closes=417
   [junit4]   2> NOTE: test params are: codec=Lucene40: {}, sim=DefaultSimilarity, locale=ar_SD,
timezone=Etc/GMT+12
   [junit4]   2> NOTE: Windows 7 6.1 amd64/Sun Microsystems Inc. 1.6.0_32 (64-bit)/cpus=2,threads=2,free=161558352,total=267583488
   [junit4]   2> NOTE: All tests run in this JVM: [TestConfig, MBeansHandlerTest, TestSurroundQueryParser,
ResourceLoaderTest, DirectSolrConnectionTest, TestDFRSimilarityFactory, TestPortugueseLightStemFilterFactory,
TestCoreContainer, TestFrenchMinimalStemFilterFactory, TestRealTimeGet, TestBadConfig, SOLR749Test,
TestStopFilterFactory, TestDelimitedPayloadTokenFilterFactory, TestNorwegianMinimalStemFilterFactory,
TestValueSourceCache, TestPersianNormalizationFilterFactory, ZkNodePropsTest, LengthFilterTest,
SortByFunctionTest, IndexSchemaTest, TestEnglishMinimalStemFilterFactory, TestSearchPerf,
SolrIndexConfigTest, SimpleFacetsTest, DistributedQueryElevationComponentTest, TestFaceting,
TestStandardFactories, TestIBSimilarityFactory, TestArabicFilters, TestBulgarianStemFilterFactory,
TestExtendedDismaxParser, TestSynonymFilterFactory, PingRequestHandlerTest, TestCodecSupport,
LukeRequestHandlerTest, JsonLoaderTest, TestUpdate, TestGermanLightStemFilterFactory, TestDocSet,
TestQueryTypes, TestReverseStringFilterFactory, LeaderElectionIntegrationTest, CoreAdminHandlerTest,
SignatureUpdateProcessorFactoryTest, SolrPluginUtilsTest, TestItalianLightStemFilterFactory,
NodeStateWatcherTest, XsltUpdateRequestHandlerTest, BasicFunctionalityTest, DistributedSpellCheckComponentTest,
TestIndexingPerformance, ConvertedLegacyTest, TestGreekStemFilterFactory, SolrRequestParserTest,
TestSolrCoreProperties, TestJmxIntegration, TestBeiderMorseFilterFactory, LeaderElectionTest,
JSONWriterTest, CacheHeaderTest, TestMultiCoreConfBootstrap, TestOmitPositions, TestQuerySenderListener,
TestFrenchLightStemFilterFactory, ZkSolrClientTest, TestWordDelimiterFilterFactory, SuggesterTSTTest,
TestPortugueseMinimalStemFilterFactory, OutputWriterTest, TestTrie, FullSolrCloudTest, SpellCheckCollatorTest,
RecoveryZkTest, TestMergePolicyConfig, SolrCoreCheckLockOnStartupTest, TestHindiFilters, ShowFileRequestHandlerTest,
AlternateDirectoryTest, TestDistributedGrouping, QueryElevationComponentTest, TestArbitraryIndexDir,
BadIndexSchemaTest, CurrencyFieldTest, IndexSchemaRuntimeFieldTest, TestWriterPerf, TestPatternTokenizerFactory,
CommonGramsQueryFilterFactoryTest, LegacyHTMLStripCharFilterTest, DateFieldTest, URLClassifyProcessorTest,
SnowballPorterFilterFactoryTest, RequiredFieldsTest, TestSolrDeletionPolicy2, TestHungarianLightStemFilterFactory,
TestRecovery, TestReversedWildcardFilterFactory, SolrInfoMBeanTest, CommonGramsFilterFactoryTest,
TestMultiWordSynonyms, StatsComponentTest, TestGalicianMinimalStemFilterFactory, TestHyphenationCompoundWordTokenFilterFactory,
TestWikipediaTokenizerFactory, NoCacheHeaderTest, TestGermanMinimalStemFilterFactory, TestLRUCache,
FieldAnalysisRequestHandlerTest, DirectUpdateHandlerTest, TestQuerySenderNoQuery, TestCzechStemFilterFactory,
TestGroupingSearch, TestBM25SimilarityFactory, TestBrazilianStemFilterFactory, TestGalicianStemFilterFactory,
TestPortugueseStemFilterFactory, TestRangeQuery, TestCollationField, TestPropInject, PeerSyncTest,
BasicZkTest, TestJapaneseBaseFormFilterFactory, TestSpanishLightStemFilterFactory, DateMathParserTest,
TestTurkishLowerCaseFilterFactory, UniqFieldsUpdateProcessorFactoryTest, LoggingHandlerTest,
TestThaiWordFilterFactory, TestPhraseSuggestions, PrimUtilsTest, TestPatternReplaceFilterFactory,
IndexReaderFactoryTest, TermVectorComponentTest, FieldMutatingUpdateProcessorTest, TestRemoteStreaming,
SpatialFilterTest, TestIndonesianStemFilterFactory, SpellCheckComponentTest, CloudStateUpdateTest,
TestPHPSerializedResponseWriter, EchoParamsTest, TestLFUCache, TestElisionFilterFactory, MoreLikeThisHandlerTest,
FastVectorHighlighterTest, TestFinnishLightStemFilterFactory, TestNorwegianLightStemFilterFactory,
FullSolrCloudDistribCmdsTest, TestSolrXMLSerializer, TestSolrDeletionPolicy1, IndexBasedSpellCheckerTest,
TestUAX29URLEmailTokenizerFactory, TestJapaneseTokenizerFactory, TestLatvianStemFilterFactory,
RequestHandlersTest, SuggesterTest, FileUtilsTest, DirectSolrSpellCheckerTest, TestPorterStemFilterFactory,
TestLMJelinekMercerSimilarityFactory, SoftAutoCommitTest, CloudStateTest, SolrCoreTest, TestPhoneticFilterFactory,
HighlighterConfigTest, TestSort, TestSuggestSpellingConverter, TestJapanesePartOfSpeechStopFilterFactory,
BadComponentTest, TestTypeTokenFilterFactory, DistanceFunctionTest, TestCJKWidthFilterFactory,
TestXIncludeConfig, TestJoin, TestMappingCharFilterFactory, TestFiltering, UUIDFieldTest,
TestHashPartitioner, TestSwedishLightStemFilterFactory, TestRemoveDuplicatesTokenFilterFactory,
TestStemmerOverrideFilterFactory, OpenExchangeRatesOrgProviderTest, AutoCommitTest, PrimitiveFieldTypeTest,
TestIrishLowerCaseFilterFactory, ReturnFieldsTest, TestTrimFilterFactory, CopyFieldTest, MultiTermTest,
TestDefaultSimilarityFactory, FileBasedSpellCheckerTest, DebugComponentTest, TestPropInjectDefaults,
TestCSVResponseWriter, TestBinaryResponseWriter, TestKeepFilterFactory, TestDistributedSearch,
TestKeywordMarkerFilterFactory, TestUtils, OverseerTest, BasicDistributedZkTest]
   [junit4]   2> NOTE: reproduce with: ant test  -Dtestcase=BasicDistributedZkTest -Dtests.seed=14D0BE9A870A96F8
-Dtests.locale=ar_SD -Dtests.timezone=Etc/GMT+12 -Dargs="-Dfile.encoding=Cp1252"
   [junit4]   2> 
   [junit4] ERROR   0.00s | BasicDistributedZkTest (suite)
   [junit4]    > Throwable #1: java.lang.AssertionError: ERROR: SolrIndexSearcher opens=418
closes=417
   [junit4]    > 	at __randomizedtesting.SeedInfo.seed([14D0BE9A870A96F8]:0)
   [junit4]    > 	at org.junit.Assert.fail(Assert.java:93)
   [junit4]    > 	at org.apache.solr.SolrTestCaseJ4.endTrackingSearchers(SolrTestCaseJ4.java:190)
   [junit4]    > 	at org.apache.solr.SolrTestCaseJ4.afterClass(SolrTestCaseJ4.java:82)
   [junit4]    > 	at sun.reflect.GeneratedMethodAccessor15.invoke(Unknown Source)
   [junit4]    > 	at sun.reflect.DelegatingMethodAccessorImpl.invoke(DelegatingMethodAccessorImpl.java:25)
   [junit4]    > 	at java.lang.reflect.Method.invoke(Method.java:597)
   [junit4]    > 	at com.carrotsearch.randomizedtesting.RandomizedRunner.invoke(RandomizedRunner.java:1969)
   [junit4]    > 	at com.carrotsearch.randomizedtesting.RandomizedRunner.access$1100(RandomizedRunner.java:132)
   [junit4]    > 	at com.carrotsearch.randomizedtesting.RandomizedRunner$5.evaluate(RandomizedRunner.java:752)
   [junit4]    > 	at com.carrotsearch.randomizedtesting.rules.SystemPropertiesRestoreRule$1.evaluate(SystemPropertiesRestoreRule.java:53)
   [junit4]    > 	at org.apache.lucene.util.AbstractBeforeAfterRule$1.evaluate(AbstractBeforeAfterRule.java:45)
   [junit4]    > 	at org.apache.lucene.util.TestRuleReportUncaughtExceptions$1.evaluate(TestRuleReportUncaughtExceptions.java:68)
   [junit4]    > 	at org.apache.lucene.util.TestRuleStoreClassName$1.evaluate(TestRuleStoreClassName.java:38)
   [junit4]    > 	at org.apache.lucene.util.TestRuleIcuHack$1.evaluate(TestRuleIcuHack.java:51)
   [junit4]    > 	at com.carrotsearch.randomizedtesting.rules.SystemPropertiesInvariantRule$1.evaluate(SystemPropertiesInvariantRule.java:55)
   [junit4]    > 	at org.apache.lucene.util.TestRuleNoInstanceHooksOverrides$1.evaluate(TestRuleNoInstanceHooksOverrides.java:53)
   [junit4]    > 	at org.apache.lucene.util.TestRuleNoStaticHooksShadowing$1.evaluate(TestRuleNoStaticHooksShadowing.java:52)
   [junit4]    > 	at org.apache.lucene.util.TestRuleAssertionsRequired$1.evaluate(TestRuleAssertionsRequired.java:36)
   [junit4]    > 	at org.apache.lucene.util.TestRuleMarkFailure$1.evaluate(TestRuleMarkFailure.java:48)
   [junit4]    > 	at org.apache.lucene.util.TestRuleIgnoreTestSuites$1.evaluate(TestRuleIgnoreTestSuites.java:56)
   [junit4]    > 	at com.carrotsearch.randomizedtesting.RandomizedRunner.runSuite(RandomizedRunner.java:605)
   [junit4]    > 	at com.carrotsearch.randomizedtesting.RandomizedRunner.access$400(RandomizedRunner.java:132)
   [junit4]    > 	at com.carrotsearch.randomizedtesting.RandomizedRunner$2.run(RandomizedRunner.java:551)
   [junit4]    >
   [junit4] Completed in 170.68s, 1 test, 1 failure <<< FAILURES!
[...truncated 218 lines...]

[...truncated 10780 lines...]

[...truncated 10780 lines...]

[...truncated 10780 lines...]


Mime
View raw message