lucene-dev mailing list archives

Site index · List index
Message view « Date » · « Thread »
Top « Date » · « Thread »
From jenk...@sd-datasolutions.de
Subject [JENKINS] Lucene-Solr-trunk-Windows-Java6-64 - Build # 470 - Still Failing!
Date Thu, 07 Jun 2012 16:40:03 GMT
Build: http://jenkins.sd-datasolutions.de/job/Lucene-Solr-trunk-Windows-Java6-64/470/

1 tests failed.
REGRESSION:  org.apache.lucene.index.TestDocumentsWriterStallControl.testAccquireReleaseRace

Error Message:
control claims no stalled threads but waiter seems to be blocked

Stack Trace:
java.lang.AssertionError: control claims no stalled threads but waiter seems to be blocked
	at __randomizedtesting.SeedInfo.seed([D22104E114BD10AC:E85D14D32C5DD91D]:0)
	at org.junit.Assert.fail(Assert.java:93)
	at org.junit.Assert.assertTrue(Assert.java:43)
	at org.apache.lucene.index.TestDocumentsWriterStallControl.testAccquireReleaseRace(TestDocumentsWriterStallControl.java:163)
	at sun.reflect.NativeMethodAccessorImpl.invoke0(Native Method)
	at sun.reflect.NativeMethodAccessorImpl.invoke(NativeMethodAccessorImpl.java:39)
	at sun.reflect.DelegatingMethodAccessorImpl.invoke(DelegatingMethodAccessorImpl.java:25)
	at java.lang.reflect.Method.invoke(Method.java:597)
	at com.carrotsearch.randomizedtesting.RandomizedRunner.invoke(RandomizedRunner.java:1969)
	at com.carrotsearch.randomizedtesting.RandomizedRunner.access$1100(RandomizedRunner.java:132)
	at com.carrotsearch.randomizedtesting.RandomizedRunner$6.evaluate(RandomizedRunner.java:814)
	at com.carrotsearch.randomizedtesting.RandomizedRunner$7.evaluate(RandomizedRunner.java:875)
	at com.carrotsearch.randomizedtesting.RandomizedRunner$8.evaluate(RandomizedRunner.java:889)
	at org.apache.lucene.util.TestRuleSetupTeardownChained$1.evaluate(TestRuleSetupTeardownChained.java:50)
	at org.apache.lucene.util.TestRuleFieldCacheSanity$1.evaluate(TestRuleFieldCacheSanity.java:32)
	at org.apache.lucene.util.AbstractBeforeAfterRule$1.evaluate(AbstractBeforeAfterRule.java:45)
	at com.carrotsearch.randomizedtesting.rules.SystemPropertiesInvariantRule$1.evaluate(SystemPropertiesInvariantRule.java:55)
	at org.apache.lucene.util.TestRuleReportUncaughtExceptions$1.evaluate(TestRuleReportUncaughtExceptions.java:68)
	at org.apache.lucene.util.TestRuleThreadAndTestName$1.evaluate(TestRuleThreadAndTestName.java:48)
	at org.apache.lucene.util.TestRuleMarkFailure$1.evaluate(TestRuleMarkFailure.java:48)
	at com.carrotsearch.randomizedtesting.RandomizedRunner.runSingleTest(RandomizedRunner.java:821)
	at com.carrotsearch.randomizedtesting.RandomizedRunner.access$700(RandomizedRunner.java:132)
	at com.carrotsearch.randomizedtesting.RandomizedRunner$3$1.run(RandomizedRunner.java:669)
	at com.carrotsearch.randomizedtesting.RandomizedRunner$3.evaluate(RandomizedRunner.java:695)
	at com.carrotsearch.randomizedtesting.RandomizedRunner$4.evaluate(RandomizedRunner.java:734)
	at com.carrotsearch.randomizedtesting.RandomizedRunner$5.evaluate(RandomizedRunner.java:745)
	at org.apache.lucene.util.AbstractBeforeAfterRule$1.evaluate(AbstractBeforeAfterRule.java:45)
	at org.apache.lucene.util.TestRuleReportUncaughtExceptions$1.evaluate(TestRuleReportUncaughtExceptions.java:68)
	at org.apache.lucene.util.TestRuleStoreClassName$1.evaluate(TestRuleStoreClassName.java:38)
	at org.apache.lucene.util.TestRuleIcuHack$1.evaluate(TestRuleIcuHack.java:51)
	at com.carrotsearch.randomizedtesting.rules.SystemPropertiesInvariantRule$1.evaluate(SystemPropertiesInvariantRule.java:55)
	at org.apache.lucene.util.TestRuleNoInstanceHooksOverrides$1.evaluate(TestRuleNoInstanceHooksOverrides.java:53)
	at org.apache.lucene.util.TestRuleNoStaticHooksShadowing$1.evaluate(TestRuleNoStaticHooksShadowing.java:52)
	at org.apache.lucene.util.TestRuleAssertionsRequired$1.evaluate(TestRuleAssertionsRequired.java:36)
	at org.apache.lucene.util.TestRuleMarkFailure$1.evaluate(TestRuleMarkFailure.java:48)
	at org.apache.lucene.util.TestRuleIgnoreTestSuites$1.evaluate(TestRuleIgnoreTestSuites.java:56)
	at com.carrotsearch.randomizedtesting.RandomizedRunner.runSuite(RandomizedRunner.java:605)
	at com.carrotsearch.randomizedtesting.RandomizedRunner.access$400(RandomizedRunner.java:132)
	at com.carrotsearch.randomizedtesting.RandomizedRunner$2.run(RandomizedRunner.java:551)




Build Log:
[...truncated 1044 lines...]
   [junit4] Completed in 1.62s, 14 tests
   [junit4]  
   [junit4] Suite: org.apache.lucene.util.TestNumericUtils
   [junit4] Completed in 1.28s, 12 tests
   [junit4]  
   [junit4] Suite: org.apache.lucene.index.TestBinaryTerms
   [junit4] Completed in 0.07s, 1 test
   [junit4]  
   [junit4] Suite: org.apache.lucene.index.TestIndexWriterExceptions
   [junit4] Completed in 4.70s, 24 tests
   [junit4]  
   [junit4] Suite: org.apache.lucene.TestSearch
   [junit4] Completed in 0.03s, 1 test
   [junit4]  
   [junit4] Suite: org.apache.lucene.util.TestVersionComparator
   [junit4] Completed in 0.01s, 1 test
   [junit4]  
   [junit4] Suite: org.apache.lucene.util.junitcompat.TestJUnitRuleOrder
   [junit4] Completed in 0.02s, 1 test
   [junit4]  
   [junit4] Suite: org.apache.lucene.search.TestSloppyPhraseQuery
   [junit4] Completed in 1.78s, 9 tests
   [junit4]  
   [junit4] Suite: org.apache.lucene.codecs.pulsing.TestPulsingReuse
   [junit4] Completed in 0.02s, 2 tests
   [junit4]  
   [junit4] Suite: org.apache.lucene.index.TestNoMergeScheduler
   [junit4] Completed in 0.01s, 3 tests
   [junit4]  
   [junit4] Suite: org.apache.lucene.index.TestRollback
   [junit4] Completed in 0.01s, 1 test
   [junit4]  
   [junit4] Suite: org.apache.lucene.index.TestNoDeletionPolicy
   [junit4] Completed in 0.05s, 4 tests
   [junit4]  
   [junit4] Suite: org.apache.lucene.index.TestDocumentsWriterStallControl
   [junit4] FAILURE 10.3s | TestDocumentsWriterStallControl.testAccquireReleaseRace
   [junit4]    > Throwable #1: java.lang.AssertionError: control claims no stalled threads
but waiter seems to be blocked
   [junit4]    > 	at __randomizedtesting.SeedInfo.seed([D22104E114BD10AC:E85D14D32C5DD91D]:0)
   [junit4]    > 	at org.junit.Assert.fail(Assert.java:93)
   [junit4]    > 	at org.junit.Assert.assertTrue(Assert.java:43)
   [junit4]    > 	at org.apache.lucene.index.TestDocumentsWriterStallControl.testAccquireReleaseRace(TestDocumentsWriterStallControl.java:163)
   [junit4]    > 	at sun.reflect.NativeMethodAccessorImpl.invoke0(Native Method)
   [junit4]    > 	at sun.reflect.NativeMethodAccessorImpl.invoke(NativeMethodAccessorImpl.java:39)
   [junit4]    > 	at sun.reflect.DelegatingMethodAccessorImpl.invoke(DelegatingMethodAccessorImpl.java:25)
   [junit4]    > 	at java.lang.reflect.Method.invoke(Method.java:597)
   [junit4]    > 	at com.carrotsearch.randomizedtesting.RandomizedRunner.invoke(RandomizedRunner.java:1969)
   [junit4]    > 	at com.carrotsearch.randomizedtesting.RandomizedRunner.access$1100(RandomizedRunner.java:132)
   [junit4]    > 	at com.carrotsearch.randomizedtesting.RandomizedRunner$6.evaluate(RandomizedRunner.java:814)
   [junit4]    > 	at com.carrotsearch.randomizedtesting.RandomizedRunner$7.evaluate(RandomizedRunner.java:875)
   [junit4]    > 	at com.carrotsearch.randomizedtesting.RandomizedRunner$8.evaluate(RandomizedRunner.java:889)
   [junit4]    > 	at org.apache.lucene.util.TestRuleSetupTeardownChained$1.evaluate(TestRuleSetupTeardownChained.java:50)
   [junit4]    > 	at org.apache.lucene.util.TestRuleFieldCacheSanity$1.evaluate(TestRuleFieldCacheSanity.java:32)
   [junit4]    > 	at org.apache.lucene.util.AbstractBeforeAfterRule$1.evaluate(AbstractBeforeAfterRule.java:45)
   [junit4]    > 	at com.carrotsearch.randomizedtesting.rules.SystemPropertiesInvariantRule$1.evaluate(SystemPropertiesInvariantRule.java:55)
   [junit4]    > 	at org.apache.lucene.util.TestRuleReportUncaughtExceptions$1.evaluate(TestRuleReportUncaughtExceptions.java:68)
   [junit4]    > 	at org.apache.lucene.util.TestRuleThreadAndTestName$1.evaluate(TestRuleThreadAndTestName.java:48)
   [junit4]    > 	at org.apache.lucene.util.TestRuleMarkFailure$1.evaluate(TestRuleMarkFailure.java:48)
   [junit4]    > 	at com.carrotsearch.randomizedtesting.RandomizedRunner.runSingleTest(RandomizedRunner.java:821)
   [junit4]    > 	at com.carrotsearch.randomizedtesting.RandomizedRunner.access$700(RandomizedRunner.java:132)
   [junit4]    > 	at com.carrotsearch.randomizedtesting.RandomizedRunner$3$1.run(RandomizedRunner.java:669)
   [junit4]    > 	at com.carrotsearch.randomizedtesting.RandomizedRunner$3.evaluate(RandomizedRunner.java:695)
   [junit4]    > 	at com.carrotsearch.randomizedtesting.RandomizedRunner$4.evaluate(RandomizedRunner.java:734)
   [junit4]    > 	at com.carrotsearch.randomizedtesting.RandomizedRunner$5.evaluate(RandomizedRunner.java:745)
   [junit4]    > 	at org.apache.lucene.util.AbstractBeforeAfterRule$1.evaluate(AbstractBeforeAfterRule.java:45)
   [junit4]    > 	at org.apache.lucene.util.TestRuleReportUncaughtExceptions$1.evaluate(TestRuleReportUncaughtExceptions.java:68)
   [junit4]    > 	at org.apache.lucene.util.TestRuleStoreClassName$1.evaluate(TestRuleStoreClassName.java:38)
   [junit4]    > 	at org.apache.lucene.util.TestRuleIcuHack$1.evaluate(TestRuleIcuHack.java:51)
   [junit4]    > 	at com.carrotsearch.randomizedtesting.rules.SystemPropertiesInvariantRule$1.evaluate(SystemPropertiesInvariantRule.java:55)
   [junit4]    > 	at org.apache.lucene.util.TestRuleNoInstanceHooksOverrides$1.evaluate(TestRuleNoInstanceHooksOverrides.java:53)
   [junit4]    > 	at org.apache.lucene.util.TestRuleNoStaticHooksShadowing$1.evaluate(TestRuleNoStaticHooksShadowing.java:52)
   [junit4]    > 	at org.apache.lucene.util.TestRuleAssertionsRequired$1.evaluate(TestRuleAssertionsRequired.java:36)
   [junit4]    > 	at org.apache.lucene.util.TestRuleMarkFailure$1.evaluate(TestRuleMarkFailure.java:48)
   [junit4]    > 	at org.apache.lucene.util.TestRuleIgnoreTestSuites$1.evaluate(TestRuleIgnoreTestSuites.java:56)
   [junit4]    > 	at com.carrotsearch.randomizedtesting.RandomizedRunner.runSuite(RandomizedRunner.java:605)
   [junit4]    > 	at com.carrotsearch.randomizedtesting.RandomizedRunner.access$400(RandomizedRunner.java:132)
   [junit4]    > 	at com.carrotsearch.randomizedtesting.RandomizedRunner$2.run(RandomizedRunner.java:551)
   [junit4]    > 
   [junit4]   2> java.lang.AssertionError
   [junit4]   2> 	at org.junit.Assert.fail(Assert.java:92)
   [junit4]   2> 	at org.junit.Assert.assertTrue(Assert.java:43)
   [junit4]   2> 	at org.junit.Assert.assertTrue(Assert.java:54)
   [junit4]   2> 	at org.apache.lucene.index.TestDocumentsWriterStallControl$Waiter.run(TestDocumentsWriterStallControl.java:225)
   [junit4]   2> java.lang.AssertionError
   [junit4]   2> 	at org.junit.Assert.fail(Assert.java:92)
   [junit4]   2> 	at org.junit.Assert.assertTrue(Assert.java:43)
   [junit4]   2> 	at org.junit.Assert.assertTrue(Assert.java:54)
   [junit4]   2> 	at org.apache.lucene.index.TestDocumentsWriterStallControl$Updater.run(TestDocumentsWriterStallControl.java:275)
   [junit4]   2> java.lang.AssertionError
   [junit4]   2> 	at org.junit.Assert.fail(Assert.java:92)
   [junit4]   2> 	at org.junit.Assert.assertTrue(Assert.java:43)
   [junit4]   2> 	at org.junit.Assert.assertTrue(Assert.java:54)
   [junit4]   2> 	at org.apache.lucene.index.TestDocumentsWriterStallControl$Updater.run(TestDocumentsWriterStallControl.java:275)
   [junit4]   2> NOTE: reproduce with: ant test  -Dtestcase=TestDocumentsWriterStallControl
-Dtests.method=testAccquireReleaseRace -Dtests.seed=D22104E114BD10AC -Dtests.locale=sl_SI
-Dtests.timezone=America/Los_Angeles -Dargs="-Dfile.encoding=Cp1252"
   [junit4]   2>
   [junit4]    > (@AfterClass output)
   [junit4]   2> NOTE: test params are: codec=Lucene40: {}, sim=DefaultSimilarity, locale=sl_SI,
timezone=America/Los_Angeles
   [junit4]   2> NOTE: Windows 7 6.1 amd64/Sun Microsystems Inc. 1.6.0_32 (64-bit)/cpus=2,threads=1,free=62803704,total=206438400
   [junit4]   2> NOTE: All tests run in this JVM: [TestSimpleExplanationsOfNonMatches,
TestTransactionRollback, TestLongPostings, TestSegmentMerger, TestToken, TestCopyBytes, TestBooleanOr,
TestFieldMaskingSpanQuery, TestAttributeSource, TestBoolean2, TestFieldCacheTermsFilter, TestWindowsMMap,
TestPositionIncrement, TestRamUsageEstimatorOnWildAnimals, TestNewestSegment, TestLevenshteinAutomata,
Test2BPostings, TestFieldValueFilter, TestTermVectorsWriter, TestConcurrentMergeScheduler,
TestPrefixInBooleanQuery, TestConstantScoreQuery, TestRollingUpdates, TestParallelTermEnum,
TestSimpleSearchEquivalence, TestAssertions, TestIOUtils, TestTransactions, TestBytesRefHash,
TestPrefixFilter, TestIndexWriterForceMerge, TestNoMergePolicy, TestNorms, TestSearchWithThreads,
TestReaderClosed, TestFieldsReader, TestByteBlockPool, TestBooleanQuery, TestMixedCodecs,
TestWildcard, TestArrayUtil, TestSmallFloat, TestCollectionUtil, TestIndexWriterLockRelease,
TestSort, TestParallelReaderEmptyIndex, TestNumericRangeQuery32, TestTermdocPerf, TestFlushByRamOrCountsPolicy,
TestRegexpQuery, TestAtomicUpdate, TestSimilarity2, TestAutomatonQuery, TestNeverDelete, TestFixedBitSet,
Test2BTerms, TestSearcherManager, TestAppendingCodec, TestPayloads, TestCachingWrapperFilter,
TestSubScorerFreqs, TestSloppyPhraseQuery2, TestTermsEnum, TestNGramPhraseQuery, TestIndexWriterDelete,
TestNRTCachingDirectory, TestPrefixQuery, TestDocValues, TestIsCurrent, TestSumDocFreq, TestDocBoost,
TestIndexInput, TestPositiveScoresOnlyCollector, TestByteArrayDataInput, TestIndexWriterOnDiskFull,
TestTwoPhaseCommitTool, TestExplanations, TestScorerPerf, TestTimeLimitingCollector, TestForTooMuchCloning,
TestByteSlices, TestHugeRamFile, TestPriorityQueue, TestDeterminism, TestTieredMergePolicy,
TestSegmentTermEnum, TestDateSort, TestDateFilter, TestLazyProxSkipping, TestPayloadSpans,
TestTopDocsMerge, TestElevationComparator, TestRegexpRandom2, TestMockAnalyzer, TestFlex,
TestBitUtil, TestNRTThreads, TestStressIndexing, TestBufferedIndexInput, TestIndexWriterOnJRECrash,
TestNot, TestUTF32ToUTF8, TestFilteredQuery, TestBackwardsCompatibility, TestSearchAfter,
TestPrefixCodedTerms, TestPrefixRandom, TestPayloadNearQuery, TestCompiledAutomaton, TestMultiFields,
TestVirtualMethod, TestMultiValuedNumericRangeQuery, TestFieldInfos, TestDirectoryReaderReopen,
TestDemo, TestSpansAdvanced2, TestBooleanMinShouldMatch, ThrowInUncaught, TestRamUsageEstimator,
TestBitVector, TestSimilarity, TestPayloadExplanations, TestIndexWriterMerging, TestDeterminizeLexicon,
TestRandomStoredFields, TestTermVectorsReader, TestMaxTermFrequency, TestPhrasePrefixQuery,
TestUnicodeUtil, TestMultiMMap, TestMultiLevelSkipList, Nested1, Nested2, Nested3, TestTopScoreDocCollector,
Test10KPulsings, TestUniqueTermCount, TestMatchAllDocsQuery, TestRollingCharBuffer, TestFSTs,
TestTermRangeFilter, TestIndexWriterWithThreads, TestRegexpRandom, TestPayloadProcessorProvider,
TestIdentityHashSet, TestCustomSearcherSort, TestSizeBoundedForceMerge, TestDocument, TestFilteredSearch,
TestSnapshotDeletionPolicy, TestSimpleAttributeImpl, TestSpans, TestRAMDirectory, TestCodecs,
TestTermRangeQuery, TestMergeSchedulerExternal, TestWeakIdentityMap, TestSearchForDuplicates,
TestNRTReaderWithThreads, TestCrash, TestOmitNorms, TestIndexWriterUnicode, TestCharTermAttributeImpl,
TestSpanExplanationsOfNonMatches, Nested, Nested, Nested1, TestCloseableThreadLocal, TestDocValuesIndexing,
TestNumericUtils, TestBinaryTerms, TestIndexWriterExceptions, TestSearch, TestVersionComparator,
Nested, TestSloppyPhraseQuery, TestPulsingReuse, TestNoMergeScheduler, TestRollback, TestNoDeletionPolicy,
TestDocumentsWriterStallControl]
   [junit4]   2> 
   [junit4] Completed in 10.84s, 3 tests, 1 failure <<< FAILURES!
[...truncated 378 lines...]

[...truncated 1523 lines...]

[...truncated 1523 lines...]

[...truncated 1523 lines...]

[...truncated 1523 lines...]

[...truncated 1523 lines...]



Mime
View raw message