lucene-dev mailing list archives

Site index · List index
Message view « Date » · « Thread »
Top « Date » · « Thread »
From jenk...@sd-datasolutions.de
Subject [JENKINS] Lucene-Solr-4.x-Windows-Java7-64 - Build # 28 - Failure!
Date Sat, 09 Jun 2012 18:45:33 GMT
Build: http://jenkins.sd-datasolutions.de/job/Lucene-Solr-4.x-Windows-Java7-64/28/

1 tests failed.
REGRESSION:  org.apache.lucene.index.TestDocumentsWriterStallControl.testAccquireReleaseRace

Error Message:
control claims no stalled threads but waiter seems to be blocked

Stack Trace:
java.lang.AssertionError: control claims no stalled threads but waiter seems to be blocked
	at __randomizedtesting.SeedInfo.seed([E29FD37F8D7D7876:D8E3C34DB59DB1C7]:0)
	at org.junit.Assert.fail(Assert.java:93)
	at org.junit.Assert.assertTrue(Assert.java:43)
	at org.apache.lucene.index.TestDocumentsWriterStallControl.testAccquireReleaseRace(TestDocumentsWriterStallControl.java:163)
	at sun.reflect.NativeMethodAccessorImpl.invoke0(Native Method)
	at sun.reflect.NativeMethodAccessorImpl.invoke(NativeMethodAccessorImpl.java:57)
	at sun.reflect.DelegatingMethodAccessorImpl.invoke(DelegatingMethodAccessorImpl.java:43)
	at java.lang.reflect.Method.invoke(Method.java:601)
	at com.carrotsearch.randomizedtesting.RandomizedRunner.invoke(RandomizedRunner.java:1969)
	at com.carrotsearch.randomizedtesting.RandomizedRunner.access$1100(RandomizedRunner.java:132)
	at com.carrotsearch.randomizedtesting.RandomizedRunner$6.evaluate(RandomizedRunner.java:814)
	at com.carrotsearch.randomizedtesting.RandomizedRunner$7.evaluate(RandomizedRunner.java:875)
	at com.carrotsearch.randomizedtesting.RandomizedRunner$8.evaluate(RandomizedRunner.java:889)
	at org.apache.lucene.util.TestRuleSetupTeardownChained$1.evaluate(TestRuleSetupTeardownChained.java:50)
	at org.apache.lucene.util.TestRuleFieldCacheSanity$1.evaluate(TestRuleFieldCacheSanity.java:32)
	at org.apache.lucene.util.AbstractBeforeAfterRule$1.evaluate(AbstractBeforeAfterRule.java:45)
	at com.carrotsearch.randomizedtesting.rules.SystemPropertiesInvariantRule$1.evaluate(SystemPropertiesInvariantRule.java:55)
	at org.apache.lucene.util.TestRuleReportUncaughtExceptions$1.evaluate(TestRuleReportUncaughtExceptions.java:68)
	at org.apache.lucene.util.TestRuleThreadAndTestName$1.evaluate(TestRuleThreadAndTestName.java:48)
	at org.apache.lucene.util.TestRuleMarkFailure$1.evaluate(TestRuleMarkFailure.java:48)
	at com.carrotsearch.randomizedtesting.RandomizedRunner.runSingleTest(RandomizedRunner.java:821)
	at com.carrotsearch.randomizedtesting.RandomizedRunner.access$700(RandomizedRunner.java:132)
	at com.carrotsearch.randomizedtesting.RandomizedRunner$3$1.run(RandomizedRunner.java:669)
	at com.carrotsearch.randomizedtesting.RandomizedRunner$3.evaluate(RandomizedRunner.java:695)
	at com.carrotsearch.randomizedtesting.RandomizedRunner$4.evaluate(RandomizedRunner.java:734)
	at com.carrotsearch.randomizedtesting.RandomizedRunner$5.evaluate(RandomizedRunner.java:745)
	at org.apache.lucene.util.AbstractBeforeAfterRule$1.evaluate(AbstractBeforeAfterRule.java:45)
	at org.apache.lucene.util.TestRuleReportUncaughtExceptions$1.evaluate(TestRuleReportUncaughtExceptions.java:68)
	at org.apache.lucene.util.TestRuleStoreClassName$1.evaluate(TestRuleStoreClassName.java:38)
	at org.apache.lucene.util.TestRuleIcuHack$1.evaluate(TestRuleIcuHack.java:51)
	at com.carrotsearch.randomizedtesting.rules.SystemPropertiesInvariantRule$1.evaluate(SystemPropertiesInvariantRule.java:55)
	at org.apache.lucene.util.TestRuleNoInstanceHooksOverrides$1.evaluate(TestRuleNoInstanceHooksOverrides.java:53)
	at org.apache.lucene.util.TestRuleNoStaticHooksShadowing$1.evaluate(TestRuleNoStaticHooksShadowing.java:52)
	at org.apache.lucene.util.TestRuleAssertionsRequired$1.evaluate(TestRuleAssertionsRequired.java:36)
	at org.apache.lucene.util.TestRuleMarkFailure$1.evaluate(TestRuleMarkFailure.java:48)
	at org.apache.lucene.util.TestRuleIgnoreTestSuites$1.evaluate(TestRuleIgnoreTestSuites.java:56)
	at com.carrotsearch.randomizedtesting.RandomizedRunner.runSuite(RandomizedRunner.java:605)
	at com.carrotsearch.randomizedtesting.RandomizedRunner.access$400(RandomizedRunner.java:132)
	at com.carrotsearch.randomizedtesting.RandomizedRunner$2.run(RandomizedRunner.java:551)




Build Log:
[...truncated 1152 lines...]
   [junit4] Suite: org.apache.lucene.index.TestPerSegmentDeletes
   [junit4] Completed in 0.04s, 1 test
   [junit4]  
   [junit4] Suite: org.apache.lucene.index.TestSegmentTermEnum
   [junit4] Completed in 0.05s, 2 tests
   [junit4]  
   [junit4] Suite: org.apache.lucene.search.TestFieldCacheTermsFilter
   [junit4] Completed in 0.03s, 1 test
   [junit4]  
   [junit4] Suite: org.apache.lucene.search.similarities.TestSimilarityBase
   [junit4] IGNOR/A 0.01s | TestSimilarityBase.testHeartRanking
   [junit4]    > Assumption #1: PreFlex codec does not support the stats necessary for
this test!
   [junit4] Completed in 0.38s, 29 tests, 1 skipped
   [junit4]  
   [junit4] Suite: org.apache.lucene.index.TestIndexableField
   [junit4] Completed in 0.18s, 1 test
   [junit4]  
   [junit4] Suite: org.apache.lucene.util.automaton.TestCompiledAutomaton
   [junit4] Completed in 0.07s, 2 tests
   [junit4]  
   [junit4] Suite: org.apache.lucene.util.TestBitUtil
   [junit4] Completed in 0.01s, 2 tests
   [junit4]  
   [junit4] Suite: org.apache.lucene.search.TestPrefixInBooleanQuery
   [junit4] Completed in 1.31s, 4 tests
   [junit4]  
   [junit4] Suite: org.apache.lucene.search.TestMultiThreadTermVectors
   [junit4] Completed in 0.40s, 1 test
   [junit4]  
   [junit4] Suite: org.apache.lucene.util.automaton.TestMinimize
   [junit4] Completed in 2.74s, 3 tests
   [junit4]  
   [junit4] Suite: org.apache.lucene.index.TestIndexInput
   [junit4] Completed in 0.39s, 3 tests
   [junit4]  
   [junit4] Suite: org.apache.lucene.index.TestDocumentsWriterStallControl
   [junit4] FAILURE 13.2s | TestDocumentsWriterStallControl.testAccquireReleaseRace
   [junit4]    > Throwable #1: java.lang.AssertionError: control claims no stalled threads
but waiter seems to be blocked
   [junit4]    > 	at __randomizedtesting.SeedInfo.seed([E29FD37F8D7D7876:D8E3C34DB59DB1C7]:0)
   [junit4]    > 	at org.junit.Assert.fail(Assert.java:93)
   [junit4]    > 	at org.junit.Assert.assertTrue(Assert.java:43)
   [junit4]    > 	at org.apache.lucene.index.TestDocumentsWriterStallControl.testAccquireReleaseRace(TestDocumentsWriterStallControl.java:163)
   [junit4]    > 	at sun.reflect.NativeMethodAccessorImpl.invoke0(Native Method)
   [junit4]    > 	at sun.reflect.NativeMethodAccessorImpl.invoke(NativeMethodAccessorImpl.java:57)
   [junit4]    > 	at sun.reflect.DelegatingMethodAccessorImpl.invoke(DelegatingMethodAccessorImpl.java:43)
   [junit4]    > 	at java.lang.reflect.Method.invoke(Method.java:601)
   [junit4]    > 	at com.carrotsearch.randomizedtesting.RandomizedRunner.invoke(RandomizedRunner.java:1969)
   [junit4]    > 	at com.carrotsearch.randomizedtesting.RandomizedRunner.access$1100(RandomizedRunner.java:132)
   [junit4]    > 	at com.carrotsearch.randomizedtesting.RandomizedRunner$6.evaluate(RandomizedRunner.java:814)
   [junit4]    > 	at com.carrotsearch.randomizedtesting.RandomizedRunner$7.evaluate(RandomizedRunner.java:875)
   [junit4]    > 	at com.carrotsearch.randomizedtesting.RandomizedRunner$8.evaluate(RandomizedRunner.java:889)
   [junit4]    > 	at org.apache.lucene.util.TestRuleSetupTeardownChained$1.evaluate(TestRuleSetupTeardownChained.java:50)
   [junit4]    > 	at org.apache.lucene.util.TestRuleFieldCacheSanity$1.evaluate(TestRuleFieldCacheSanity.java:32)
   [junit4]    > 	at org.apache.lucene.util.AbstractBeforeAfterRule$1.evaluate(AbstractBeforeAfterRule.java:45)
   [junit4]    > 	at com.carrotsearch.randomizedtesting.rules.SystemPropertiesInvariantRule$1.evaluate(SystemPropertiesInvariantRule.java:55)
   [junit4]    > 	at org.apache.lucene.util.TestRuleReportUncaughtExceptions$1.evaluate(TestRuleReportUncaughtExceptions.java:68)
   [junit4]    > 	at org.apache.lucene.util.TestRuleThreadAndTestName$1.evaluate(TestRuleThreadAndTestName.java:48)
   [junit4]    > 	at org.apache.lucene.util.TestRuleMarkFailure$1.evaluate(TestRuleMarkFailure.java:48)
   [junit4]    > 	at com.carrotsearch.randomizedtesting.RandomizedRunner.runSingleTest(RandomizedRunner.java:821)
   [junit4]    > 	at com.carrotsearch.randomizedtesting.RandomizedRunner.access$700(RandomizedRunner.java:132)
   [junit4]    > 	at com.carrotsearch.randomizedtesting.RandomizedRunner$3$1.run(RandomizedRunner.java:669)
   [junit4]    > 	at com.carrotsearch.randomizedtesting.RandomizedRunner$3.evaluate(RandomizedRunner.java:695)
   [junit4]    > 	at com.carrotsearch.randomizedtesting.RandomizedRunner$4.evaluate(RandomizedRunner.java:734)
   [junit4]    > 	at com.carrotsearch.randomizedtesting.RandomizedRunner$5.evaluate(RandomizedRunner.java:745)
   [junit4]    > 	at org.apache.lucene.util.AbstractBeforeAfterRule$1.evaluate(AbstractBeforeAfterRule.java:45)
   [junit4]    > 	at org.apache.lucene.util.TestRuleReportUncaughtExceptions$1.evaluate(TestRuleReportUncaughtExceptions.java:68)
   [junit4]    > 	at org.apache.lucene.util.TestRuleStoreClassName$1.evaluate(TestRuleStoreClassName.java:38)
   [junit4]    > 	at org.apache.lucene.util.TestRuleIcuHack$1.evaluate(TestRuleIcuHack.java:51)
   [junit4]    > 	at com.carrotsearch.randomizedtesting.rules.SystemPropertiesInvariantRule$1.evaluate(SystemPropertiesInvariantRule.java:55)
   [junit4]    > 	at org.apache.lucene.util.TestRuleNoInstanceHooksOverrides$1.evaluate(TestRuleNoInstanceHooksOverrides.java:53)
   [junit4]    > 	at org.apache.lucene.util.TestRuleNoStaticHooksShadowing$1.evaluate(TestRuleNoStaticHooksShadowing.java:52)
   [junit4]    > 	at org.apache.lucene.util.TestRuleAssertionsRequired$1.evaluate(TestRuleAssertionsRequired.java:36)
   [junit4]    > 	at org.apache.lucene.util.TestRuleMarkFailure$1.evaluate(TestRuleMarkFailure.java:48)
   [junit4]    > 	at org.apache.lucene.util.TestRuleIgnoreTestSuites$1.evaluate(TestRuleIgnoreTestSuites.java:56)
   [junit4]    > 	at com.carrotsearch.randomizedtesting.RandomizedRunner.runSuite(RandomizedRunner.java:605)
   [junit4]    > 	at com.carrotsearch.randomizedtesting.RandomizedRunner.access$400(RandomizedRunner.java:132)
   [junit4]    > 	at com.carrotsearch.randomizedtesting.RandomizedRunner$2.run(RandomizedRunner.java:551)
   [junit4]    > 
   [junit4]   2> java.lang.AssertionError
   [junit4]   2> 	at org.junit.Assert.fail(Assert.java:92)
   [junit4]   2> 	at org.junit.Assert.assertTrue(Assert.java:43)
   [junit4]   2> 	at org.junit.Assert.assertTrue(Assert.java:54)
   [junit4]   2> 	at org.apache.lucene.index.TestDocumentsWriterStallControl$Waiter.run(TestDocumentsWriterStallControl.java:225)
   [junit4]   2> java.lang.AssertionError
   [junit4]   2> 	at org.junit.Assert.fail(Assert.java:92)
   [junit4]   2> 	at org.junit.Assert.assertTrue(Assert.java:43)
   [junit4]   2> 	at org.junit.Assert.assertTrue(Assert.java:54)
   [junit4]   2> 	at org.apache.lucene.index.TestDocumentsWriterStallControl$Updater.run(TestDocumentsWriterStallControl.java:275)
   [junit4]   2> java.lang.AssertionError
   [junit4]   2> 	at org.junit.Assert.fail(Assert.java:92)
   [junit4]   2> 	at org.junit.Assert.assertTrue(Assert.java:43)
   [junit4]   2> 	at org.junit.Assert.assertTrue(Assert.java:54)
   [junit4]   2> 	at org.apache.lucene.index.TestDocumentsWriterStallControl$Updater.run(TestDocumentsWriterStallControl.java:275)
   [junit4]   2> NOTE: reproduce with: ant test  -Dtestcase=TestDocumentsWriterStallControl
-Dtests.method=testAccquireReleaseRace -Dtests.seed=E29FD37F8D7D7876 -Dtests.locale=fi_FI
-Dtests.timezone=Brazil/West -Dargs="-Dfile.encoding=Cp1252"
   [junit4]   2>
   [junit4]    > (@AfterClass output)
   [junit4]   2> NOTE: test params are: codec=Lucene40: {}, sim=RandomSimilarityProvider(queryNorm=false,coord=false):
{}, locale=fi_FI, timezone=Brazil/West
   [junit4]   2> NOTE: Windows 7 6.1 amd64/Oracle Corporation 1.7.0_04 (64-bit)/cpus=2,threads=1,free=181664672,total=388104192
   [junit4]   2> NOTE: All tests run in this JVM: [TestDeterminism, TestDateFilter, TestUniqueTermCount,
TestRAMDirectory, TestFieldMaskingSpanQuery, TestSimilarity2, TestMaxTermFrequency, TestSearchWithThreads,
TestFieldCacheRangeFilter, TestSpanExplanations, TestAppendingCodec, TestUTF32ToUTF8, TestCrash,
TestTypePromotion, TestWindowsMMap, TestBasics, TestPrefixQuery, TestSearchAfter, TestMultiValuedNumericRangeQuery,
TestCompoundFile, TestAutomatonQuery, TestDocumentWriter, TestTermVectors, TestVersion, TestTermRangeFilter,
TestLookaheadTokenFilter, TestPayloadSpans, TestFieldValueFilter, TestThreadedForceMerge,
TestMultiFields, TestIndexWriterDelete, TestMatchAllDocsQuery, TestCachingTokenFilter, TestNRTManager,
TestFuzzyQuery, TestTermsEnum, TestLevenshteinAutomata, TestShardSearching, TestBooleanQuery,
TestRegexpQuery, TestSimilarity, TestIndexWriterOnJRECrash, TestTopDocsCollector, TestCheckIndex,
TestIndexableBinaryStringTools, TestPersistentSnapshotDeletionPolicy, TestSpanExplanationsOfNonMatches,
TestNorms, TestSpecialOperations, TestUnicodeUtil, TestCharTermAttributeImpl, TestNearSpansOrdered,
TestRollingBuffer, TestIndexFileDeleter, TestAssertions, TestConstantScoreQuery, TestNRTCachingDirectory,
TestWildcard, TestNGramPhraseQuery, TestMixedCodecs, TestSpansAdvanced, TestBinaryDocument,
TestNumericRangeQuery64, TestPositionIncrement, TestPackedInts, TestIndexWriterLockRelease,
TestBytesRef, TestTransactions, TestStressIndexing2, TestSpanFirstQuery, TestScorerPerf, TestSloppyPhraseQuery,
TestFieldInfos, TestMockAnalyzer, TestSentinelIntSet, TestPayloads, TestDocBoost, TestBoolean2,
TestOmitNorms, TestLazyProxSkipping, TestSearchForDuplicates, TestSubScorerFreqs, TestTimeLimitingCollector,
TestRollingUpdates, TestFSTs, TestTwoPhaseCommitTool, TestIsCurrent, TestFilteredSearch, TestStressNRT,
TestRecyclingByteBlockAllocator, TestSimpleAttributeImpl, TestBinaryTerms, TestIntsRef, TestDirectoryReader,
TestVirtualMethod, TestSearcherManager, TestSmallFloat, TestBackwardsCompatibility, TestParallelTermEnum,
TestCollectionUtil, TestSizeBoundedForceMerge, TestMultiTermConstantScore, TestSearch, TestCachingWrapperFilter,
TestMockCharFilter, TestDocTermOrds, TestMultiMMap, TestImpersonation, TestNamedSPILoader,
TestReaderClosed, TestRamUsageEstimatorOnWildAnimals, TestSpanMultiTermQueryWrapper, TestPayloadExplanations,
TestCachingCollector, TestDocCount, TestTermsEnum2, TestSetOnce, TestMergeSchedulerExternal,
TestSimpleExplanationsOfNonMatches, TestAttributeSource, TestPerFieldPostingsFormat, TestVersionComparator,
TestAtomicUpdate, TestLock, TestPhrasePrefixQuery, TestCloseableThreadLocal, TestOmitPositions,
TestTermRangeQuery, TestNumericTokenStream, TestIndexWriterExceptions, TestLockFactory, TestSegmentMerger,
TestIndexWriterMergePolicy, TestIndexWriterOnDiskFull, TestMultiPhraseQuery, TestFileSwitchDirectory,
TestReuseDocsEnum, TestForTooMuchCloning, TestMultiLevelSkipList, TestSpans, TestTerm, TestTermVectorsReader,
TestScoreCachingWrappingScorer, TestTermdocPerf, TestRollback, TestFieldCacheRewriteMethod,
TestIndexWriterReader, TestSegmentTermDocs, TestOpenBitSet, TestByteArrayDataInput, MultiCollectorTest,
TestFieldCacheSanityChecker, TestPriorityQueue, TestDocument, TestDeterminizeLexicon, TestLongPostings,
TestCodecs, TestArrayUtil, TestTermVectorsWriter, TestComplexExplanations, TestDateSort, Nested,
Nested, Nested, Nested, Nested, Nested, Nested, Nested, Nested, Nested, Nested, Nested, Nested,
Nested, Nested, Nested, Nested, Nested, Nested, Nested, Nested, TestSameTokenSamePosition,
TestDocIdSet, TestConsistentFieldNumbers, TestDocsAndPositions, TestDocValues, TestBytesRefHash,
TestPositiveScoresOnlyCollector, Nested2, Nested1, Nested3, TestExplanations, TestCustomSearcherSort,
TestSegmentReader, TestRandomStoredFields, TestIndexWriterMerging, TestByteSlices, TestSurrogates,
TestRegexpRandom, TestIndexCommit, TestSortedVIntList, TestIndexWriterForceMerge, TestNRTThreads,
TestCopyBytes, TestSnapshotDeletionPolicy, TestTopScoreDocCollector, InTestMethod, InAfterClass,
NonStringProperties, InBeforeClass, TestDuelingCodecs, TestDocValuesScoring, NestedSetupChain,
NestedTeardownChain, TestPulsingReuse, TestIndexWriter, TestFilteredQuery, TestWildcardRandom,
TestRollingCharBuffer, TestFieldCache, ThrowInUncaught, TestPerSegmentDeletes, TestSegmentTermEnum,
TestFieldCacheTermsFilter, TestSimilarityBase, TestIndexableField, TestCompiledAutomaton,
TestBitUtil, TestPrefixInBooleanQuery, TestMultiThreadTermVectors, TestMinimize, TestIndexInput,
TestDocumentsWriterStallControl]
   [junit4]   2> 
   [junit4] Completed in 14.00s, 3 tests, 1 failure <<< FAILURES!
[...truncated 303 lines...]

[...truncated 1556 lines...]

[...truncated 1556 lines...]

[...truncated 1556 lines...]

[...truncated 1556 lines...]

[...truncated 1556 lines...]



Mime
View raw message