lucene-dev mailing list archives

Site index · List index
Message view « Date » · « Thread »
Top « Date » · « Thread »
From jenk...@sd-datasolutions.de
Subject [JENKINS] Lucene-Solr-trunk-Windows-Java6-64 - Build # 423 - Failure!
Date Tue, 05 Jun 2012 04:16:44 GMT
Build: http://jenkins.sd-datasolutions.de/job/Lucene-Solr-trunk-Windows-Java6-64/423/

1 tests failed.
REGRESSION:  org.apache.solr.handler.TestReplicationHandler.test

Error Message:
expected:<494> but was:<0>

Stack Trace:
java.lang.AssertionError: expected:<494> but was:<0>
	at __randomizedtesting.SeedInfo.seed([1096C091057DB7C5:98C2FF4BAB81DA3D]:0)
	at org.junit.Assert.fail(Assert.java:93)
	at org.junit.Assert.failNotEquals(Assert.java:647)
	at org.junit.Assert.assertEquals(Assert.java:128)
	at org.junit.Assert.assertEquals(Assert.java:472)
	at org.junit.Assert.assertEquals(Assert.java:456)
	at org.apache.solr.handler.TestReplicationHandler.doTestIndexAndConfigAliasReplication(TestReplicationHandler.java:716)
	at org.apache.solr.handler.TestReplicationHandler.test(TestReplicationHandler.java:254)
	at sun.reflect.NativeMethodAccessorImpl.invoke0(Native Method)
	at sun.reflect.NativeMethodAccessorImpl.invoke(NativeMethodAccessorImpl.java:39)
	at sun.reflect.DelegatingMethodAccessorImpl.invoke(DelegatingMethodAccessorImpl.java:25)
	at java.lang.reflect.Method.invoke(Method.java:597)
	at com.carrotsearch.randomizedtesting.RandomizedRunner.invoke(RandomizedRunner.java:1969)
	at com.carrotsearch.randomizedtesting.RandomizedRunner.access$1100(RandomizedRunner.java:132)
	at com.carrotsearch.randomizedtesting.RandomizedRunner$6.evaluate(RandomizedRunner.java:814)
	at com.carrotsearch.randomizedtesting.RandomizedRunner$7.evaluate(RandomizedRunner.java:875)
	at com.carrotsearch.randomizedtesting.RandomizedRunner$8.evaluate(RandomizedRunner.java:889)
	at com.carrotsearch.randomizedtesting.rules.SystemPropertiesRestoreRule$1.evaluate(SystemPropertiesRestoreRule.java:53)
	at org.apache.lucene.util.TestRuleSetupTeardownChained$1.evaluate(TestRuleSetupTeardownChained.java:50)
	at org.apache.lucene.util.TestRuleFieldCacheSanity$1.evaluate(TestRuleFieldCacheSanity.java:32)
	at org.apache.lucene.util.AbstractBeforeAfterRule$1.evaluate(AbstractBeforeAfterRule.java:45)
	at com.carrotsearch.randomizedtesting.rules.SystemPropertiesInvariantRule$1.evaluate(SystemPropertiesInvariantRule.java:55)
	at org.apache.lucene.util.TestRuleReportUncaughtExceptions$1.evaluate(TestRuleReportUncaughtExceptions.java:68)
	at org.apache.lucene.util.TestRuleThreadAndTestName$1.evaluate(TestRuleThreadAndTestName.java:48)
	at org.apache.lucene.util.TestRuleMarkFailure$1.evaluate(TestRuleMarkFailure.java:48)
	at com.carrotsearch.randomizedtesting.RandomizedRunner.runSingleTest(RandomizedRunner.java:821)
	at com.carrotsearch.randomizedtesting.RandomizedRunner.access$700(RandomizedRunner.java:132)
	at com.carrotsearch.randomizedtesting.RandomizedRunner$3$1.run(RandomizedRunner.java:669)
	at com.carrotsearch.randomizedtesting.RandomizedRunner$3.evaluate(RandomizedRunner.java:695)
	at com.carrotsearch.randomizedtesting.RandomizedRunner$4.evaluate(RandomizedRunner.java:734)
	at com.carrotsearch.randomizedtesting.RandomizedRunner$5.evaluate(RandomizedRunner.java:745)
	at com.carrotsearch.randomizedtesting.rules.SystemPropertiesRestoreRule$1.evaluate(SystemPropertiesRestoreRule.java:53)
	at org.apache.lucene.util.AbstractBeforeAfterRule$1.evaluate(AbstractBeforeAfterRule.java:45)
	at org.apache.lucene.util.TestRuleReportUncaughtExceptions$1.evaluate(TestRuleReportUncaughtExceptions.java:68)
	at org.apache.lucene.util.TestRuleStoreClassName$1.evaluate(TestRuleStoreClassName.java:38)
	at org.apache.lucene.util.TestRuleIcuHack$1.evaluate(TestRuleIcuHack.java:51)
	at com.carrotsearch.randomizedtesting.rules.SystemPropertiesInvariantRule$1.evaluate(SystemPropertiesInvariantRule.java:55)
	at org.apache.lucene.util.TestRuleNoInstanceHooksOverrides$1.evaluate(TestRuleNoInstanceHooksOverrides.java:53)
	at org.apache.lucene.util.TestRuleNoStaticHooksShadowing$1.evaluate(TestRuleNoStaticHooksShadowing.java:52)
	at org.apache.lucene.util.TestRuleAssertionsRequired$1.evaluate(TestRuleAssertionsRequired.java:36)
	at org.apache.lucene.util.TestRuleMarkFailure$1.evaluate(TestRuleMarkFailure.java:48)
	at org.apache.lucene.util.TestRuleIgnoreTestSuites$1.evaluate(TestRuleIgnoreTestSuites.java:56)
	at com.carrotsearch.randomizedtesting.RandomizedRunner.runSuite(RandomizedRunner.java:605)
	at com.carrotsearch.randomizedtesting.RandomizedRunner.access$400(RandomizedRunner.java:132)
	at com.carrotsearch.randomizedtesting.RandomizedRunner$2.run(RandomizedRunner.java:551)




Build Log:
[...truncated 16534 lines...]
   [junit4]   2> 48696 T3482 C193 REQ [collection1] webapp=/solr path=/replication params={command=filecontent&checksum=true&generation=16&wt=filestream&file=_9.si}
status=0 QTime=1 
   [junit4]   2> 48696 T3490 C194 REQ [collection1] webapp=/solr path=/select params={wt=javabin&q=*:*&version=2}
hits=0 status=0 QTime=0 
   [junit4]   2> 48698 T3482 C193 REQ [collection1] webapp=/solr path=/replication params={command=filecontent&checksum=true&generation=16&wt=filestream&file=_9.fdx}
status=0 QTime=0 
   [junit4]   2> 48701 T3482 C193 REQ [collection1] webapp=/solr path=/replication params={command=filecontent&checksum=true&generation=16&wt=filestream&file=segments_g}
status=0 QTime=0 
   [junit4]   2> 48704 T3482 C193 REQ [collection1] webapp=/solr path=/replication params={command=filecontent&checksum=true&generation=16&wt=filestream&file=_9_Lucene40_0.frq}
status=0 QTime=0 
   [junit4]   2> 48704 T3497 oash.SnapPuller.fetchLatestIndex Total time taken for download
: 0 secs
   [junit4]   2> 48706 T3497 oash.SnapPuller.copyAFile SEVERE Unable to move index file
from: .\org.apache.solr.handler.TestReplicationHandler$SolrInstance-1338869628294\slave\data\index.20120604211436\_9_Lucene40_0.tim
to: C:\Jenkins\workspace\Lucene-Solr-trunk-Windows-Java6-64\solr\build\solr-core\test\J0\org.apache.solr.handler.TestReplicationHandler$SolrInstance-1338869628294\slave\data\index.20120604211413\_9_Lucene40_0.tim
Trying to do a copy
   [junit4]   2> 48706 T3497 oash.SnapPuller.copyAFile SEVERE Unable to copy index file
from: .\org.apache.solr.handler.TestReplicationHandler$SolrInstance-1338869628294\slave\data\index.20120604211436\_9_Lucene40_0.tim
to: C:\Jenkins\workspace\Lucene-Solr-trunk-Windows-Java6-64\solr\build\solr-core\test\J0\org.apache.solr.handler.TestReplicationHandler$SolrInstance-1338869628294\slave\data\index.20120604211413\_9_Lucene40_0.tim
java.io.FileNotFoundException: C:\Jenkins\workspace\Lucene-Solr-trunk-Windows-Java6-64\solr\build\solr-core\test\J0\org.apache.solr.handler.TestReplicationHandler$SolrInstance-1338869628294\slave\data\index.20120604211413\_9_Lucene40_0.tim
(The system cannot find the path specified)
   [junit4]   2> 	at java.io.FileOutputStream.open(Native Method)
   [junit4]   2> 	at java.io.FileOutputStream.<init>(FileOutputStream.java:194)
   [junit4]   2> 	at java.io.FileOutputStream.<init>(FileOutputStream.java:145)
   [junit4]   2> 	at org.apache.solr.util.FileUtils.copyFile(FileUtils.java:48)
   [junit4]   2> 	at org.apache.solr.handler.SnapPuller.copyAFile(SnapPuller.java:654)
   [junit4]   2> 	at org.apache.solr.handler.SnapPuller.copyIndexFiles(SnapPuller.java:691)
   [junit4]   2> 	at org.apache.solr.handler.SnapPuller.fetchLatestIndex(SnapPuller.java:371)
   [junit4]   2> 	at org.apache.solr.handler.ReplicationHandler.doFetch(ReplicationHandler.java:298)
   [junit4]   2> 	at org.apache.solr.handler.SnapPuller$1.run(SnapPuller.java:169)
   [junit4]   2> 	at java.util.concurrent.Executors$RunnableAdapter.call(Executors.java:441)
   [junit4]   2> 	at java.util.concurrent.FutureTask$Sync.innerRunAndReset(FutureTask.java:317)
   [junit4]   2> 	at java.util.concurrent.FutureTask.runAndReset(FutureTask.java:150)
   [junit4]   2> 	at java.util.concurrent.ScheduledThreadPoolExecutor$ScheduledFutureTask.access$101(ScheduledThreadPoolExecutor.java:98)
   [junit4]   2> 	at java.util.concurrent.ScheduledThreadPoolExecutor$ScheduledFutureTask.runPeriodic(ScheduledThreadPoolExecutor.java:180)
   [junit4]   2> 	at java.util.concurrent.ScheduledThreadPoolExecutor$ScheduledFutureTask.run(ScheduledThreadPoolExecutor.java:204)
   [junit4]   2> 	at java.util.concurrent.ThreadPoolExecutor$Worker.runTask(ThreadPoolExecutor.java:886)
   [junit4]   2> 	at java.util.concurrent.ThreadPoolExecutor$Worker.run(ThreadPoolExecutor.java:908)
   [junit4]   2> 	at java.lang.Thread.run(Thread.java:662)
   [junit4]   2> 
   [junit4]   2> 48769 T3490 C194 REQ [collection1] webapp=/solr path=/select params={wt=javabin&q=*:*&version=2}
hits=0 status=0 QTime=0 
   [junit4]   2> 48844 T3490 C194 REQ [collection1] webapp=/solr path=/select params={wt=javabin&q=*:*&version=2}
hits=0 status=0 QTime=1 
   [junit4]   2> 48917 T3490 C194 REQ [collection1] webapp=/solr path=/select params={wt=javabin&q=*:*&version=2}
hits=0 status=0 QTime=0 
   [junit4]   2> 48991 T3490 C194 REQ [collection1] webapp=/solr path=/select params={wt=javabin&q=*:*&version=2}
hits=0 status=0 QTime=0 
   [junit4]   2> 49064 T3490 C194 REQ [collection1] webapp=/solr path=/select params={wt=javabin&q=*:*&version=2}
hits=0 status=0 QTime=0 
   [junit4]   2> 49127 T514 oaz.ClientCnxn$SendThread.run WARNING Session 0x137bacd78230010
for server null, unexpected error, closing socket connection and attempting reconnect java.net.ConnectException:
Connection refused: no further information
   [junit4]   2> 	at sun.nio.ch.SocketChannelImpl.checkConnect(Native Method)
   [junit4]   2> 	at sun.nio.ch.SocketChannelImpl.finishConnect(SocketChannelImpl.java:599)
   [junit4]   2> 	at org.apache.zookeeper.ClientCnxn$SendThread.run(ClientCnxn.java:1146)
   [junit4]   2> 
   [junit4]   2> 49138 T3490 C194 REQ [collection1] webapp=/solr path=/select params={wt=javabin&q=*:*&version=2}
hits=0 status=0 QTime=0 
   [junit4]   2> 49211 T3490 C194 REQ [collection1] webapp=/solr path=/select params={wt=javabin&q=*:*&version=2}
hits=0 status=0 QTime=0 
   [junit4]   2> 49285 T3490 C194 REQ [collection1] webapp=/solr path=/select params={wt=javabin&q=*:*&version=2}
hits=0 status=0 QTime=0 
   [junit4]   2> 49349 T3482 C193 REQ [collection1] webapp=/solr path=/replication params={command=indexversion&wt=javabin}
status=0 QTime=0 
   [junit4]   2> 49350 T3497 oash.SnapPuller.fetchLatestIndex Master's generation: 16
   [junit4]   2> 49350 T3497 oash.SnapPuller.fetchLatestIndex Slave's generation: 15
   [junit4]   2> 49350 T3497 oash.SnapPuller.fetchLatestIndex Starting replication process
   [junit4]   2> 49353 T3482 C193 REQ [collection1] webapp=/solr path=/replication params={command=filelist&wt=javabin&generation=16}
status=0 QTime=2 
   [junit4]   2> 49354 T3497 oash.SnapPuller.fetchLatestIndex Number of files in latest
index in master: 10
   [junit4]   2> 49357 T3482 C193 REQ [collection1] webapp=/solr path=/replication params={command=filecontent&checksum=true&generation=16&wt=filestream&file=_9_Lucene40_0.tim}
status=0 QTime=0 
   [junit4]   2> 49359 T3490 C194 REQ [collection1] webapp=/solr path=/select params={wt=javabin&q=*:*&version=2}
hits=0 status=0 QTime=1 
   [junit4]   2> 49362 T3482 C193 REQ [collection1] webapp=/solr path=/replication params={command=filecontent&checksum=true&generation=16&wt=filestream&file=_9_nrm.cfe}
status=0 QTime=0 
   [junit4]   2> 49366 T3482 C193 REQ [collection1] webapp=/solr path=/replication params={command=filecontent&checksum=true&generation=16&wt=filestream&file=_9.fnm}
status=0 QTime=0 
   [junit4]   2> 49369 T3482 C193 REQ [collection1] webapp=/solr path=/replication params={command=filecontent&checksum=true&generation=16&wt=filestream&file=_9_nrm.cfs}
status=0 QTime=0 
   [junit4]   2> 49372 T3482 C193 REQ [collection1] webapp=/solr path=/replication params={command=filecontent&checksum=true&generation=16&wt=filestream&file=_9.fdt}
status=0 QTime=0 
   [junit4]   2> 49374 T3482 C193 REQ [collection1] webapp=/solr path=/replication params={command=filecontent&checksum=true&generation=16&wt=filestream&file=_9_Lucene40_0.tip}
status=0 QTime=0 
   [junit4]   2> 49378 T3482 C193 REQ [collection1] webapp=/solr path=/replication params={command=filecontent&checksum=true&generation=16&wt=filestream&file=_9.si}
status=0 QTime=0 
   [junit4]   2> 49382 T3482 C193 REQ [collection1] webapp=/solr path=/replication params={command=filecontent&checksum=true&generation=16&wt=filestream&file=_9.fdx}
status=0 QTime=0 
   [junit4]   2> 49385 T3482 C193 REQ [collection1] webapp=/solr path=/replication params={command=filecontent&checksum=true&generation=16&wt=filestream&file=segments_g}
status=0 QTime=0 
   [junit4]   2> 49388 T3482 C193 REQ [collection1] webapp=/solr path=/replication params={command=filecontent&checksum=true&generation=16&wt=filestream&file=_9_Lucene40_0.frq}
status=0 QTime=0 
   [junit4]   2> 49389 T3497 oash.SnapPuller.fetchLatestIndex Total time taken for download
: 0 secs
   [junit4]   2> 49391 T3497 oash.SnapPuller.copyAFile SEVERE Unable to move index file
from: .\org.apache.solr.handler.TestReplicationHandler$SolrInstance-1338869628294\slave\data\index.20120604211437\_9_Lucene40_0.tim
to: C:\Jenkins\workspace\Lucene-Solr-trunk-Windows-Java6-64\solr\build\solr-core\test\J0\org.apache.solr.handler.TestReplicationHandler$SolrInstance-1338869628294\slave\data\index.20120604211413\_9_Lucene40_0.tim
Trying to do a copy
   [junit4]   2> 49392 T3497 oash.SnapPuller.copyAFile SEVERE Unable to copy index file
from: .\org.apache.solr.handler.TestReplicationHandler$SolrInstance-1338869628294\slave\data\index.20120604211437\_9_Lucene40_0.tim
to: C:\Jenkins\workspace\Lucene-Solr-trunk-Windows-Java6-64\solr\build\solr-core\test\J0\org.apache.solr.handler.TestReplicationHandler$SolrInstance-1338869628294\slave\data\index.20120604211413\_9_Lucene40_0.tim
java.io.FileNotFoundException: C:\Jenkins\workspace\Lucene-Solr-trunk-Windows-Java6-64\solr\build\solr-core\test\J0\org.apache.solr.handler.TestReplicationHandler$SolrInstance-1338869628294\slave\data\index.20120604211413\_9_Lucene40_0.tim
(The system cannot find the path specified)
   [junit4]   2> 	at java.io.FileOutputStream.open(Native Method)
   [junit4]   2> 	at java.io.FileOutputStream.<init>(FileOutputStream.java:194)
   [junit4]   2> 	at java.io.FileOutputStream.<init>(FileOutputStream.java:145)
   [junit4]   2> 	at org.apache.solr.util.FileUtils.copyFile(FileUtils.java:48)
   [junit4]   2> 	at org.apache.solr.handler.SnapPuller.copyAFile(SnapPuller.java:654)
   [junit4]   2> 	at org.apache.solr.handler.SnapPuller.copyIndexFiles(SnapPuller.java:691)
   [junit4]   2> 	at org.apache.solr.handler.SnapPuller.fetchLatestIndex(SnapPuller.java:371)
   [junit4]   2> 	at org.apache.solr.handler.ReplicationHandler.doFetch(ReplicationHandler.java:298)
   [junit4]   2> 	at org.apache.solr.handler.SnapPuller$1.run(SnapPuller.java:169)
   [junit4]   2> 	at java.util.concurrent.Executors$RunnableAdapter.call(Executors.java:441)
   [junit4]   2> 	at java.util.concurrent.FutureTask$Sync.innerRunAndReset(FutureTask.java:317)
   [junit4]   2> 	at java.util.concurrent.FutureTask.runAndReset(FutureTask.java:150)
   [junit4]   2> 	at java.util.concurrent.ScheduledThreadPoolExecutor$ScheduledFutureTask.access$101(ScheduledThreadPoolExecutor.java:98)
   [junit4]   2> 	at java.util.concurrent.ScheduledThreadPoolExecutor$ScheduledFutureTask.runPeriodic(ScheduledThreadPoolExecutor.java:180)
   [junit4]   2> 	at java.util.concurrent.ScheduledThreadPoolExecutor$ScheduledFutureTask.run(ScheduledThreadPoolExecutor.java:204)
   [junit4]   2> 	at java.util.concurrent.ThreadPoolExecutor$Worker.runTask(ThreadPoolExecutor.java:886)
   [junit4]   2> 	at java.util.concurrent.ThreadPoolExecutor$Worker.run(ThreadPoolExecutor.java:908)
   [junit4]   2> 	at java.lang.Thread.run(Thread.java:662)
   [junit4]   2> 
   [junit4]   2> 49430 T3315 oas.SolrTestCaseJ4.tearDown ###Ending test
   [junit4]   1> replicate slave to master
   [junit4]   2> NOTE: reproduce with: ant test  -Dtestcase=TestReplicationHandler -Dtests.method=test
-Dtests.seed=1096C091057DB7C5 -Dtests.locale=ga_IE -Dtests.timezone=Canada/Pacific -Dargs="-Dfile.encoding=Cp1252"
   [junit4]   1> 
   [junit4]   2>
   [junit4]    > (@AfterClass output)
   [junit4]   2> 49442 T3315 oasc.CoreContainer.shutdown Shutting down CoreContainer instance=2138270156
   [junit4]   2> 49442 T3315 oasc.SolrCore.close [collection1]  CLOSING SolrCore org.apache.solr.core.SolrCore@5d689168
   [junit4]   2> 49443 T3315 oasc.SolrCore.closeSearcher [collection1] Closing main searcher
on request.
   [junit4]   2> 49443 T3315 oasu.DirectUpdateHandler2.close closing DirectUpdateHandler2{commits=2,autocommits=0,soft
autocommits=0,optimizes=0,rollbacks=0,expungeDeletes=0,docsPending=0,adds=0,deletesById=0,deletesByQuery=0,errors=0,cumulative_adds=494,cumulative_deletesById=0,cumulative_deletesByQuery=1,cumulative_errors=0}
   [junit4]   2> 49445 T3315 oejsh.ContextHandler.doStop stopped o.e.j.s.ServletContextHandler{/solr,null}
   [junit4]   2> 49497 T3315 oasc.CoreContainer.shutdown Shutting down CoreContainer instance=1020431232
   [junit4]   2> 49497 T3315 oasc.SolrCore.close [collection1]  CLOSING SolrCore org.apache.solr.core.SolrCore@47963b92
   [junit4]   2> 49498 T3315 oasc.SolrCore.closeSearcher [collection1] Closing main searcher
on request.
   [junit4]   2> 49498 T3315 oasu.DirectUpdateHandler2.close closing DirectUpdateHandler2{commits=1,autocommits=0,soft
autocommits=0,optimizes=0,rollbacks=0,expungeDeletes=0,docsPending=0,adds=0,deletesById=0,deletesByQuery=0,errors=0,cumulative_adds=0,cumulative_deletesById=0,cumulative_deletesByQuery=0,cumulative_errors=0}
   [junit4]   2> 49500 T3315 oejsh.ContextHandler.doStop stopped o.e.j.s.ServletContextHandler{/solr,null}
   [junit4]   2> 49561 T3315 oas.SolrTestCaseJ4.deleteCore ###deleteCore
   [junit4]   2> NOTE: test params are: codec=Lucene40: {}, sim=RandomSimilarityProvider(queryNorm=false,coord=false):
{}, locale=ga_IE, timezone=Canada/Pacific
   [junit4]   2> NOTE: Windows 7 6.1 amd64/Sun Microsystems Inc. 1.6.0_32 (64-bit)/cpus=2,threads=1,free=58660728,total=219283456
   [junit4]   2> NOTE: All tests run in this JVM: [TestPropInject, TestQuerySenderNoQuery,
TestExtendedDismaxParser, TestLatvianStemFilterFactory, TestNorwegianLightStemFilterFactory,
UUIDFieldTest, TestDFRSimilarityFactory, FieldAnalysisRequestHandlerTest, TestFiltering, TestLRUCache,
TestBrazilianStemFilterFactory, StatsComponentTest, NumericFieldsTest, LengthFilterTest, TestMultiCoreConfBootstrap,
TestPortugueseMinimalStemFilterFactory, TestDistributedGrouping, LukeRequestHandlerTest, ShowFileRequestHandlerTest,
PluginInfoTest, UpdateRequestProcessorFactoryTest, TestPatternReplaceFilterFactory, CommonGramsFilterFactoryTest,
TestGermanStemFilterFactory, SuggesterFSTTest, ConvertedLegacyTest, SolrInfoMBeanTest, TestIndexSearcher,
RequestHandlersTest, TestLFUCache, DistributedQueryElevationComponentTest, TestUAX29URLEmailTokenizerFactory,
TestElisionFilterFactory, TestSolrCoreProperties, ResourceLoaderTest, TestSolrDeletionPolicy2,
TestSolrDeletionPolicy1, MultiTermTest, FullSolrCloudTest, LegacyHTMLStripCharFilterTest,
TestPorterStemFilterFactory, SoftAutoCommitTest, TestCJKWidthFilterFactory, NoCacheHeaderTest,
CacheHeaderTest, UpdateParamsTest, TestQueryTypes, TestUtils, RequiredFieldsTest, TestPersianNormalizationFilterFactory,
TestSystemIdResolver, TestCoreContainer, TestMultiWordSynonyms, CopyFieldTest, TestFrenchLightStemFilterFactory,
TestSolrXMLSerializer, DebugComponentTest, FileBasedSpellCheckerTest, TestRemoteStreaming,
TestMergePolicyConfig, TestFaceting, LoggingHandlerTest, DirectUpdateHandlerOptimizeTest,
TestPHPSerializedResponseWriter, OpenExchangeRatesOrgProviderTest, IndexReaderFactoryTest,
ZkControllerTest, TestPhoneticFilterFactory, TestDelimitedPayloadTokenFilterFactory, BasicZkTest,
TestPatternTokenizerFactory, IndexSchemaRuntimeFieldTest, TestFastLRUCache, TermsComponentTest,
ZkNodePropsTest, JSONWriterTest, TestTypeTokenFilterFactory, DisMaxRequestHandlerTest, TestCzechStemFilterFactory,
PrimUtilsTest, SuggesterWFSTTest, FieldMutatingUpdateProcessorTest, RecoveryZkTest, TestQueryUtils,
TestNorwegianMinimalStemFilterFactory, TestKStemFilterFactory, TestSearchPerf, TestBinaryField,
CloudStateUpdateTest, TestRussianLightStemFilterFactory, SuggesterTest, TestReversedWildcardFilterFactory,
TestPseudoReturnFields, TestFoldingMultitermQuery, AlternateDirectoryTest, SolrPluginUtilsTest,
TestBeiderMorseFilterFactory, TestStandardFactories, TestSort, MBeansHandlerTest, TestRemoveDuplicatesTokenFilterFactory,
DirectSolrConnectionTest, TestCSVLoader, HighlighterConfigTest, TestTrimFilterFactory, TestWikipediaTokenizerFactory,
TestEnglishMinimalStemFilterFactory, TestJmxMonitoredMap, LeaderElectionTest, DistributedTermsComponentTest,
SuggesterTSTTest, TimeZoneUtilsTest, OutputWriterTest, SpatialFilterTest, TestPluginEnable,
FullSolrCloudDistribCmdsTest, TestSurroundQueryParser, TestOmitPositions, XmlUpdateRequestHandlerTest,
TestConfig, XsltUpdateRequestHandlerTest, SOLR749Test, ZkSolrClientTest, TestCSVResponseWriter,
CloudStateTest, TestDictionaryCompoundWordTokenFilterFactory, DOMUtilTest, CurrencyFieldTest,
DirectUpdateHandlerTest, TestBadConfig, QueryParsingTest, FastVectorHighlighterTest, MinimalSchemaTest,
TestGermanLightStemFilterFactory, TestJapaneseBaseFormFilterFactory, TestFunctionQuery, TestGalicianMinimalStemFilterFactory,
BinaryUpdateRequestHandlerTest, TestGroupingSearch, TestRecovery, IndexSchemaTest, TestHindiFilters,
TestDefaultSimilarityFactory, TestArabicFilters, SampleTest, TestDistributedSearch, TestLMJelinekMercerSimilarityFactory,
TestBulgarianStemFilterFactory, DistanceFunctionTest, URLClassifyProcessorTest, AutoCommitTest,
TestGreekLowerCaseFilterFactory, SolrIndexConfigTest, SolrRequestParserTest, TestGermanNormalizationFilterFactory,
TestShingleFilterFactory, TestSolrQueryParser, RAMDirectoryFactoryTest, OverseerTest, BadIndexSchemaTest,
TestRealTimeGet, TestRandomFaceting, BasicFunctionalityTest, StandardRequestHandlerTest, NotRequiredUniqueKeyTest,
TestCodecSupport, TestHTMLStripCharFilterFactory, TestHyphenationCompoundWordTokenFilterFactory,
TestLMDirichletSimilarityFactory, TestHunspellStemFilterFactory, TestSwedishLightStemFilterFactory,
EchoParamsTest, TestPatternReplaceCharFilterFactory, ReturnFieldsTest, PeerSyncTest, TestHungarianLightStemFilterFactory,
TestValueSourceCache, TestIndonesianStemFilterFactory, TestQuerySenderListener, PingRequestHandlerTest,
DocumentAnalysisRequestHandlerTest, DirectSolrSpellCheckerTest, TestPhraseSuggestions, TestBinaryResponseWriter,
TestPortugueseLightStemFilterFactory, HighlighterTest, TestUpdate, TestRangeQuery, TestTurkishLowerCaseFilterFactory,
SpellCheckComponentTest, TestJoin, TestCJKBigramFilterFactory, BadComponentTest, TestFinnishLightStemFilterFactory,
SpellPossibilityIteratorTest, MoreLikeThisHandlerTest, TestPropInjectDefaults, PrimitiveFieldTypeTest,
TestXIncludeConfig, LeaderElectionIntegrationTest, NodeStateWatcherTest, BasicDistributedZkTest,
TestReplicationHandler]
   [junit4]   2> 
   [junit4] Completed in 49.57s, 1 test, 1 failure <<< FAILURES!
[...truncated 219 lines...]

[...truncated 16854 lines...]

[...truncated 16854 lines...]

[...truncated 16854 lines...]


Mime
View raw message