lucene-dev mailing list archives

Site index · List index
Message view « Date » · « Thread »
Top « Date » · « Thread »
From jenk...@sd-datasolutions.de
Subject [JENKINS] Lucene-Solr-trunk-Windows-Java7-64 - Build # 291 - Failure!
Date Mon, 11 Jun 2012 07:21:48 GMT
Build: http://jenkins.sd-datasolutions.de/job/Lucene-Solr-trunk-Windows-Java7-64/291/

1 tests failed.
REGRESSION:  org.apache.solr.handler.TestReplicationHandler.test

Error Message:
expected:<494> but was:<0>

Stack Trace:
java.lang.AssertionError: expected:<494> but was:<0>
	at __randomizedtesting.SeedInfo.seed([B032809CBA0B0DAB:3866BF4614F76053]:0)
	at org.junit.Assert.fail(Assert.java:93)
	at org.junit.Assert.failNotEquals(Assert.java:647)
	at org.junit.Assert.assertEquals(Assert.java:128)
	at org.junit.Assert.assertEquals(Assert.java:472)
	at org.junit.Assert.assertEquals(Assert.java:456)
	at org.apache.solr.handler.TestReplicationHandler.doTestIndexAndConfigAliasReplication(TestReplicationHandler.java:716)
	at org.apache.solr.handler.TestReplicationHandler.test(TestReplicationHandler.java:254)
	at sun.reflect.NativeMethodAccessorImpl.invoke0(Native Method)
	at sun.reflect.NativeMethodAccessorImpl.invoke(NativeMethodAccessorImpl.java:57)
	at sun.reflect.DelegatingMethodAccessorImpl.invoke(DelegatingMethodAccessorImpl.java:43)
	at java.lang.reflect.Method.invoke(Method.java:601)
	at com.carrotsearch.randomizedtesting.RandomizedRunner.invoke(RandomizedRunner.java:1969)
	at com.carrotsearch.randomizedtesting.RandomizedRunner.access$1100(RandomizedRunner.java:132)
	at com.carrotsearch.randomizedtesting.RandomizedRunner$6.evaluate(RandomizedRunner.java:814)
	at com.carrotsearch.randomizedtesting.RandomizedRunner$7.evaluate(RandomizedRunner.java:875)
	at com.carrotsearch.randomizedtesting.RandomizedRunner$8.evaluate(RandomizedRunner.java:889)
	at com.carrotsearch.randomizedtesting.rules.SystemPropertiesRestoreRule$1.evaluate(SystemPropertiesRestoreRule.java:53)
	at org.apache.lucene.util.TestRuleSetupTeardownChained$1.evaluate(TestRuleSetupTeardownChained.java:50)
	at org.apache.lucene.util.TestRuleFieldCacheSanity$1.evaluate(TestRuleFieldCacheSanity.java:32)
	at org.apache.lucene.util.AbstractBeforeAfterRule$1.evaluate(AbstractBeforeAfterRule.java:45)
	at com.carrotsearch.randomizedtesting.rules.SystemPropertiesInvariantRule$1.evaluate(SystemPropertiesInvariantRule.java:55)
	at org.apache.lucene.util.TestRuleReportUncaughtExceptions$1.evaluate(TestRuleReportUncaughtExceptions.java:68)
	at org.apache.lucene.util.TestRuleThreadAndTestName$1.evaluate(TestRuleThreadAndTestName.java:48)
	at org.apache.lucene.util.TestRuleMarkFailure$1.evaluate(TestRuleMarkFailure.java:48)
	at com.carrotsearch.randomizedtesting.RandomizedRunner.runSingleTest(RandomizedRunner.java:821)
	at com.carrotsearch.randomizedtesting.RandomizedRunner.access$700(RandomizedRunner.java:132)
	at com.carrotsearch.randomizedtesting.RandomizedRunner$3$1.run(RandomizedRunner.java:669)
	at com.carrotsearch.randomizedtesting.RandomizedRunner$3.evaluate(RandomizedRunner.java:695)
	at com.carrotsearch.randomizedtesting.RandomizedRunner$4.evaluate(RandomizedRunner.java:734)
	at com.carrotsearch.randomizedtesting.RandomizedRunner$5.evaluate(RandomizedRunner.java:745)
	at com.carrotsearch.randomizedtesting.rules.SystemPropertiesRestoreRule$1.evaluate(SystemPropertiesRestoreRule.java:53)
	at org.apache.lucene.util.AbstractBeforeAfterRule$1.evaluate(AbstractBeforeAfterRule.java:45)
	at org.apache.lucene.util.TestRuleReportUncaughtExceptions$1.evaluate(TestRuleReportUncaughtExceptions.java:68)
	at org.apache.lucene.util.TestRuleStoreClassName$1.evaluate(TestRuleStoreClassName.java:38)
	at org.apache.lucene.util.TestRuleIcuHack$1.evaluate(TestRuleIcuHack.java:51)
	at com.carrotsearch.randomizedtesting.rules.SystemPropertiesInvariantRule$1.evaluate(SystemPropertiesInvariantRule.java:55)
	at org.apache.lucene.util.TestRuleNoInstanceHooksOverrides$1.evaluate(TestRuleNoInstanceHooksOverrides.java:53)
	at org.apache.lucene.util.TestRuleNoStaticHooksShadowing$1.evaluate(TestRuleNoStaticHooksShadowing.java:52)
	at org.apache.lucene.util.TestRuleAssertionsRequired$1.evaluate(TestRuleAssertionsRequired.java:36)
	at org.apache.lucene.util.TestRuleMarkFailure$1.evaluate(TestRuleMarkFailure.java:48)
	at org.apache.lucene.util.TestRuleIgnoreTestSuites$1.evaluate(TestRuleIgnoreTestSuites.java:56)
	at com.carrotsearch.randomizedtesting.RandomizedRunner.runSuite(RandomizedRunner.java:605)
	at com.carrotsearch.randomizedtesting.RandomizedRunner.access$400(RandomizedRunner.java:132)
	at com.carrotsearch.randomizedtesting.RandomizedRunner$2.run(RandomizedRunner.java:551)




Build Log:
[...truncated 17404 lines...]
   [junit4]   2> 56759 T3040 C189 REQ [collection1] webapp=/solr path=/replication params={command=filecontent&checksum=true&generation=16&wt=filestream&file=_9.fnm}
status=0 QTime=0 
   [junit4]   2> 56764 T3040 C189 REQ [collection1] webapp=/solr path=/replication params={command=filecontent&checksum=true&generation=16&wt=filestream&file=_9_nrm.cfs}
status=0 QTime=0 
   [junit4]   2> 56769 T3040 C189 REQ [collection1] webapp=/solr path=/replication params={command=filecontent&checksum=true&generation=16&wt=filestream&file=_9.fdt}
status=0 QTime=0 
   [junit4]   2> 56774 T3040 C189 REQ [collection1] webapp=/solr path=/replication params={command=filecontent&checksum=true&generation=16&wt=filestream&file=_9_Lucene40_0.tip}
status=0 QTime=0 
   [junit4]   2> 56780 T3040 C189 REQ [collection1] webapp=/solr path=/replication params={command=filecontent&checksum=true&generation=16&wt=filestream&file=_9.si}
status=0 QTime=0 
   [junit4]   2> 56782 T3051 C190 REQ [collection1] webapp=/solr path=/select params={wt=javabin&q=*:*&version=2}
hits=0 status=0 QTime=0 
   [junit4]   2> 56784 T3040 C189 REQ [collection1] webapp=/solr path=/replication params={command=filecontent&checksum=true&generation=16&wt=filestream&file=_9.fdx}
status=0 QTime=0 
   [junit4]   2> 56789 T3040 C189 REQ [collection1] webapp=/solr path=/replication params={command=filecontent&checksum=true&generation=16&wt=filestream&file=segments_g}
status=0 QTime=0 
   [junit4]   2> 56794 T3040 C189 REQ [collection1] webapp=/solr path=/replication params={command=filecontent&checksum=true&generation=16&wt=filestream&file=_9_Lucene40_0.frq}
status=0 QTime=0 
   [junit4]   2> 56795 T3057 oash.SnapPuller.fetchLatestIndex Total time taken for download
: 0 secs
   [junit4]   2> 56797 T3057 oash.SnapPuller.copyAFile SEVERE Unable to move index file
from: .\org.apache.solr.handler.TestReplicationHandler$SolrInstance-1339399065338\slave\data\index.20120611031841\_9_Lucene40_0.tim
to: C:\Jenkins\workspace\Lucene-Solr-trunk-Windows-Java7-64\solr\build\solr-core\test\J0\org.apache.solr.handler.TestReplicationHandler$SolrInstance-1339399065338\slave\data\index.20120611031805\_9_Lucene40_0.tim
Trying to do a copy
   [junit4]   2> 56797 T3057 oash.SnapPuller.copyAFile SEVERE The index directory does
not exist: C:\Jenkins\workspace\Lucene-Solr-trunk-Windows-Java7-64\solr\build\solr-core\test\J0\org.apache.solr.handler.TestReplicationHandler$SolrInstance-1339399065338\slave\data\index.20120611031805
dirs found: [index.20120611031841, index.properties, replication.properties]
   [junit4]   2> 56797 T3057 oash.SnapPuller.copyAFile SEVERE Unable to copy index file
from: .\org.apache.solr.handler.TestReplicationHandler$SolrInstance-1339399065338\slave\data\index.20120611031841\_9_Lucene40_0.tim
to: C:\Jenkins\workspace\Lucene-Solr-trunk-Windows-Java7-64\solr\build\solr-core\test\J0\org.apache.solr.handler.TestReplicationHandler$SolrInstance-1339399065338\slave\data\index.20120611031805\_9_Lucene40_0.tim
java.io.FileNotFoundException: C:\Jenkins\workspace\Lucene-Solr-trunk-Windows-Java7-64\solr\build\solr-core\test\J0\org.apache.solr.handler.TestReplicationHandler$SolrInstance-1339399065338\slave\data\index.20120611031805\_9_Lucene40_0.tim
(The system cannot find the path specified)
   [junit4]   2> 	at java.io.FileOutputStream.open(Native Method)
   [junit4]   2> 	at java.io.FileOutputStream.<init>(FileOutputStream.java:212)
   [junit4]   2> 	at java.io.FileOutputStream.<init>(FileOutputStream.java:165)
   [junit4]   2> 	at org.apache.solr.util.FileUtils.copyFile(FileUtils.java:48)
   [junit4]   2> 	at org.apache.solr.handler.SnapPuller.copyAFile(SnapPuller.java:654)
   [junit4]   2> 	at org.apache.solr.handler.SnapPuller.copyIndexFiles(SnapPuller.java:703)
   [junit4]   2> 	at org.apache.solr.handler.SnapPuller.fetchLatestIndex(SnapPuller.java:371)
   [junit4]   2> 	at org.apache.solr.handler.ReplicationHandler.doFetch(ReplicationHandler.java:298)
   [junit4]   2> 	at org.apache.solr.handler.SnapPuller$1.run(SnapPuller.java:169)
   [junit4]   2> 	at java.util.concurrent.Executors$RunnableAdapter.call(Executors.java:471)
   [junit4]   2> 	at java.util.concurrent.FutureTask$Sync.innerRunAndReset(FutureTask.java:351)
   [junit4]   2> 	at java.util.concurrent.FutureTask.runAndReset(FutureTask.java:178)
   [junit4]   2> 	at java.util.concurrent.ScheduledThreadPoolExecutor$ScheduledFutureTask.access$301(ScheduledThreadPoolExecutor.java:178)
   [junit4]   2> 	at java.util.concurrent.ScheduledThreadPoolExecutor$ScheduledFutureTask.run(ScheduledThreadPoolExecutor.java:293)
   [junit4]   2> 	at java.util.concurrent.ThreadPoolExecutor.runWorker(ThreadPoolExecutor.java:1110)
   [junit4]   2> 	at java.util.concurrent.ThreadPoolExecutor$Worker.run(ThreadPoolExecutor.java:603)
   [junit4]   2> 	at java.lang.Thread.run(Thread.java:722)
   [junit4]   2> 
   [junit4]   2> 56915 T3051 C190 REQ [collection1] webapp=/solr path=/select params={wt=javabin&q=*:*&version=2}
hits=0 status=0 QTime=0 
   [junit4]   2> 57047 T3051 C190 REQ [collection1] webapp=/solr path=/select params={wt=javabin&q=*:*&version=2}
hits=0 status=0 QTime=0 
   [junit4]   2> 57179 T3051 C190 REQ [collection1] webapp=/solr path=/select params={wt=javabin&q=*:*&version=2}
hits=0 status=0 QTime=0 
   [junit4]   2> 57310 T3051 C190 REQ [collection1] webapp=/solr path=/select params={wt=javabin&q=*:*&version=2}
hits=0 status=0 QTime=0 
   [junit4]   2> 57442 T3051 C190 REQ [collection1] webapp=/solr path=/select params={wt=javabin&q=*:*&version=2}
hits=0 status=0 QTime=0 
   [junit4]   2> 57574 T3051 C190 REQ [collection1] webapp=/solr path=/select params={wt=javabin&q=*:*&version=2}
hits=0 status=0 QTime=0 
   [junit4]   2> 57705 T3051 C190 REQ [collection1] webapp=/solr path=/select params={wt=javabin&q=*:*&version=2}
hits=0 status=0 QTime=0 
   [junit4]   2> 57838 T3051 C190 REQ [collection1] webapp=/solr path=/select params={wt=javabin&q=*:*&version=2}
hits=0 status=0 QTime=0 
   [junit4]   2> 57860 T3040 C189 REQ [collection1] webapp=/solr path=/replication params={command=indexversion&wt=javabin}
status=0 QTime=0 
   [junit4]   2> 57861 T3057 oash.SnapPuller.fetchLatestIndex Master's generation: 16
   [junit4]   2> 57861 T3057 oash.SnapPuller.fetchLatestIndex Slave's generation: 15
   [junit4]   2> 57861 T3057 oash.SnapPuller.fetchLatestIndex Starting replication process
   [junit4]   2> 57870 T3040 C189 REQ [collection1] webapp=/solr path=/replication params={command=filelist&wt=javabin&generation=16}
status=0 QTime=2 
   [junit4]   2> 57873 T3057 oash.SnapPuller.fetchLatestIndex Number of files in latest
index in master: 10
   [junit4]   2> 57878 T3040 C189 REQ [collection1] webapp=/solr path=/replication params={command=filecontent&checksum=true&generation=16&wt=filestream&file=_9_Lucene40_0.tim}
status=0 QTime=0 
   [junit4]   2> 57884 T3040 C189 REQ [collection1] webapp=/solr path=/replication params={command=filecontent&checksum=true&generation=16&wt=filestream&file=_9_nrm.cfe}
status=0 QTime=0 
   [junit4]   2> 57890 T3040 C189 REQ [collection1] webapp=/solr path=/replication params={command=filecontent&checksum=true&generation=16&wt=filestream&file=_9.fnm}
status=0 QTime=0 
   [junit4]   2> 57906 T3040 C189 REQ [collection1] webapp=/solr path=/replication params={command=filecontent&checksum=true&generation=16&wt=filestream&file=_9_nrm.cfs}
status=0 QTime=0 
   [junit4]   2> 57911 T3040 C189 REQ [collection1] webapp=/solr path=/replication params={command=filecontent&checksum=true&generation=16&wt=filestream&file=_9.fdt}
status=0 QTime=0 
   [junit4]   2> 57917 T3040 C189 REQ [collection1] webapp=/solr path=/replication params={command=filecontent&checksum=true&generation=16&wt=filestream&file=_9_Lucene40_0.tip}
status=0 QTime=0 
   [junit4]   2> 57922 T3040 C189 REQ [collection1] webapp=/solr path=/replication params={command=filecontent&checksum=true&generation=16&wt=filestream&file=_9.si}
status=0 QTime=0 
   [junit4]   2> 57927 T3040 C189 REQ [collection1] webapp=/solr path=/replication params={command=filecontent&checksum=true&generation=16&wt=filestream&file=_9.fdx}
status=0 QTime=0 
   [junit4]   2> 57932 T3040 C189 REQ [collection1] webapp=/solr path=/replication params={command=filecontent&checksum=true&generation=16&wt=filestream&file=segments_g}
status=0 QTime=0 
   [junit4]   2> 57937 T3040 C189 REQ [collection1] webapp=/solr path=/replication params={command=filecontent&checksum=true&generation=16&wt=filestream&file=_9_Lucene40_0.frq}
status=0 QTime=0 
   [junit4]   2> 57940 T3057 oash.SnapPuller.fetchLatestIndex Total time taken for download
: 0 secs
   [junit4]   2> 57942 T3057 oash.SnapPuller.copyAFile SEVERE Unable to move index file
from: .\org.apache.solr.handler.TestReplicationHandler$SolrInstance-1339399065338\slave\data\index.20120611031842\_9_Lucene40_0.tim
to: C:\Jenkins\workspace\Lucene-Solr-trunk-Windows-Java7-64\solr\build\solr-core\test\J0\org.apache.solr.handler.TestReplicationHandler$SolrInstance-1339399065338\slave\data\index.20120611031805\_9_Lucene40_0.tim
Trying to do a copy
   [junit4]   2> 57942 T3057 oash.SnapPuller.copyAFile SEVERE The index directory does
not exist: C:\Jenkins\workspace\Lucene-Solr-trunk-Windows-Java7-64\solr\build\solr-core\test\J0\org.apache.solr.handler.TestReplicationHandler$SolrInstance-1339399065338\slave\data\index.20120611031805
dirs found: [index.20120611031842, index.properties, replication.properties]
   [junit4]   2> 57942 T3057 oash.SnapPuller.copyAFile SEVERE Unable to copy index file
from: .\org.apache.solr.handler.TestReplicationHandler$SolrInstance-1339399065338\slave\data\index.20120611031842\_9_Lucene40_0.tim
to: C:\Jenkins\workspace\Lucene-Solr-trunk-Windows-Java7-64\solr\build\solr-core\test\J0\org.apache.solr.handler.TestReplicationHandler$SolrInstance-1339399065338\slave\data\index.20120611031805\_9_Lucene40_0.tim
java.io.FileNotFoundException: C:\Jenkins\workspace\Lucene-Solr-trunk-Windows-Java7-64\solr\build\solr-core\test\J0\org.apache.solr.handler.TestReplicationHandler$SolrInstance-1339399065338\slave\data\index.20120611031805\_9_Lucene40_0.tim
(The system cannot find the path specified)
   [junit4]   2> 	at java.io.FileOutputStream.open(Native Method)
   [junit4]   2> 	at java.io.FileOutputStream.<init>(FileOutputStream.java:212)
   [junit4]   2> 	at java.io.FileOutputStream.<init>(FileOutputStream.java:165)
   [junit4]   2> 	at org.apache.solr.util.FileUtils.copyFile(FileUtils.java:48)
   [junit4]   2> 	at org.apache.solr.handler.SnapPuller.copyAFile(SnapPuller.java:654)
   [junit4]   2> 	at org.apache.solr.handler.SnapPuller.copyIndexFiles(SnapPuller.java:703)
   [junit4]   2> 	at org.apache.solr.handler.SnapPuller.fetchLatestIndex(SnapPuller.java:371)
   [junit4]   2> 	at org.apache.solr.handler.ReplicationHandler.doFetch(ReplicationHandler.java:298)
   [junit4]   2> 	at org.apache.solr.handler.SnapPuller$1.run(SnapPuller.java:169)
   [junit4]   2> 	at java.util.concurrent.Executors$RunnableAdapter.call(Executors.java:471)
   [junit4]   2> 	at java.util.concurrent.FutureTask$Sync.innerRunAndReset(FutureTask.java:351)
   [junit4]   2> 	at java.util.concurrent.FutureTask.runAndReset(FutureTask.java:178)
   [junit4]   2> 	at java.util.concurrent.ScheduledThreadPoolExecutor$ScheduledFutureTask.access$301(ScheduledThreadPoolExecutor.java:178)
   [junit4]   2> 	at java.util.concurrent.ScheduledThreadPoolExecutor$ScheduledFutureTask.run(ScheduledThreadPoolExecutor.java:293)
   [junit4]   2> 	at java.util.concurrent.ThreadPoolExecutor.runWorker(ThreadPoolExecutor.java:1110)
   [junit4]   2> 	at java.util.concurrent.ThreadPoolExecutor$Worker.run(ThreadPoolExecutor.java:603)
   [junit4]   2> 	at java.lang.Thread.run(Thread.java:722)
   [junit4]   2> 
   [junit4]   2> 57971 T3051 C190 REQ [collection1] webapp=/solr path=/select params={wt=javabin&q=*:*&version=2}
hits=0 status=0 QTime=0 
   [junit4]   2> 58102 T3051 C190 REQ [collection1] webapp=/solr path=/select params={wt=javabin&q=*:*&version=2}
hits=0 status=0 QTime=0 
   [junit4]   2> 58232 T2879 oas.SolrTestCaseJ4.tearDown ###Ending test
   [junit4]   1> replicate slave to master
   [junit4]   2> NOTE: reproduce with: ant test  -Dtestcase=TestReplicationHandler -Dtests.method=test
-Dtests.seed=B032809CBA0B0DAB -Dtests.locale=ca -Dtests.timezone=America/Martinique -Dargs="-Dfile.encoding=Cp1252"
   [junit4]   1> 
   [junit4]   2>
   [junit4]    > (@AfterClass output)
   [junit4]   2> 58249 T2879 oasc.CoreContainer.shutdown Shutting down CoreContainer instance=1125693687
   [junit4]   2> 58249 T2879 oasc.SolrCore.close [collection1]  CLOSING SolrCore org.apache.solr.core.SolrCore@79c86e05
   [junit4]   2> 58250 T2879 oasc.SolrCore.closeSearcher [collection1] Closing main searcher
on request.
   [junit4]   2> 58250 T2879 oasu.DirectUpdateHandler2.close closing DirectUpdateHandler2{commits=2,autocommits=0,soft
autocommits=0,optimizes=0,rollbacks=0,expungeDeletes=0,docsPending=0,adds=0,deletesById=0,deletesByQuery=0,errors=0,cumulative_adds=494,cumulative_deletesById=0,cumulative_deletesByQuery=1,cumulative_errors=0}
   [junit4]   2> 58255 T2879 oejsh.ContextHandler.doStop stopped o.e.j.s.ServletContextHandler{/solr,null}
   [junit4]   2> 58310 T2879 oasc.CoreContainer.shutdown Shutting down CoreContainer instance=2029666854
   [junit4]   2> 58312 T2879 oasc.SolrCore.close [collection1]  CLOSING SolrCore org.apache.solr.core.SolrCore@7d72a3ce
   [junit4]   2> 58313 T2879 oasc.SolrCore.closeSearcher [collection1] Closing main searcher
on request.
   [junit4]   2> 58313 T2879 oasu.DirectUpdateHandler2.close closing DirectUpdateHandler2{commits=1,autocommits=0,soft
autocommits=0,optimizes=0,rollbacks=0,expungeDeletes=0,docsPending=0,adds=0,deletesById=0,deletesByQuery=0,errors=0,cumulative_adds=0,cumulative_deletesById=0,cumulative_deletesByQuery=0,cumulative_errors=0}
   [junit4]   2> 58315 T2879 oejsh.ContextHandler.doStop stopped o.e.j.s.ServletContextHandler{/solr,null}
   [junit4]   2> 58383 T2879 oas.SolrTestCaseJ4.deleteCore ###deleteCore
   [junit4]   2> NOTE: test params are: codec=Lucene40: {}, sim=RandomSimilarityProvider(queryNorm=false,coord=false):
{}, locale=ca, timezone=America/Martinique
   [junit4]   2> NOTE: Windows 7 6.1 amd64/Oracle Corporation 1.7.0_04 (64-bit)/cpus=2,threads=1,free=154927552,total=249036800
   [junit4]   2> NOTE: All tests run in this JVM: [SpellingQueryConverterTest, TestMultiWordSynonyms,
TestReverseStringFilterFactory, TestBinaryResponseWriter, TestUAX29URLEmailTokenizerFactory,
BadIndexSchemaTest, CommonGramsFilterFactoryTest, TestDFRSimilarityFactory, SolrCoreTest,
TestPatternReplaceFilterFactory, WordBreakSolrSpellCheckerTest, TestJapanesePartOfSpeechStopFilterFactory,
LengthFilterTest, LeaderElectionTest, TestSwedishLightStemFilterFactory, TestEnglishMinimalStemFilterFactory,
TestThaiWordFilterFactory, DirectUpdateHandlerOptimizeTest, CloudStateUpdateTest, TestPHPSerializedResponseWriter,
TestUtils, TestGalicianMinimalStemFilterFactory, TestGreekLowerCaseFilterFactory, TestXIncludeConfig,
TestQueryTypes, SpellPossibilityIteratorTest, TestWriterPerf, TestWikipediaTokenizerFactory,
TestSolrQueryParser, TestFastLRUCache, TestFiltering, TestCJKBigramFilterFactory, TestSolrCoreProperties,
UpdateParamsTest, DoubleMetaphoneFilterFactoryTest, TestJmxMonitoredMap, TestBrazilianStemFilterFactory,
TestCollationField, MinimalSchemaTest, JsonLoaderTest, LoggingHandlerTest, BinaryUpdateRequestHandlerTest,
TestItalianLightStemFilterFactory, TestNGramFilters, TestHungarianLightStemFilterFactory,
TestBinaryField, TestDistributedGrouping, TestCSVLoader, TestQuerySenderListener, TestHTMLStripCharFilterFactory,
HighlighterConfigTest, TestPorterStemFilterFactory, TestHunspellStemFilterFactory, TestTurkishLowerCaseFilterFactory,
TestLMDirichletSimilarityFactory, SpellCheckCollatorTest, OutputWriterTest, TestSearchPerf,
TestBulgarianStemFilterFactory, FieldAnalysisRequestHandlerTest, UpdateRequestProcessorFactoryTest,
DistributedTermsComponentTest, IndexReaderFactoryTest, DistributedSpellCheckComponentTest,
TestHyphenationCompoundWordTokenFilterFactory, TermVectorComponentTest, LukeRequestHandlerTest,
TestFaceting, PrimUtilsTest, MoreLikeThisHandlerTest, TestHashPartitioner, TestCoreContainer,
TestPatternReplaceCharFilterFactory, TestDefaultSimilarityFactory, CoreAdminHandlerTest, SimpleFacetsTest,
AlternateDirectoryTest, NoCacheHeaderTest, TestLFUCache, TestPluginEnable, TestLMJelinekMercerSimilarityFactory,
TestRandomFaceting, TestPatternTokenizerFactory, TestPhraseSuggestions, DirectSolrConnectionTest,
TestJapaneseReadingFormFilterFactory, TestSurroundQueryParser, TestArabicFilters, TestBM25SimilarityFactory,
TestGermanStemFilterFactory, TestGreekStemFilterFactory, LeaderElectionIntegrationTest, RequiredFieldsTest,
SoftAutoCommitTest, SolrInfoMBeanTest, TestArbitraryIndexDir, AutoCommitTest, TestGermanNormalizationFilterFactory,
CurrencyFieldTest, DisMaxRequestHandlerTest, CloudStateTest, TestReversedWildcardFilterFactory,
TestRealTimeGet, TestNorwegianLightStemFilterFactory, PingRequestHandlerTest, SolrIndexConfigTest,
TestLRUCache, OpenExchangeRatesOrgProviderTest, XmlUpdateRequestHandlerTest, ResourceLoaderTest,
SuggesterTSTTest, TestJapaneseBaseFormFilterFactory, TestElisionFilterFactory, SuggesterWFSTTest,
TestPropInjectDefaults, CSVRequestHandlerTest, SolrCmdDistributorTest, DateFieldTest, IndexBasedSpellCheckerTest,
SolrPluginUtilsTest, TestSpanishLightStemFilterFactory, TestDictionaryCompoundWordTokenFilterFactory,
SuggesterTest, TestFunctionQuery, TestIndonesianStemFilterFactory, TestConfig, DateMathParserTest,
QueryElevationComponentTest, TestKStemFilterFactory, IndexSchemaTest, TestPerFieldSimilarity,
TestDistributedSearch, MBeansHandlerTest, TestIBSimilarityFactory, DirectSolrSpellCheckerTest,
TestOmitPositions, TestWordDelimiterFilterFactory, TestStemmerOverrideFilterFactory, TestValueSourceCache,
SignatureUpdateProcessorFactoryTest, TestExtendedDismaxParser, FieldMutatingUpdateProcessorTest,
DebugComponentTest, FileBasedSpellCheckerTest, CacheHeaderTest, TestNorwegianMinimalStemFilterFactory,
TestKeywordMarkerFilterFactory, TimeZoneUtilsTest, PolyFieldTest, TestSuggestSpellingConverter,
TestMappingCharFilterFactory, TermsComponentTest, MultiTermTest, ZkControllerTest, TestPhoneticFilterFactory,
TestMergePolicyConfig, TestFrenchLightStemFilterFactory, TestKeepFilterFactory, PrimitiveFieldTypeTest,
TestPortugueseLightStemFilterFactory, TestLuceneMatchVersion, TestGalicianStemFilterFactory,
TestJmxIntegration, TestLatvianStemFilterFactory, TestPropInject, TestPersianNormalizationFilterFactory,
BasicZkTest, TestGroupingSearch, SearchHandlerTest, TestBadConfig, SortByFunctionTest, TestIrishLowerCaseFilterFactory,
OverseerTest, SolrCoreCheckLockOnStartupTest, StandardRequestHandlerTest, TestRussianLightStemFilterFactory,
DocumentAnalysisRequestHandlerTest, DistanceFunctionTest, SpellCheckComponentTest, TestRecovery,
CommonGramsQueryFilterFactoryTest, SpatialFilterTest, ZkNodePropsTest, RAMDirectoryFactoryTest,
TestStandardFactories, TestSort, NotRequiredUniqueKeyTest, SolrRequestParserTest, TestFrenchMinimalStemFilterFactory,
TestSolrDeletionPolicy2, BasicFunctionalityTest, QueryParsingTest, TestNumberUtils, TestPseudoReturnFields,
ReturnFieldsTest, RequestHandlersTest, TestIndexingPerformance, TestShingleFilterFactory,
TestRangeQuery, StatsComponentTest, TestDocSet, FullSolrCloudDistribCmdsTest, RecoveryZkTest,
BasicDistributedZkTest, TestReplicationHandler]
   [junit4]   2> 
   [junit4] Completed in 58.39s, 1 test, 1 failure <<< FAILURES!
[...truncated 224 lines...]

[...truncated 17729 lines...]

[...truncated 17729 lines...]

[...truncated 17729 lines...]

[...truncated 17729 lines...]

[...truncated 17729 lines...]



Mime
View raw message