lucene-dev mailing list archives

Site index · List index
Message view « Date » · « Thread »
Top « Date » · « Thread »
From jenk...@sd-datasolutions.de
Subject [JENKINS] Lucene-Solr-trunk-Windows-Java6-64 - Build # 414 - Failure!
Date Mon, 04 Jun 2012 19:25:19 GMT
Build: http://jenkins.sd-datasolutions.de/job/Lucene-Solr-trunk-Windows-Java6-64/414/

2 tests failed.
REGRESSION:  org.apache.solr.client.solrj.response.TestSpellCheckResponse.testSpellCheckResponse_Extended

Error Message:


Stack Trace:
java.lang.NullPointerException
	at __randomizedtesting.SeedInfo.seed([7B42F4A3B017D5A1:2CEE746F780BB0D8]:0)
	at org.apache.solr.client.solrj.response.TestSpellCheckResponse.testSpellCheckResponse_Extended(TestSpellCheckResponse.java:91)
	at sun.reflect.NativeMethodAccessorImpl.invoke0(Native Method)
	at sun.reflect.NativeMethodAccessorImpl.invoke(NativeMethodAccessorImpl.java:39)
	at sun.reflect.DelegatingMethodAccessorImpl.invoke(DelegatingMethodAccessorImpl.java:25)
	at java.lang.reflect.Method.invoke(Method.java:597)
	at com.carrotsearch.randomizedtesting.RandomizedRunner.invoke(RandomizedRunner.java:1969)
	at com.carrotsearch.randomizedtesting.RandomizedRunner.access$1100(RandomizedRunner.java:132)
	at com.carrotsearch.randomizedtesting.RandomizedRunner$6.evaluate(RandomizedRunner.java:814)
	at com.carrotsearch.randomizedtesting.RandomizedRunner$7.evaluate(RandomizedRunner.java:875)
	at com.carrotsearch.randomizedtesting.RandomizedRunner$8.evaluate(RandomizedRunner.java:889)
	at com.carrotsearch.randomizedtesting.rules.SystemPropertiesRestoreRule$1.evaluate(SystemPropertiesRestoreRule.java:53)
	at org.apache.lucene.util.TestRuleSetupTeardownChained$1.evaluate(TestRuleSetupTeardownChained.java:50)
	at org.apache.lucene.util.TestRuleFieldCacheSanity$1.evaluate(TestRuleFieldCacheSanity.java:32)
	at org.apache.lucene.util.AbstractBeforeAfterRule$1.evaluate(AbstractBeforeAfterRule.java:45)
	at com.carrotsearch.randomizedtesting.rules.SystemPropertiesInvariantRule$1.evaluate(SystemPropertiesInvariantRule.java:55)
	at org.apache.lucene.util.TestRuleReportUncaughtExceptions$1.evaluate(TestRuleReportUncaughtExceptions.java:68)
	at org.apache.lucene.util.TestRuleThreadAndTestName$1.evaluate(TestRuleThreadAndTestName.java:48)
	at org.apache.lucene.util.TestRuleMarkFailure$1.evaluate(TestRuleMarkFailure.java:48)
	at com.carrotsearch.randomizedtesting.RandomizedRunner.runSingleTest(RandomizedRunner.java:821)
	at com.carrotsearch.randomizedtesting.RandomizedRunner.access$700(RandomizedRunner.java:132)
	at com.carrotsearch.randomizedtesting.RandomizedRunner$3$1.run(RandomizedRunner.java:669)
	at com.carrotsearch.randomizedtesting.RandomizedRunner$3.evaluate(RandomizedRunner.java:695)
	at com.carrotsearch.randomizedtesting.RandomizedRunner$4.evaluate(RandomizedRunner.java:734)
	at com.carrotsearch.randomizedtesting.RandomizedRunner$5.evaluate(RandomizedRunner.java:745)
	at com.carrotsearch.randomizedtesting.rules.SystemPropertiesRestoreRule$1.evaluate(SystemPropertiesRestoreRule.java:53)
	at org.apache.lucene.util.AbstractBeforeAfterRule$1.evaluate(AbstractBeforeAfterRule.java:45)
	at org.apache.lucene.util.TestRuleReportUncaughtExceptions$1.evaluate(TestRuleReportUncaughtExceptions.java:68)
	at org.apache.lucene.util.TestRuleStoreClassName$1.evaluate(TestRuleStoreClassName.java:38)
	at org.apache.lucene.util.TestRuleIcuHack$1.evaluate(TestRuleIcuHack.java:51)
	at com.carrotsearch.randomizedtesting.rules.SystemPropertiesInvariantRule$1.evaluate(SystemPropertiesInvariantRule.java:55)
	at org.apache.lucene.util.TestRuleNoInstanceHooksOverrides$1.evaluate(TestRuleNoInstanceHooksOverrides.java:53)
	at org.apache.lucene.util.TestRuleNoStaticHooksShadowing$1.evaluate(TestRuleNoStaticHooksShadowing.java:52)
	at org.apache.lucene.util.TestRuleAssertionsRequired$1.evaluate(TestRuleAssertionsRequired.java:36)
	at org.apache.lucene.util.TestRuleMarkFailure$1.evaluate(TestRuleMarkFailure.java:48)
	at org.apache.lucene.util.TestRuleIgnoreTestSuites$1.evaluate(TestRuleIgnoreTestSuites.java:56)
	at com.carrotsearch.randomizedtesting.RandomizedRunner.runSuite(RandomizedRunner.java:605)
	at com.carrotsearch.randomizedtesting.RandomizedRunner.access$400(RandomizedRunner.java:132)
	at com.carrotsearch.randomizedtesting.RandomizedRunner$2.run(RandomizedRunner.java:551)


REGRESSION:  org.apache.solr.client.solrj.response.TestSpellCheckResponse.testSpellCheckCollationResponse

Error Message:


Stack Trace:
java.lang.AssertionError
	at __randomizedtesting.SeedInfo.seed([7B42F4A3B017D5A1:CD1FA3BB6BC2E5F6]:0)
	at org.junit.Assert.fail(Assert.java:92)
	at org.junit.Assert.assertTrue(Assert.java:43)
	at org.junit.Assert.assertTrue(Assert.java:54)
	at org.apache.solr.client.solrj.response.TestSpellCheckResponse.testSpellCheckCollationResponse(TestSpellCheckResponse.java:142)
	at sun.reflect.NativeMethodAccessorImpl.invoke0(Native Method)
	at sun.reflect.NativeMethodAccessorImpl.invoke(NativeMethodAccessorImpl.java:39)
	at sun.reflect.DelegatingMethodAccessorImpl.invoke(DelegatingMethodAccessorImpl.java:25)
	at java.lang.reflect.Method.invoke(Method.java:597)
	at com.carrotsearch.randomizedtesting.RandomizedRunner.invoke(RandomizedRunner.java:1969)
	at com.carrotsearch.randomizedtesting.RandomizedRunner.access$1100(RandomizedRunner.java:132)
	at com.carrotsearch.randomizedtesting.RandomizedRunner$6.evaluate(RandomizedRunner.java:814)
	at com.carrotsearch.randomizedtesting.RandomizedRunner$7.evaluate(RandomizedRunner.java:875)
	at com.carrotsearch.randomizedtesting.RandomizedRunner$8.evaluate(RandomizedRunner.java:889)
	at com.carrotsearch.randomizedtesting.rules.SystemPropertiesRestoreRule$1.evaluate(SystemPropertiesRestoreRule.java:53)
	at org.apache.lucene.util.TestRuleSetupTeardownChained$1.evaluate(TestRuleSetupTeardownChained.java:50)
	at org.apache.lucene.util.TestRuleFieldCacheSanity$1.evaluate(TestRuleFieldCacheSanity.java:32)
	at org.apache.lucene.util.AbstractBeforeAfterRule$1.evaluate(AbstractBeforeAfterRule.java:45)
	at com.carrotsearch.randomizedtesting.rules.SystemPropertiesInvariantRule$1.evaluate(SystemPropertiesInvariantRule.java:55)
	at org.apache.lucene.util.TestRuleReportUncaughtExceptions$1.evaluate(TestRuleReportUncaughtExceptions.java:68)
	at org.apache.lucene.util.TestRuleThreadAndTestName$1.evaluate(TestRuleThreadAndTestName.java:48)
	at org.apache.lucene.util.TestRuleMarkFailure$1.evaluate(TestRuleMarkFailure.java:48)
	at com.carrotsearch.randomizedtesting.RandomizedRunner.runSingleTest(RandomizedRunner.java:821)
	at com.carrotsearch.randomizedtesting.RandomizedRunner.access$700(RandomizedRunner.java:132)
	at com.carrotsearch.randomizedtesting.RandomizedRunner$3$1.run(RandomizedRunner.java:669)
	at com.carrotsearch.randomizedtesting.RandomizedRunner$3.evaluate(RandomizedRunner.java:695)
	at com.carrotsearch.randomizedtesting.RandomizedRunner$4.evaluate(RandomizedRunner.java:734)
	at com.carrotsearch.randomizedtesting.RandomizedRunner$5.evaluate(RandomizedRunner.java:745)
	at com.carrotsearch.randomizedtesting.rules.SystemPropertiesRestoreRule$1.evaluate(SystemPropertiesRestoreRule.java:53)
	at org.apache.lucene.util.AbstractBeforeAfterRule$1.evaluate(AbstractBeforeAfterRule.java:45)
	at org.apache.lucene.util.TestRuleReportUncaughtExceptions$1.evaluate(TestRuleReportUncaughtExceptions.java:68)
	at org.apache.lucene.util.TestRuleStoreClassName$1.evaluate(TestRuleStoreClassName.java:38)
	at org.apache.lucene.util.TestRuleIcuHack$1.evaluate(TestRuleIcuHack.java:51)
	at com.carrotsearch.randomizedtesting.rules.SystemPropertiesInvariantRule$1.evaluate(SystemPropertiesInvariantRule.java:55)
	at org.apache.lucene.util.TestRuleNoInstanceHooksOverrides$1.evaluate(TestRuleNoInstanceHooksOverrides.java:53)
	at org.apache.lucene.util.TestRuleNoStaticHooksShadowing$1.evaluate(TestRuleNoStaticHooksShadowing.java:52)
	at org.apache.lucene.util.TestRuleAssertionsRequired$1.evaluate(TestRuleAssertionsRequired.java:36)
	at org.apache.lucene.util.TestRuleMarkFailure$1.evaluate(TestRuleMarkFailure.java:48)
	at org.apache.lucene.util.TestRuleIgnoreTestSuites$1.evaluate(TestRuleIgnoreTestSuites.java:56)
	at com.carrotsearch.randomizedtesting.RandomizedRunner.runSuite(RandomizedRunner.java:605)
	at com.carrotsearch.randomizedtesting.RandomizedRunner.access$400(RandomizedRunner.java:132)
	at com.carrotsearch.randomizedtesting.RandomizedRunner$2.run(RandomizedRunner.java:551)




Build Log:
[...truncated 11024 lines...]
   [junit4]   2> 1903 T18 C4 oasu.DirectUpdateHandler2.commit start commit{flags=0,version=0,optimize=false,openSearcher=true,waitSearcher=true,expungeDeletes=false,softCommit=false}
   [junit4]   2> 1906 T18 C4 oasc.SolrDeletionPolicy.onCommit SolrDeletionPolicy.onCommit:
commits:num=2
   [junit4]   2> 		commit{dir=MockDirWrapper(org.apache.lucene.store.RAMDirectory@73415727
lockFactory=org.apache.lucene.store.NativeFSLockFactory@11ba4159),segFN=segments_1,generation=1,filenames=[segments_1]
   [junit4]   2> 		commit{dir=MockDirWrapper(org.apache.lucene.store.RAMDirectory@73415727
lockFactory=org.apache.lucene.store.NativeFSLockFactory@11ba4159),segFN=segments_2,generation=2,filenames=[_0_Lucene40_0.tim,
_0.fnm, _0_Lucene40_0.frq, _0_nrm.cfe, segments_2, _0.fdx, _0_nrm.cfs, _0.si, _0_Lucene40_0.prx,
_0.fdt, _0_Lucene40_0.tip]
   [junit4]   2> 1907 T18 C4 oasc.SolrDeletionPolicy.updateCommits newest commit = 2
   [junit4]   2> 1908 T18 C4 oasc.SolrCore.getSearcher WARNING [collection1] PERFORMANCE
WARNING: Overlapping onDeckSearchers=2
   [junit4]   2> 1909 T19 C4 REQ [collection1] webapp=null path=null params={event=firstSearcher&q=static+firstSearcher+warming+in+solrconfig.xml&distrib=false}
hits=0 status=0 QTime=19 
   [junit4]   2> 1909 T19 oasc.QuerySenderListener.newSearcher QuerySenderListener done.
   [junit4]   2> 1909 T19 oashc.SpellCheckComponent$SpellCheckerListener.newSearcher Loading
spell index for spellchecker: default
   [junit4]   2> 1911 T19 oashc.SpellCheckComponent$SpellCheckerListener.newSearcher Loading
spell index for spellchecker: wordbreak
   [junit4]   2> 1913 T18 C4 oass.SolrIndexSearcher.<init> Opening Searcher@514f2bd7
main
   [junit4]   2> 1913 T18 C4 oass.SolrIndexSearcher.<init> WARNING WARNING: Directory
impl does not support setting indexDir: org.apache.lucene.store.MockDirectoryWrapper
   [junit4]   2> 1914 T19 oasc.SolrCore.registerSearcher [collection1] Registered new searcher
Searcher@5cef0cdb main{StandardDirectoryReader(segments_1:1)}
   [junit4]   2> 1916 T19 oasc.QuerySenderListener.newSearcher QuerySenderListener sending
requests to Searcher@514f2bd7 main{StandardDirectoryReader(segments_2:3 _0(5.0):C1)}
   [junit4]   2> 1916 T18 C4 oasu.DirectUpdateHandler2.commit end_commit_flush
   [junit4]   2> 1916 T19 oasc.QuerySenderListener.newSearcher QuerySenderListener done.
   [junit4]   2> 1919 T19 oasc.SolrCore.registerSearcher [collection1] Registered new searcher
Searcher@514f2bd7 main{StandardDirectoryReader(segments_2:3 _0(5.0):C1)}
   [junit4]   2> 1920 T18 C4 UPDATE [collection1] webapp=null path=/update params={commit=true&softCommit=false&waitSearcher=true}
{commit=} 0 17
   [junit4]   2> 1992 T18 C4 REQ [collection1] webapp=null path=/spell params={q=*%3A*&qt=%2Fspell&spellcheck=true&spellcheck.q=samsang&spellcheck.build=true&spellcheck.extendedResults=true}
hits=1 status=0 QTime=72 
   [junit4]   2> 1995 T18 oas.SolrTestCaseJ4.tearDown ###Ending testSpellCheckResponse_Extended
   [junit4]   2> NOTE: reproduce with: ant test  -Dtestcase=TestSpellCheckResponse -Dtests.method=testSpellCheckResponse_Extended
-Dtests.seed=7B42F4A3B017D5A1 -Dtests.locale=th_TH_TH -Dtests.timezone=Asia/Muscat -Dargs="-Dfile.encoding=Cp1252"
   [junit4]   2>
   [junit4] FAILURE 0.22s | TestSpellCheckResponse.testSpellCheckCollationResponse
   [junit4]    > Throwable #1: java.lang.AssertionError
   [junit4]    > 	at __randomizedtesting.SeedInfo.seed([7B42F4A3B017D5A1:CD1FA3BB6BC2E5F6]:0)
   [junit4]    > 	at org.junit.Assert.fail(Assert.java:92)
   [junit4]    > 	at org.junit.Assert.assertTrue(Assert.java:43)
   [junit4]    > 	at org.junit.Assert.assertTrue(Assert.java:54)
   [junit4]    > 	at org.apache.solr.client.solrj.response.TestSpellCheckResponse.testSpellCheckCollationResponse(TestSpellCheckResponse.java:142)
   [junit4]    > 	at sun.reflect.NativeMethodAccessorImpl.invoke0(Native Method)
   [junit4]    > 	at sun.reflect.NativeMethodAccessorImpl.invoke(NativeMethodAccessorImpl.java:39)
   [junit4]    > 	at sun.reflect.DelegatingMethodAccessorImpl.invoke(DelegatingMethodAccessorImpl.java:25)
   [junit4]    > 	at java.lang.reflect.Method.invoke(Method.java:597)
   [junit4]    > 	at com.carrotsearch.randomizedtesting.RandomizedRunner.invoke(RandomizedRunner.java:1969)
   [junit4]    > 	at com.carrotsearch.randomizedtesting.RandomizedRunner.access$1100(RandomizedRunner.java:132)
   [junit4]    > 	at com.carrotsearch.randomizedtesting.RandomizedRunner$6.evaluate(RandomizedRunner.java:814)
   [junit4]    > 	at com.carrotsearch.randomizedtesting.RandomizedRunner$7.evaluate(RandomizedRunner.java:875)
   [junit4]    > 	at com.carrotsearch.randomizedtesting.RandomizedRunner$8.evaluate(RandomizedRunner.java:889)
   [junit4]    > 	at com.carrotsearch.randomizedtesting.rules.SystemPropertiesRestoreRule$1.evaluate(SystemPropertiesRestoreRule.java:53)
   [junit4]    > 	at org.apache.lucene.util.TestRuleSetupTeardownChained$1.evaluate(TestRuleSetupTeardownChained.java:50)
   [junit4]    > 	at org.apache.lucene.util.TestRuleFieldCacheSanity$1.evaluate(TestRuleFieldCacheSanity.java:32)
   [junit4]    > 	at org.apache.lucene.util.AbstractBeforeAfterRule$1.evaluate(AbstractBeforeAfterRule.java:45)
   [junit4]    > 	at com.carrotsearch.randomizedtesting.rules.SystemPropertiesInvariantRule$1.evaluate(SystemPropertiesInvariantRule.java:55)
   [junit4]    > 	at org.apache.lucene.util.TestRuleReportUncaughtExceptions$1.evaluate(TestRuleReportUncaughtExceptions.java:68)
   [junit4]    > 	at org.apache.lucene.util.TestRuleThreadAndTestName$1.evaluate(TestRuleThreadAndTestName.java:48)
   [junit4]    > 	at org.apache.lucene.util.TestRuleMarkFailure$1.evaluate(TestRuleMarkFailure.java:48)
   [junit4]    > 	at com.carrotsearch.randomizedtesting.RandomizedRunner.runSingleTest(RandomizedRunner.java:821)
   [junit4]    > 	at com.carrotsearch.randomizedtesting.RandomizedRunner.access$700(RandomizedRunner.java:132)
   [junit4]    > 	at com.carrotsearch.randomizedtesting.RandomizedRunner$3$1.run(RandomizedRunner.java:669)
   [junit4]    > 	at com.carrotsearch.randomizedtesting.RandomizedRunner$3.evaluate(RandomizedRunner.java:695)
   [junit4]    > 	at com.carrotsearch.randomizedtesting.RandomizedRunner$4.evaluate(RandomizedRunner.java:734)
   [junit4]    > 	at com.carrotsearch.randomizedtesting.RandomizedRunner$5.evaluate(RandomizedRunner.java:745)
   [junit4]    > 	at com.carrotsearch.randomizedtesting.rules.SystemPropertiesRestoreRule$1.evaluate(SystemPropertiesRestoreRule.java:53)
   [junit4]    > 	at org.apache.lucene.util.AbstractBeforeAfterRule$1.evaluate(AbstractBeforeAfterRule.java:45)
   [junit4]    > 	at org.apache.lucene.util.TestRuleReportUncaughtExceptions$1.evaluate(TestRuleReportUncaughtExceptions.java:68)
   [junit4]    > 	at org.apache.lucene.util.TestRuleStoreClassName$1.evaluate(TestRuleStoreClassName.java:38)
   [junit4]    > 	at org.apache.lucene.util.TestRuleIcuHack$1.evaluate(TestRuleIcuHack.java:51)
   [junit4]    > 	at com.carrotsearch.randomizedtesting.rules.SystemPropertiesInvariantRule$1.evaluate(SystemPropertiesInvariantRule.java:55)
   [junit4]    > 	at org.apache.lucene.util.TestRuleNoInstanceHooksOverrides$1.evaluate(TestRuleNoInstanceHooksOverrides.java:53)
   [junit4]    > 	at org.apache.lucene.util.TestRuleNoStaticHooksShadowing$1.evaluate(TestRuleNoStaticHooksShadowing.java:52)
   [junit4]    > 	at org.apache.lucene.util.TestRuleAssertionsRequired$1.evaluate(TestRuleAssertionsRequired.java:36)
   [junit4]    > 	at org.apache.lucene.util.TestRuleMarkFailure$1.evaluate(TestRuleMarkFailure.java:48)
   [junit4]    > 	at org.apache.lucene.util.TestRuleIgnoreTestSuites$1.evaluate(TestRuleIgnoreTestSuites.java:56)
   [junit4]    > 	at com.carrotsearch.randomizedtesting.RandomizedRunner.runSuite(RandomizedRunner.java:605)
   [junit4]    > 	at com.carrotsearch.randomizedtesting.RandomizedRunner.access$400(RandomizedRunner.java:132)
   [junit4]    > 	at com.carrotsearch.randomizedtesting.RandomizedRunner$2.run(RandomizedRunner.java:551)
   [junit4]    > 
   [junit4]   2> 2132 T18 oas.SolrTestCaseJ4.setUp ###Starting testSpellCheckCollationResponse
   [junit4]   2> 2147 T18 C4 UPDATE [collection1] webapp=null path=/update params={} {add=[0
(1403873217728217088)]} 0 14
   [junit4]   2> 2148 T18 C4 UPDATE [collection1] webapp=null path=/update params={} {add=[1
(1403873217742897152)]} 0 1
   [junit4]   2> 2152 T18 C4 UPDATE [collection1] webapp=null path=/update params={} {add=[2
(1403873217744994304)]} 0 3
   [junit4]   2> 2154 T18 C4 UPDATE [collection1] webapp=null path=/update params={} {add=[3
(1403873217749188608)]} 0 1
   [junit4]   2> 2155 T18 C4 UPDATE [collection1] webapp=null path=/update params={} {add=[4
(1403873217750237184)]} 0 1
   [junit4]   2> 2155 T18 C4 oasu.DirectUpdateHandler2.commit start commit{flags=0,version=0,optimize=false,openSearcher=true,waitSearcher=true,expungeDeletes=false,softCommit=false}
   [junit4]   2> 2161 T18 C4 oasc.SolrDeletionPolicy.onCommit SolrDeletionPolicy.onCommit:
commits:num=2
   [junit4]   2> 		commit{dir=MockDirWrapper(org.apache.lucene.store.RAMDirectory@73415727
lockFactory=org.apache.lucene.store.NativeFSLockFactory@11ba4159),segFN=segments_3,generation=3,filenames=[_1_Lucene40_0.tim,
_1.fdx, _1_nrm.cfs, _1.fdt, _1.si, _1_Lucene40_0.frq, _1.fnm, segments_3, _1_Lucene40_0.prx,
_1_Lucene40_0.tip, _1_nrm.cfe]
   [junit4]   2> 		commit{dir=MockDirWrapper(org.apache.lucene.store.RAMDirectory@73415727
lockFactory=org.apache.lucene.store.NativeFSLockFactory@11ba4159),segFN=segments_4,generation=4,filenames=[_1_Lucene40_0.tim,
_2.si, _1_nrm.cfs, _1_Lucene40_0.frq, _2.fdt, _2.fdx, _1.fnm, _2.fnm, _1_nrm.cfe, _1_Lucene40_0.tip,
_1_Lucene40_0.prx, _1.fdx, _2_Lucene40_0.tip, _2_nrm.cfe, _1.fdt, _2_Lucene40_0.frq, _2_Lucene40_0.prx,
_1.si, _2_Lucene40_0.tim, _2_nrm.cfs, segments_4]
   [junit4]   2> 2161 T18 C4 oasc.SolrDeletionPolicy.updateCommits newest commit = 4
   [junit4]   2> 2164 T18 C4 oass.SolrIndexSearcher.<init> Opening Searcher@54eeabe8
main
   [junit4]   2> 2164 T18 C4 oass.SolrIndexSearcher.<init> WARNING WARNING: Directory
impl does not support setting indexDir: org.apache.lucene.store.MockDirectoryWrapper
   [junit4]   2> 2164 T18 C4 oasu.DirectUpdateHandler2.commit end_commit_flush
   [junit4]   2> 2165 T19 oasc.QuerySenderListener.newSearcher QuerySenderListener sending
requests to Searcher@54eeabe8 main{StandardDirectoryReader(segments_4:9 _1(5.0):C1 _2(5.0):C5)}
   [junit4]   2> 2165 T19 oasc.QuerySenderListener.newSearcher QuerySenderListener done.
   [junit4]   2> 2168 T19 oasc.SolrCore.registerSearcher [collection1] Registered new searcher
Searcher@54eeabe8 main{StandardDirectoryReader(segments_4:9 _1(5.0):C1 _2(5.0):C5)}
   [junit4]   2> 2173 T18 C4 UPDATE [collection1] webapp=null path=/update params={commit=true&softCommit=false&waitSearcher=true}
{commit=} 0 18
   [junit4]   2> 2275 T18 C4 REQ [collection1] webapp=null path=/spell params={q=name%3A%28%2Bfauth+%2Bhome+%2Bloane%29&qt=%2Fspell&spellcheck=true&spellcheck.build=true&spellcheck.count=10&spellcheck.collate=true}
hits=0 status=0 QTime=102 
   [junit4]   2> 2332 T18 C4 REQ [collection1] webapp=null path=/spell params={q=name%3A%28%2Bfauth+%2Bhome+%2Bloane%29&qt=%2Fspell&spellcheck=true&spellcheck.build=true&spellcheck.count=10&spellcheck.collate=true}
hits=0 status=0 QTime=56 
   [junit4]   2> 2333 T18 oas.SolrTestCaseJ4.tearDown ###Ending testSpellCheckCollationResponse
   [junit4]   2> NOTE: reproduce with: ant test  -Dtestcase=TestSpellCheckResponse -Dtests.method=testSpellCheckCollationResponse
-Dtests.seed=7B42F4A3B017D5A1 -Dtests.locale=th_TH_TH -Dtests.timezone=Asia/Muscat -Dargs="-Dfile.encoding=Cp1252"
   [junit4]   2>
   [junit4]    > (@AfterClass output)
   [junit4]   2> 2346 T18 oas.SolrTestCaseJ4.deleteCore ###deleteCore
   [junit4]   2> 2346 T18 oasc.CoreContainer.shutdown Shutting down CoreContainer instance=564840309
   [junit4]   2> 2346 T18 oasc.SolrCore.close [collection1]  CLOSING SolrCore org.apache.solr.core.SolrCore@7331f919
   [junit4]   2> 2351 T18 oasc.SolrCore.closeSearcher [collection1] Closing main searcher
on request.
   [junit4]   2> 2352 T18 oasu.DirectUpdateHandler2.close closing DirectUpdateHandler2{commits=3,autocommit
maxTime=15000ms,autocommits=0,soft autocommits=0,optimizes=0,rollbacks=0,expungeDeletes=0,docsPending=0,adds=0,deletesById=0,deletesByQuery=0,errors=0,cumulative_adds=7,cumulative_deletesById=0,cumulative_deletesByQuery=0,cumulative_errors=0}
   [junit4]   2> NOTE: test params are: codec=Lucene40: {}, sim=DefaultSimilarity, locale=th_TH_TH,
timezone=Asia/Muscat
   [junit4]   2> NOTE: Windows 7 6.1 amd64/Sun Microsystems Inc. 1.6.0_32 (64-bit)/cpus=2,threads=1,free=43263544,total=80740352
   [junit4]   2> NOTE: All tests run in this JVM: [SolrExceptionTest, MergeIndexesEmbeddedTest,
TestSpellCheckResponse]
   [junit4]   2> 
   [junit4] Completed in 2.40s, 3 tests, 1 failure, 1 error <<< FAILURES!
[...truncated 134 lines...]

[...truncated 11259 lines...]

[...truncated 11259 lines...]

[...truncated 11259 lines...]


Mime
View raw message