lucene-dev mailing list archives

Site index · List index
Message view « Date » · « Thread »
Top « Date » · « Thread »
From Policeman Jenkins Server <jenk...@sd-datasolutions.de>
Subject [JENKINS] Lucene-Solr-trunk-Linux-Java7-64 - Build # 444 - Still Failing!
Date Fri, 29 Jun 2012 08:19:00 GMT
Build: http://jenkins.sd-datasolutions.de/job/Lucene-Solr-trunk-Linux-Java7-64/444/

1 tests failed.
FAILED:  org.apache.lucene.util.TestMaxFailuresRule.testMaxFailures

Error Message:
expected:<2> but was:<0>

Stack Trace:
java.lang.AssertionError: expected:<2> but was:<0>
	at org.junit.Assert.fail(Assert.java:93)
	at org.junit.Assert.failNotEquals(Assert.java:647)
	at org.junit.Assert.assertEquals(Assert.java:128)
	at org.junit.Assert.assertEquals(Assert.java:472)
	at org.junit.Assert.assertEquals(Assert.java:456)
	at org.apache.lucene.util.TestMaxFailuresRule.testMaxFailures(TestMaxFailuresRule.java:62)
	at sun.reflect.NativeMethodAccessorImpl.invoke0(Native Method)
	at sun.reflect.NativeMethodAccessorImpl.invoke(NativeMethodAccessorImpl.java:57)
	at sun.reflect.DelegatingMethodAccessorImpl.invoke(DelegatingMethodAccessorImpl.java:43)
	at java.lang.reflect.Method.invoke(Method.java:601)
	at org.junit.runners.model.FrameworkMethod$1.runReflectiveCall(FrameworkMethod.java:45)
	at org.junit.internal.runners.model.ReflectiveCallable.run(ReflectiveCallable.java:15)
	at org.junit.runners.model.FrameworkMethod.invokeExplosively(FrameworkMethod.java:42)
	at org.junit.internal.runners.statements.InvokeMethod.evaluate(InvokeMethod.java:20)
	at org.junit.internal.runners.statements.RunBefores.evaluate(RunBefores.java:28)
	at org.junit.internal.runners.statements.RunAfters.evaluate(RunAfters.java:30)
	at com.carrotsearch.randomizedtesting.rules.SystemPropertiesRestoreRule$1.evaluate(SystemPropertiesRestoreRule.java:53)
	at org.junit.rules.RunRules.evaluate(RunRules.java:18)
	at org.junit.runners.ParentRunner.runLeaf(ParentRunner.java:263)
	at org.junit.runners.BlockJUnit4ClassRunner.runChild(BlockJUnit4ClassRunner.java:68)
	at org.junit.runners.BlockJUnit4ClassRunner.runChild(BlockJUnit4ClassRunner.java:47)
	at org.junit.runners.ParentRunner$3.run(ParentRunner.java:231)
	at org.junit.runners.ParentRunner$1.schedule(ParentRunner.java:60)
	at org.junit.runners.ParentRunner.runChildren(ParentRunner.java:229)
	at org.junit.runners.ParentRunner.access$000(ParentRunner.java:50)
	at org.junit.runners.ParentRunner$2.evaluate(ParentRunner.java:222)
	at org.junit.runners.ParentRunner.run(ParentRunner.java:300)
	at com.carrotsearch.ant.tasks.junit4.slave.SlaveMain.execute(SlaveMain.java:145)
	at com.carrotsearch.ant.tasks.junit4.slave.SlaveMain.main(SlaveMain.java:238)
	at com.carrotsearch.ant.tasks.junit4.slave.SlaveMainSafe.main(SlaveMainSafe.java:12)




Build Log:
[...truncated 658 lines...]
   [junit4] Suite: org.apache.lucene.util.TestMaxFailuresRule
   [junit4] FAILURE 0.06s J0 | TestMaxFailuresRule.testMaxFailures
   [junit4]    > Throwable #1: java.lang.AssertionError: expected:<2> but was:<0>
   [junit4]    > 	at org.junit.Assert.fail(Assert.java:93)
   [junit4]    > 	at org.junit.Assert.failNotEquals(Assert.java:647)
   [junit4]    > 	at org.junit.Assert.assertEquals(Assert.java:128)
   [junit4]    > 	at org.junit.Assert.assertEquals(Assert.java:472)
   [junit4]    > 	at org.junit.Assert.assertEquals(Assert.java:456)
   [junit4]    > 	at org.apache.lucene.util.TestMaxFailuresRule.testMaxFailures(TestMaxFailuresRule.java:62)
   [junit4]    > 	at sun.reflect.NativeMethodAccessorImpl.invoke0(Native Method)
   [junit4]    > 	at sun.reflect.NativeMethodAccessorImpl.invoke(NativeMethodAccessorImpl.java:57)
   [junit4]    > 	at sun.reflect.DelegatingMethodAccessorImpl.invoke(DelegatingMethodAccessorImpl.java:43)
   [junit4]    > 	at java.lang.reflect.Method.invoke(Method.java:601)
   [junit4]    > 	at org.junit.runners.model.FrameworkMethod$1.runReflectiveCall(FrameworkMethod.java:45)
   [junit4]    > 	at org.junit.internal.runners.model.ReflectiveCallable.run(ReflectiveCallable.java:15)
   [junit4]    > 	at org.junit.runners.model.FrameworkMethod.invokeExplosively(FrameworkMethod.java:42)
   [junit4]    > 	at org.junit.internal.runners.statements.InvokeMethod.evaluate(InvokeMethod.java:20)
   [junit4]    > 	at org.junit.internal.runners.statements.RunBefores.evaluate(RunBefores.java:28)
   [junit4]    > 	at org.junit.internal.runners.statements.RunAfters.evaluate(RunAfters.java:30)
   [junit4]    > 	at com.carrotsearch.randomizedtesting.rules.SystemPropertiesRestoreRule$1.evaluate(SystemPropertiesRestoreRule.java:53)
   [junit4]    > 	at org.junit.rules.RunRules.evaluate(RunRules.java:18)
   [junit4]    > 	at org.junit.runners.ParentRunner.runLeaf(ParentRunner.java:263)
   [junit4]    > 	at org.junit.runners.BlockJUnit4ClassRunner.runChild(BlockJUnit4ClassRunner.java:68)
   [junit4]    > 	at org.junit.runners.BlockJUnit4ClassRunner.runChild(BlockJUnit4ClassRunner.java:47)
   [junit4]    > 	at org.junit.runners.ParentRunner$3.run(ParentRunner.java:231)
   [junit4]    > 	at org.junit.runners.ParentRunner$1.schedule(ParentRunner.java:60)
   [junit4]    > 	at org.junit.runners.ParentRunner.runChildren(ParentRunner.java:229)
   [junit4]    > 	at org.junit.runners.ParentRunner.access$000(ParentRunner.java:50)
   [junit4]    > 	at org.junit.runners.ParentRunner$2.evaluate(ParentRunner.java:222)
   [junit4]    > 	at org.junit.runners.ParentRunner.run(ParentRunner.java:300)
   [junit4]    > 	at com.carrotsearch.ant.tasks.junit4.slave.SlaveMain.execute(SlaveMain.java:145)
   [junit4]    > 	at com.carrotsearch.ant.tasks.junit4.slave.SlaveMain.main(SlaveMain.java:238)
   [junit4]    > 	at com.carrotsearch.ant.tasks.junit4.slave.SlaveMainSafe.main(SlaveMainSafe.java:12)
   [junit4]    >
   [junit4] Completed on J0 in 0.06s, 1 test, 1 failure <<< FAILURES!

[...truncated 759 lines...]
BUILD FAILED
/mnt/ssd/jenkins/workspace/Lucene-Solr-trunk-Linux-Java7-64/checkout/build.xml:29: The following
error occurred while executing this line:
/mnt/ssd/jenkins/workspace/Lucene-Solr-trunk-Linux-Java7-64/checkout/lucene/build.xml:50:
The following error occurred while executing this line:
/mnt/ssd/jenkins/workspace/Lucene-Solr-trunk-Linux-Java7-64/checkout/lucene/common-build.xml:1047:
The following error occurred while executing this line:
/mnt/ssd/jenkins/workspace/Lucene-Solr-trunk-Linux-Java7-64/checkout/lucene/common-build.xml:760:
There were test failures: 301 suites, 1708 tests, 1 failure, 12 ignored (11 assumptions)

Total time: 6 minutes 15 seconds
Build step 'Execute shell' marked build as failure
Archiving artifacts
Recording test results
Email was triggered for: Failure
Sending email for trigger: Failure




Mime
View raw message