lucene-dev mailing list archives

Site index · List index
Message view « Date » · « Thread »
Top « Date » · « Thread »
From Policeman Jenkins Server <jenk...@sd-datasolutions.de>
Subject [JENKINS] Lucene-Solr-4.x-Linux-Java7-64 - Build # 258 - Failure!
Date Thu, 28 Jun 2012 12:28:24 GMT
Build: http://jenkins.sd-datasolutions.de/job/Lucene-Solr-4.x-Linux-Java7-64/258/

3 tests failed.
REGRESSION:  org.apache.solr.handler.dataimport.TestSqlEntityProcessorDelta3.testCompositePk_FullImport

Error Message:
Exception during query

Stack Trace:
java.lang.RuntimeException: Exception during query
	at __randomizedtesting.SeedInfo.seed([8ECAEA0164565F55:D0A3A436BE0E0F83]:0)
	at org.apache.solr.SolrTestCaseJ4.assertQ(SolrTestCaseJ4.java:461)
	at org.apache.solr.SolrTestCaseJ4.assertQ(SolrTestCaseJ4.java:428)
	at org.apache.solr.handler.dataimport.TestSqlEntityProcessorDelta3.add1document(TestSqlEntityProcessorDelta3.java:83)
	at org.apache.solr.handler.dataimport.TestSqlEntityProcessorDelta3.testCompositePk_FullImport(TestSqlEntityProcessorDelta3.java:92)
	at sun.reflect.NativeMethodAccessorImpl.invoke0(Native Method)
	at sun.reflect.NativeMethodAccessorImpl.invoke(NativeMethodAccessorImpl.java:57)
	at sun.reflect.DelegatingMethodAccessorImpl.invoke(DelegatingMethodAccessorImpl.java:43)
	at java.lang.reflect.Method.invoke(Method.java:601)
	at com.carrotsearch.randomizedtesting.RandomizedRunner.invoke(RandomizedRunner.java:1969)
	at com.carrotsearch.randomizedtesting.RandomizedRunner.access$1100(RandomizedRunner.java:132)
	at com.carrotsearch.randomizedtesting.RandomizedRunner$6.evaluate(RandomizedRunner.java:814)
	at com.carrotsearch.randomizedtesting.RandomizedRunner$7.evaluate(RandomizedRunner.java:875)
	at com.carrotsearch.randomizedtesting.RandomizedRunner$8.evaluate(RandomizedRunner.java:889)
	at com.carrotsearch.randomizedtesting.rules.SystemPropertiesRestoreRule$1.evaluate(SystemPropertiesRestoreRule.java:53)
	at org.apache.lucene.util.TestRuleSetupTeardownChained$1.evaluate(TestRuleSetupTeardownChained.java:50)
	at org.apache.lucene.util.TestRuleFieldCacheSanity$1.evaluate(TestRuleFieldCacheSanity.java:32)
	at org.apache.lucene.util.AbstractBeforeAfterRule$1.evaluate(AbstractBeforeAfterRule.java:45)
	at com.carrotsearch.randomizedtesting.rules.SystemPropertiesInvariantRule$1.evaluate(SystemPropertiesInvariantRule.java:55)
	at org.apache.lucene.util.TestRuleReportUncaughtExceptions$1.evaluate(TestRuleReportUncaughtExceptions.java:68)
	at org.apache.lucene.util.TestRuleThreadAndTestName$1.evaluate(TestRuleThreadAndTestName.java:48)
	at org.apache.lucene.util.TestRuleMarkFailure$1.evaluate(TestRuleMarkFailure.java:48)
	at com.carrotsearch.randomizedtesting.RandomizedRunner.runSingleTest(RandomizedRunner.java:821)
	at com.carrotsearch.randomizedtesting.RandomizedRunner.access$700(RandomizedRunner.java:132)
	at com.carrotsearch.randomizedtesting.RandomizedRunner$3$1.run(RandomizedRunner.java:669)
	at com.carrotsearch.randomizedtesting.RandomizedRunner$3.evaluate(RandomizedRunner.java:695)
	at com.carrotsearch.randomizedtesting.RandomizedRunner$4.evaluate(RandomizedRunner.java:734)
	at com.carrotsearch.randomizedtesting.RandomizedRunner$5.evaluate(RandomizedRunner.java:745)
	at com.carrotsearch.randomizedtesting.rules.SystemPropertiesRestoreRule$1.evaluate(SystemPropertiesRestoreRule.java:53)
	at org.apache.lucene.util.AbstractBeforeAfterRule$1.evaluate(AbstractBeforeAfterRule.java:45)
	at org.apache.lucene.util.TestRuleReportUncaughtExceptions$1.evaluate(TestRuleReportUncaughtExceptions.java:68)
	at org.apache.lucene.util.TestRuleStoreClassName$1.evaluate(TestRuleStoreClassName.java:38)
	at org.apache.lucene.util.TestRuleIcuHack$1.evaluate(TestRuleIcuHack.java:51)
	at com.carrotsearch.randomizedtesting.rules.SystemPropertiesInvariantRule$1.evaluate(SystemPropertiesInvariantRule.java:55)
	at org.apache.lucene.util.TestRuleNoInstanceHooksOverrides$1.evaluate(TestRuleNoInstanceHooksOverrides.java:53)
	at org.apache.lucene.util.TestRuleNoStaticHooksShadowing$1.evaluate(TestRuleNoStaticHooksShadowing.java:52)
	at org.apache.lucene.util.TestRuleAssertionsRequired$1.evaluate(TestRuleAssertionsRequired.java:36)
	at org.apache.lucene.util.TestRuleMarkFailure$1.evaluate(TestRuleMarkFailure.java:48)
	at org.apache.lucene.util.TestRuleIgnoreTestSuites$1.evaluate(TestRuleIgnoreTestSuites.java:56)
	at com.carrotsearch.randomizedtesting.RandomizedRunner.runSuite(RandomizedRunner.java:605)
	at com.carrotsearch.randomizedtesting.RandomizedRunner.access$400(RandomizedRunner.java:132)
	at com.carrotsearch.randomizedtesting.RandomizedRunner$2.run(RandomizedRunner.java:551)
Caused by: java.lang.RuntimeException: REQUEST FAILED: xpath=//*[@numFound='1']
	xml response was: <?xml version="1.0" encoding="UTF-8"?>
<response>
<lst name="responseHeader"><int name="status">0</int><int name="QTime">0</int><lst name="params"><str name="start">0</str><str name="q">*:* OR add1document</str><str name="qt">standard</str><str name="rows">20</str><str name="version">2.2</str></lst></lst><result name="response" numFound="0" start="0"></result>
</response>

	request was:start=0&q=*:*+OR+add1document&qt=standard&rows=20&version=2.2
	at org.apache.solr.SolrTestCaseJ4.assertQ(SolrTestCaseJ4.java:454)
	... 40 more


REGRESSION:  org.apache.solr.handler.dataimport.TestSqlEntityProcessorDelta3.testCompositePk_DeltaImport_delete

Error Message:
org.apache.lucene.store.AlreadyClosedException: this IndexWriter is closed

Stack Trace:
org.apache.solr.common.SolrException: org.apache.lucene.store.AlreadyClosedException: this IndexWriter is closed
	at __randomizedtesting.SeedInfo.seed([8ECAEA0164565F55:AFF71C1F012B7739]:0)
	at org.apache.solr.util.TestHarness.update(TestHarness.java:233)
	at org.apache.solr.util.TestHarness.checkUpdateStatus(TestHarness.java:277)
	at org.apache.solr.util.TestHarness.validateUpdate(TestHarness.java:247)
	at org.apache.solr.SolrTestCaseJ4.checkUpdateU(SolrTestCaseJ4.java:415)
	at org.apache.solr.SolrTestCaseJ4.assertU(SolrTestCaseJ4.java:394)
	at org.apache.solr.SolrTestCaseJ4.assertU(SolrTestCaseJ4.java:388)
	at org.apache.solr.SolrTestCaseJ4.clearIndex(SolrTestCaseJ4.java:760)
	at org.apache.solr.handler.dataimport.TestSqlEntityProcessorDelta3.setUp(TestSqlEntityProcessorDelta3.java:67)
	at sun.reflect.NativeMethodAccessorImpl.invoke0(Native Method)
	at sun.reflect.NativeMethodAccessorImpl.invoke(NativeMethodAccessorImpl.java:57)
	at sun.reflect.DelegatingMethodAccessorImpl.invoke(DelegatingMethodAccessorImpl.java:43)
	at java.lang.reflect.Method.invoke(Method.java:601)
	at com.carrotsearch.randomizedtesting.RandomizedRunner.invoke(RandomizedRunner.java:1969)
	at com.carrotsearch.randomizedtesting.RandomizedRunner.access$1100(RandomizedRunner.java:132)
	at com.carrotsearch.randomizedtesting.RandomizedRunner$7.evaluate(RandomizedRunner.java:873)
	at com.carrotsearch.randomizedtesting.RandomizedRunner$8.evaluate(RandomizedRunner.java:889)
	at com.carrotsearch.randomizedtesting.rules.SystemPropertiesRestoreRule$1.evaluate(SystemPropertiesRestoreRule.java:53)
	at org.apache.lucene.util.TestRuleSetupTeardownChained$1.evaluate(TestRuleSetupTeardownChained.java:50)
	at org.apache.lucene.util.TestRuleFieldCacheSanity$1.evaluate(TestRuleFieldCacheSanity.java:32)
	at org.apache.lucene.util.AbstractBeforeAfterRule$1.evaluate(AbstractBeforeAfterRule.java:45)
	at com.carrotsearch.randomizedtesting.rules.SystemPropertiesInvariantRule$1.evaluate(SystemPropertiesInvariantRule.java:55)
	at org.apache.lucene.util.TestRuleReportUncaughtExceptions$1.evaluate(TestRuleReportUncaughtExceptions.java:68)
	at org.apache.lucene.util.TestRuleThreadAndTestName$1.evaluate(TestRuleThreadAndTestName.java:48)
	at org.apache.lucene.util.TestRuleMarkFailure$1.evaluate(TestRuleMarkFailure.java:48)
	at com.carrotsearch.randomizedtesting.RandomizedRunner.runSingleTest(RandomizedRunner.java:821)
	at com.carrotsearch.randomizedtesting.RandomizedRunner.access$700(RandomizedRunner.java:132)
	at com.carrotsearch.randomizedtesting.RandomizedRunner$3$1.run(RandomizedRunner.java:669)
	at com.carrotsearch.randomizedtesting.RandomizedRunner$3.evaluate(RandomizedRunner.java:695)
	at com.carrotsearch.randomizedtesting.RandomizedRunner$4.evaluate(RandomizedRunner.java:734)
	at com.carrotsearch.randomizedtesting.RandomizedRunner$5.evaluate(RandomizedRunner.java:745)
	at com.carrotsearch.randomizedtesting.rules.SystemPropertiesRestoreRule$1.evaluate(SystemPropertiesRestoreRule.java:53)
	at org.apache.lucene.util.AbstractBeforeAfterRule$1.evaluate(AbstractBeforeAfterRule.java:45)
	at org.apache.lucene.util.TestRuleReportUncaughtExceptions$1.evaluate(TestRuleReportUncaughtExceptions.java:68)
	at org.apache.lucene.util.TestRuleStoreClassName$1.evaluate(TestRuleStoreClassName.java:38)
	at org.apache.lucene.util.TestRuleIcuHack$1.evaluate(TestRuleIcuHack.java:51)
	at com.carrotsearch.randomizedtesting.rules.SystemPropertiesInvariantRule$1.evaluate(SystemPropertiesInvariantRule.java:55)
	at org.apache.lucene.util.TestRuleNoInstanceHooksOverrides$1.evaluate(TestRuleNoInstanceHooksOverrides.java:53)
	at org.apache.lucene.util.TestRuleNoStaticHooksShadowing$1.evaluate(TestRuleNoStaticHooksShadowing.java:52)
	at org.apache.lucene.util.TestRuleAssertionsRequired$1.evaluate(TestRuleAssertionsRequired.java:36)
	at org.apache.lucene.util.TestRuleMarkFailure$1.evaluate(TestRuleMarkFailure.java:48)
	at org.apache.lucene.util.TestRuleIgnoreTestSuites$1.evaluate(TestRuleIgnoreTestSuites.java:56)
	at com.carrotsearch.randomizedtesting.RandomizedRunner.runSuite(RandomizedRunner.java:605)
	at com.carrotsearch.randomizedtesting.RandomizedRunner.access$400(RandomizedRunner.java:132)
	at com.carrotsearch.randomizedtesting.RandomizedRunner$2.run(RandomizedRunner.java:551)
Caused by: org.apache.lucene.store.AlreadyClosedException: this IndexWriter is closed
	at org.apache.lucene.index.IndexWriter.ensureOpen(IndexWriter.java:554)
	at org.apache.lucene.index.IndexWriter.ensureOpen(IndexWriter.java:559)
	at org.apache.lucene.index.IndexWriter.deleteAll(IndexWriter.java:1890)
	at org.apache.solr.update.DirectUpdateHandler2.deleteAll(DirectUpdateHandler2.java:140)
	at org.apache.solr.update.DirectUpdateHandler2.deleteByQuery(DirectUpdateHandler2.java:292)
	at org.apache.solr.update.processor.RunUpdateProcessor.processDelete(RunUpdateProcessorFactory.java:67)
	at org.apache.solr.update.processor.UpdateRequestProcessor.processDelete(UpdateRequestProcessor.java:55)
	at org.apache.solr.update.processor.DistributedUpdateProcessor.doDeleteByQuery(DistributedUpdateProcessor.java:719)
	at org.apache.solr.update.processor.DistributedUpdateProcessor.processDelete(DistributedUpdateProcessor.java:592)
	at org.apache.solr.update.processor.UpdateRequestProcessor.processDelete(UpdateRequestProcessor.java:55)
	at org.apache.solr.handler.dataimport.AbstractDataImportHandlerTestCase$TestUpdateRequestProcessor.processDelete(AbstractDataImportHandlerTestCase.java:364)
	at org.apache.solr.handler.loader.XMLLoader.processDelete(XMLLoader.java:333)
	at org.apache.solr.handler.loader.XMLLoader.processUpdate(XMLLoader.java:264)
	at org.apache.solr.handler.loader.XMLLoader.load(XMLLoader.java:158)
	at org.apache.solr.handler.UpdateRequestHandler$1.load(UpdateRequestHandler.java:92)
	at org.apache.solr.handler.ContentStreamHandlerBase.handleRequestBody(ContentStreamHandlerBase.java:74)
	at org.apache.solr.handler.RequestHandlerBase.handleRequest(RequestHandlerBase.java:129)
	at org.apache.solr.core.SolrCore.execute(SolrCore.java:1561)
	at org.apache.solr.servlet.DirectSolrConnection.request(DirectSolrConnection.java:131)
	at org.apache.solr.util.TestHarness.update(TestHarness.java:229)
	... 43 more


REGRESSION:  org.apache.solr.handler.dataimport.TestSqlEntityProcessorDelta3.testCompositePk_DeltaImport_empty

Error Message:
org.apache.lucene.store.AlreadyClosedException: this IndexWriter is closed

Stack Trace:
org.apache.solr.common.SolrException: org.apache.lucene.store.AlreadyClosedException: this IndexWriter is closed
	at __randomizedtesting.SeedInfo.seed([8ECAEA0164565F55:49C9716EC5C30257]:0)
	at org.apache.solr.util.TestHarness.update(TestHarness.java:233)
	at org.apache.solr.util.TestHarness.checkUpdateStatus(TestHarness.java:277)
	at org.apache.solr.util.TestHarness.validateUpdate(TestHarness.java:247)
	at org.apache.solr.SolrTestCaseJ4.checkUpdateU(SolrTestCaseJ4.java:415)
	at org.apache.solr.SolrTestCaseJ4.assertU(SolrTestCaseJ4.java:394)
	at org.apache.solr.SolrTestCaseJ4.assertU(SolrTestCaseJ4.java:388)
	at org.apache.solr.SolrTestCaseJ4.clearIndex(SolrTestCaseJ4.java:760)
	at org.apache.solr.handler.dataimport.TestSqlEntityProcessorDelta3.setUp(TestSqlEntityProcessorDelta3.java:67)
	at sun.reflect.NativeMethodAccessorImpl.invoke0(Native Method)
	at sun.reflect.NativeMethodAccessorImpl.invoke(NativeMethodAccessorImpl.java:57)
	at sun.reflect.DelegatingMethodAccessorImpl.invoke(DelegatingMethodAccessorImpl.java:43)
	at java.lang.reflect.Method.invoke(Method.java:601)
	at com.carrotsearch.randomizedtesting.RandomizedRunner.invoke(RandomizedRunner.java:1969)
	at com.carrotsearch.randomizedtesting.RandomizedRunner.access$1100(RandomizedRunner.java:132)
	at com.carrotsearch.randomizedtesting.RandomizedRunner$7.evaluate(RandomizedRunner.java:873)
	at com.carrotsearch.randomizedtesting.RandomizedRunner$8.evaluate(RandomizedRunner.java:889)
	at com.carrotsearch.randomizedtesting.rules.SystemPropertiesRestoreRule$1.evaluate(SystemPropertiesRestoreRule.java:53)
	at org.apache.lucene.util.TestRuleSetupTeardownChained$1.evaluate(TestRuleSetupTeardownChained.java:50)
	at org.apache.lucene.util.TestRuleFieldCacheSanity$1.evaluate(TestRuleFieldCacheSanity.java:32)
	at org.apache.lucene.util.AbstractBeforeAfterRule$1.evaluate(AbstractBeforeAfterRule.java:45)
	at com.carrotsearch.randomizedtesting.rules.SystemPropertiesInvariantRule$1.evaluate(SystemPropertiesInvariantRule.java:55)
	at org.apache.lucene.util.TestRuleReportUncaughtExceptions$1.evaluate(TestRuleReportUncaughtExceptions.java:68)
	at org.apache.lucene.util.TestRuleThreadAndTestName$1.evaluate(TestRuleThreadAndTestName.java:48)
	at org.apache.lucene.util.TestRuleMarkFailure$1.evaluate(TestRuleMarkFailure.java:48)
	at com.carrotsearch.randomizedtesting.RandomizedRunner.runSingleTest(RandomizedRunner.java:821)
	at com.carrotsearch.randomizedtesting.RandomizedRunner.access$700(RandomizedRunner.java:132)
	at com.carrotsearch.randomizedtesting.RandomizedRunner$3$1.run(RandomizedRunner.java:669)
	at com.carrotsearch.randomizedtesting.RandomizedRunner$3.evaluate(RandomizedRunner.java:695)
	at com.carrotsearch.randomizedtesting.RandomizedRunner$4.evaluate(RandomizedRunner.java:734)
	at com.carrotsearch.randomizedtesting.RandomizedRunner$5.evaluate(RandomizedRunner.java:745)
	at com.carrotsearch.randomizedtesting.rules.SystemPropertiesRestoreRule$1.evaluate(SystemPropertiesRestoreRule.java:53)
	at org.apache.lucene.util.AbstractBeforeAfterRule$1.evaluate(AbstractBeforeAfterRule.java:45)
	at org.apache.lucene.util.TestRuleReportUncaughtExceptions$1.evaluate(TestRuleReportUncaughtExceptions.java:68)
	at org.apache.lucene.util.TestRuleStoreClassName$1.evaluate(TestRuleStoreClassName.java:38)
	at org.apache.lucene.util.TestRuleIcuHack$1.evaluate(TestRuleIcuHack.java:51)
	at com.carrotsearch.randomizedtesting.rules.SystemPropertiesInvariantRule$1.evaluate(SystemPropertiesInvariantRule.java:55)
	at org.apache.lucene.util.TestRuleNoInstanceHooksOverrides$1.evaluate(TestRuleNoInstanceHooksOverrides.java:53)
	at org.apache.lucene.util.TestRuleNoStaticHooksShadowing$1.evaluate(TestRuleNoStaticHooksShadowing.java:52)
	at org.apache.lucene.util.TestRuleAssertionsRequired$1.evaluate(TestRuleAssertionsRequired.java:36)
	at org.apache.lucene.util.TestRuleMarkFailure$1.evaluate(TestRuleMarkFailure.java:48)
	at org.apache.lucene.util.TestRuleIgnoreTestSuites$1.evaluate(TestRuleIgnoreTestSuites.java:56)
	at com.carrotsearch.randomizedtesting.RandomizedRunner.runSuite(RandomizedRunner.java:605)
	at com.carrotsearch.randomizedtesting.RandomizedRunner.access$400(RandomizedRunner.java:132)
	at com.carrotsearch.randomizedtesting.RandomizedRunner$2.run(RandomizedRunner.java:551)
Caused by: org.apache.lucene.store.AlreadyClosedException: this IndexWriter is closed
	at org.apache.lucene.index.IndexWriter.ensureOpen(IndexWriter.java:554)
	at org.apache.lucene.index.IndexWriter.ensureOpen(IndexWriter.java:559)
	at org.apache.lucene.index.IndexWriter.deleteAll(IndexWriter.java:1890)
	at org.apache.solr.update.DirectUpdateHandler2.deleteAll(DirectUpdateHandler2.java:140)
	at org.apache.solr.update.DirectUpdateHandler2.deleteByQuery(DirectUpdateHandler2.java:292)
	at org.apache.solr.update.processor.RunUpdateProcessor.processDelete(RunUpdateProcessorFactory.java:67)
	at org.apache.solr.update.processor.UpdateRequestProcessor.processDelete(UpdateRequestProcessor.java:55)
	at org.apache.solr.update.processor.DistributedUpdateProcessor.doDeleteByQuery(DistributedUpdateProcessor.java:719)
	at org.apache.solr.update.processor.DistributedUpdateProcessor.processDelete(DistributedUpdateProcessor.java:592)
	at org.apache.solr.update.processor.UpdateRequestProcessor.processDelete(UpdateRequestProcessor.java:55)
	at org.apache.solr.handler.dataimport.AbstractDataImportHandlerTestCase$TestUpdateRequestProcessor.processDelete(AbstractDataImportHandlerTestCase.java:364)
	at org.apache.solr.handler.loader.XMLLoader.processDelete(XMLLoader.java:333)
	at org.apache.solr.handler.loader.XMLLoader.processUpdate(XMLLoader.java:264)
	at org.apache.solr.handler.loader.XMLLoader.load(XMLLoader.java:158)
	at org.apache.solr.handler.UpdateRequestHandler$1.load(UpdateRequestHandler.java:92)
	at org.apache.solr.handler.ContentStreamHandlerBase.handleRequestBody(ContentStreamHandlerBase.java:74)
	at org.apache.solr.handler.RequestHandlerBase.handleRequest(RequestHandlerBase.java:129)
	at org.apache.solr.core.SolrCore.execute(SolrCore.java:1561)
	at org.apache.solr.servlet.DirectSolrConnection.request(DirectSolrConnection.java:131)
	at org.apache.solr.util.TestHarness.update(TestHarness.java:229)
	... 43 more




Build Log:
[...truncated 10254 lines...]
   [junit4] Suite: org.apache.solr.handler.dataimport.TestSqlEntityProcessorDelta3
   [junit4]    > (@BeforeClass output)
   [junit4]   2> 0 T89 oas.SolrTestCaseJ4.initCore ####initCore
   [junit4]   2> Creating dataDir: /mnt/ssd/jenkins/workspace/Lucene-Solr-4.x-Linux-Java7-64/checkout/solr/build/contrib/solr-dataimporthandler/test/J0/./solrtest-TestSqlEntityProcessorDelta3-1340886433294
   [junit4]   2> 1 T89 oasc.SolrResourceLoader.<init> new SolrResourceLoader for directory: '/mnt/ssd/jenkins/workspace/Lucene-Solr-4.x-Linux-Java7-64/checkout/solr/build/contrib/solr-dataimporthandler/test-files/dih/solr/collection1/'
   [junit4]   2> 43 T89 oasc.SolrConfig.<init> Using Lucene MatchVersion: LUCENE_40
   [junit4]   2> 134 T89 oasc.SolrConfig.<init> Loaded SolrConfig: dataimport-solrconfig.xml
   [junit4]   2> 135 T89 oass.IndexSchema.readSchema Reading Solr Schema
   [junit4]   2> 146 T89 oass.IndexSchema.readSchema Schema name=dih_test
   [junit4]   2> 231 T89 oass.IndexSchema.readSchema default search field in schema is desc
   [junit4]   2> 233 T89 oass.IndexSchema.readSchema query parser default operator is OR
   [junit4]   2> 235 T89 oass.IndexSchema.readSchema unique key field: id
   [junit4]   2> 237 T89 oasc.SolrResourceLoader.locateSolrHome JNDI not configured for solr (NoInitialContextEx)
   [junit4]   2> 237 T89 oasc.SolrResourceLoader.locateSolrHome using system property solr.solr.home: /mnt/ssd/jenkins/workspace/Lucene-Solr-4.x-Linux-Java7-64/checkout/solr/build/contrib/solr-dataimporthandler/test-files/dih/solr
   [junit4]   2> 238 T89 oasc.SolrResourceLoader.<init> new SolrResourceLoader for directory: '/mnt/ssd/jenkins/workspace/Lucene-Solr-4.x-Linux-Java7-64/checkout/solr/build/contrib/solr-dataimporthandler/test-files/dih/solr/'
   [junit4]   2> 238 T89 oasc.CoreContainer.<init> New CoreContainer 669807864
   [junit4]   2> 239 T89 oasc.SolrCore.<init> [collection1] Opening new SolrCore at /mnt/ssd/jenkins/workspace/Lucene-Solr-4.x-Linux-Java7-64/checkout/solr/build/contrib/solr-dataimporthandler/test-files/dih/solr/collection1/, dataDir=/mnt/ssd/jenkins/workspace/Lucene-Solr-4.x-Linux-Java7-64/checkout/solr/build/contrib/solr-dataimporthandler/test/J0/./solrtest-TestSqlEntityProcessorDelta3-1340886433294/
   [junit4]   2> 239 T89 oasc.SolrCore.<init> JMX monitoring not detected for core: collection1
   [junit4]   2> 240 T89 oasc.SolrCore.initListeners [collection1] Added SolrEventListener for newSearcher: org.apache.solr.core.QuerySenderListener{queries=[{q=solr,start=0,rows=10}, {q=rocks,start=0,rows=10}, {q=static newSearcher warming query from solrconfig.xml}]}
   [junit4]   2> 240 T89 oasc.SolrCore.initListeners [collection1] Added SolrEventListener for firstSearcher: org.apache.solr.core.QuerySenderListener{queries=[]}
   [junit4]   2> 241 T89 oasc.SolrCore.getNewIndexDir WARNING New index directory detected: old=null new=/mnt/ssd/jenkins/workspace/Lucene-Solr-4.x-Linux-Java7-64/checkout/solr/build/contrib/solr-dataimporthandler/test/J0/./solrtest-TestSqlEntityProcessorDelta3-1340886433294/index/
   [junit4]   2> 241 T89 oasc.SolrCore.initIndex WARNING [collection1] Solr index directory '/mnt/ssd/jenkins/workspace/Lucene-Solr-4.x-Linux-Java7-64/checkout/solr/build/contrib/solr-dataimporthandler/test/J0/./solrtest-TestSqlEntityProcessorDelta3-1340886433294/index' doesn't exist. Creating new index...
   [junit4]   2> 246 T89 oasc.SolrDeletionPolicy.onCommit SolrDeletionPolicy.onCommit: commits:num=1
   [junit4]   2> 		commit{dir=MockDirWrapper(org.apache.lucene.store.RAMDirectory@14f35a42 lockFactory=org.apache.lucene.store.NativeFSLockFactory@4ee2dd22),segFN=segments_1,generation=1,filenames=[segments_1]
   [junit4]   2> 246 T89 oasc.SolrDeletionPolicy.updateCommits newest commit = 1
   [junit4]   2> 248 T89 oasup.UpdateRequestProcessorChain.init inserting DistributedUpdateProcessorFactory into updateRequestProcessorChain "" (default)
   [junit4]   2> 248 T89 oasc.RequestHandlers.initHandlersFromConfig created standard: solr.StandardRequestHandler
   [junit4]   2> 249 T89 oasc.RequestHandlers.initHandlersFromConfig created /dataimport: org.apache.solr.handler.dataimport.DataImportHandler
   [junit4]   2> 249 T89 oasc.RequestHandlers.initHandlersFromConfig created /search: org.apache.solr.handler.component.SearchHandler
   [junit4]   2> 249 T89 oasc.RequestHandlers.initHandlersFromConfig created /update: solr.UpdateRequestHandler
   [junit4]   2> 250 T89 oashl.XMLLoader.init xsltCacheLifetimeSeconds=60
   [junit4]   2> 253 T89 oass.SolrIndexSearcher.<init> Opening Searcher@53622a3d main
   [junit4]   2> 253 T89 oass.SolrIndexSearcher.<init> WARNING WARNING: Directory impl does not support setting indexDir: org.apache.lucene.store.MockDirectoryWrapper
   [junit4]   2> 254 T89 oasu.CommitTracker.<init> Hard AutoCommit: disabled
   [junit4]   2> 254 T89 oasu.CommitTracker.<init> Soft AutoCommit: disabled
   [junit4]   2> 255 T89 oashc.HttpShardHandlerFactory.getParameter Setting socketTimeout to: 0
   [junit4]   2> 255 T89 oashc.HttpShardHandlerFactory.getParameter Setting urlScheme to: http://
   [junit4]   2> 255 T89 oashc.HttpShardHandlerFactory.getParameter Setting connTimeout to: 0
   [junit4]   2> 255 T89 oashc.HttpShardHandlerFactory.getParameter Setting maxConnectionsPerHost to: 20
   [junit4]   2> 256 T89 oashc.HttpShardHandlerFactory.getParameter Setting corePoolSize to: 0
   [junit4]   2> 256 T89 oashc.HttpShardHandlerFactory.getParameter Setting maximumPoolSize to: 2147483647
   [junit4]   2> 256 T89 oashc.HttpShardHandlerFactory.getParameter Setting maxThreadIdleTime to: 5
   [junit4]   2> 257 T89 oashc.HttpShardHandlerFactory.getParameter Setting sizeOfQueue to: -1
   [junit4]   2> 257 T89 oashc.HttpShardHandlerFactory.getParameter Setting fairnessPolicy to: false
   [junit4]   2> 257 T89 oascsi.HttpClientUtil.createClient Creating new http client, config:maxConnectionsPerHost=20&maxConnections=10000&socketTimeout=0&connTimeout=0&retry=false
   [junit4]   2> 261 T90 oasc.QuerySenderListener.newSearcher QuerySenderListener sending requests to Searcher@53622a3d main{StandardDirectoryReader(segments_1:1)}
   [junit4]   2> 261 T89 oasc.CoreContainer.register registering core: collection1
   [junit4]   2> 262 T90 oasc.QuerySenderListener.newSearcher QuerySenderListener done.
   [junit4]   2> 262 T90 oasc.SolrCore.registerSearcher [collection1] Registered new searcher Searcher@53622a3d main{StandardDirectoryReader(segments_1:1)}
   [junit4]   2> 262 T89 oas.SolrTestCaseJ4.initCore ####initCore end
   [junit4]   2> 
   [junit4] ERROR   0.06s J0 | TestSqlEntityProcessorDelta3.testCompositePk_FullImport
   [junit4]    > Throwable #1: java.lang.RuntimeException: Exception during query
   [junit4]    > 	at __randomizedtesting.SeedInfo.seed([8ECAEA0164565F55:D0A3A436BE0E0F83]:0)
   [junit4]    > 	at org.apache.solr.SolrTestCaseJ4.assertQ(SolrTestCaseJ4.java:461)
   [junit4]    > 	at org.apache.solr.SolrTestCaseJ4.assertQ(SolrTestCaseJ4.java:428)
   [junit4]    > 	at org.apache.solr.handler.dataimport.TestSqlEntityProcessorDelta3.add1document(TestSqlEntityProcessorDelta3.java:83)
   [junit4]    > 	at org.apache.solr.handler.dataimport.TestSqlEntityProcessorDelta3.testCompositePk_FullImport(TestSqlEntityProcessorDelta3.java:92)
   [junit4]    > 	at sun.reflect.NativeMethodAccessorImpl.invoke0(Native Method)
   [junit4]    > 	at sun.reflect.NativeMethodAccessorImpl.invoke(NativeMethodAccessorImpl.java:57)
   [junit4]    > 	at sun.reflect.DelegatingMethodAccessorImpl.invoke(DelegatingMethodAccessorImpl.java:43)
   [junit4]    > 	at java.lang.reflect.Method.invoke(Method.java:601)
   [junit4]    > 	at com.carrotsearch.randomizedtesting.RandomizedRunner.invoke(RandomizedRunner.java:1969)
   [junit4]    > 	at com.carrotsearch.randomizedtesting.RandomizedRunner.access$1100(RandomizedRunner.java:132)
   [junit4]    > 	at com.carrotsearch.randomizedtesting.RandomizedRunner$6.evaluate(RandomizedRunner.java:814)
   [junit4]    > 	at com.carrotsearch.randomizedtesting.RandomizedRunner$7.evaluate(RandomizedRunner.java:875)
   [junit4]    > 	at com.carrotsearch.randomizedtesting.RandomizedRunner$8.evaluate(RandomizedRunner.java:889)
   [junit4]    > 	at com.carrotsearch.randomizedtesting.rules.SystemPropertiesRestoreRule$1.evaluate(SystemPropertiesRestoreRule.java:53)
   [junit4]    > 	at org.apache.lucene.util.TestRuleSetupTeardownChained$1.evaluate(TestRuleSetupTeardownChained.java:50)
   [junit4]    > 	at org.apache.lucene.util.TestRuleFieldCacheSanity$1.evaluate(TestRuleFieldCacheSanity.java:32)
   [junit4]    > 	at org.apache.lucene.util.AbstractBeforeAfterRule$1.evaluate(AbstractBeforeAfterRule.java:45)
   [junit4]    > 	at com.carrotsearch.randomizedtesting.rules.SystemPropertiesInvariantRule$1.evaluate(SystemPropertiesInvariantRule.java:55)
   [junit4]    > 	at org.apache.lucene.util.TestRuleReportUncaughtExceptions$1.evaluate(TestRuleReportUncaughtExceptions.java:68)
   [junit4]    > 	at org.apache.lucene.util.TestRuleThreadAndTestName$1.evaluate(TestRuleThreadAndTestName.java:48)
   [junit4]    > 	at org.apache.lucene.util.TestRuleMarkFailure$1.evaluate(TestRuleMarkFailure.java:48)
   [junit4]    > 	at com.carrotsearch.randomizedtesting.RandomizedRunner.runSingleTest(RandomizedRunner.java:821)
   [junit4]    > 	at com.carrotsearch.randomizedtesting.RandomizedRunner.access$700(RandomizedRunner.java:132)
   [junit4]    > 	at com.carrotsearch.randomizedtesting.RandomizedRunner$3$1.run(RandomizedRunner.java:669)
   [junit4]    > 	at com.carrotsearch.randomizedtesting.RandomizedRunner$3.evaluate(RandomizedRunner.java:695)
   [junit4]    > 	at com.carrotsearch.randomizedtesting.RandomizedRunner$4.evaluate(RandomizedRunner.java:734)
   [junit4]    > 	at com.carrotsearch.randomizedtesting.RandomizedRunner$5.evaluate(RandomizedRunner.java:745)
   [junit4]    > 	at com.carrotsearch.randomizedtesting.rules.SystemPropertiesRestoreRule$1.evaluate(SystemPropertiesRestoreRule.java:53)
   [junit4]    > 	at org.apache.lucene.util.AbstractBeforeAfterRule$1.evaluate(AbstractBeforeAfterRule.java:45)
   [junit4]    > 	at org.apache.lucene.util.TestRuleReportUncaughtExceptions$1.evaluate(TestRuleReportUncaughtExceptions.java:68)
   [junit4]    > 	at org.apache.lucene.util.TestRuleStoreClassName$1.evaluate(TestRuleStoreClassName.java:38)
   [junit4]    > 	at org.apache.lucene.util.TestRuleIcuHack$1.evaluate(TestRuleIcuHack.java:51)
   [junit4]    > 	at com.carrotsearch.randomizedtesting.rules.SystemPropertiesInvariantRule$1.evaluate(SystemPropertiesInvariantRule.java:55)
   [junit4]    > 	at org.apache.lucene.util.TestRuleNoInstanceHooksOverrides$1.evaluate(TestRuleNoInstanceHooksOverrides.java:53)
   [junit4]    > 	at org.apache.lucene.util.TestRuleNoStaticHooksShadowing$1.evaluate(TestRuleNoStaticHooksShadowing.java:52)
   [junit4]    > 	at org.apache.lucene.util.TestRuleAssertionsRequired$1.evaluate(TestRuleAssertionsRequired.java:36)
   [junit4]    > 	at org.apache.lucene.util.TestRuleMarkFailure$1.evaluate(TestRuleMarkFailure.java:48)
   [junit4]    > 	at org.apache.lucene.util.TestRuleIgnoreTestSuites$1.evaluate(TestRuleIgnoreTestSuites.java:56)
   [junit4]    > 	at com.carrotsearch.randomizedtesting.RandomizedRunner.runSuite(RandomizedRunner.java:605)
   [junit4]    > 	at com.carrotsearch.randomizedtesting.RandomizedRunner.access$400(RandomizedRunner.java:132)
   [junit4]    > 	at com.carrotsearch.randomizedtesting.RandomizedRunner$2.run(RandomizedRunner.java:551)
   [junit4]    > Caused by: java.lang.RuntimeException: REQUEST FAILED: xpath=//*[@numFound='1']
   [junit4]    > 	xml response was: <?xml version="1.0" encoding="UTF-8"?>
   [junit4]    > <response>
   [junit4]    > <lst name="responseHeader"><int name="status">0</int><int name="QTime">0</int><lst name="params"><str name="start">0</str><str name="q">*:* OR add1document</str><str name="qt">standard</str><str name="rows">20</str><str name="version">2.2</str></lst></lst><result name="response" numFound="0" start="0"></result>
   [junit4]    > </response>
   [junit4]    > 
   [junit4]    > 	request was:start=0&q=*:*+OR+add1document&qt=standard&rows=20&version=2.2
   [junit4]    > 	at org.apache.solr.SolrTestCaseJ4.assertQ(SolrTestCaseJ4.java:454)
   [junit4]    > 	... 40 more
   [junit4]    > 
   [junit4]   2> 594 T89 oas.SolrTestCaseJ4.setUp ###Starting testCompositePk_FullImport
   [junit4]   2> 597 T89 C12 oasu.DirectUpdateHandler2.deleteAll [collection1] REMOVING ALL DOCUMENTS FROM INDEX
   [junit4]   2> 598 T89 C12 UPDATE [collection1] webapp=null path=null params={} {deleteByQuery=*:*} 0 1
   [junit4]   2> 603 T89 C12 oasu.DirectUpdateHandler2.commit start commit{flags=0,version=0,optimize=false,openSearcher=true,waitSearcher=true,expungeDeletes=false,softCommit=false}
   [junit4]   2> 604 T89 C12 oasc.SolrDeletionPolicy.onCommit SolrDeletionPolicy.onCommit: commits:num=2
   [junit4]   2> 		commit{dir=MockDirWrapper(org.apache.lucene.store.RAMDirectory@14f35a42 lockFactory=org.apache.lucene.store.NativeFSLockFactory@4ee2dd22),segFN=segments_9,generation=9,filenames=[_4.fdx, segments_9, _4_Lucene40_0.frq, _4_Lucene40_0.tip, _4.fnm, _4.si, _4.fdt, _4_Lucene40_0.tim]
   [junit4]   2> 		commit{dir=MockDirWrapper(org.apache.lucene.store.RAMDirectory@14f35a42 lockFactory=org.apache.lucene.store.NativeFSLockFactory@4ee2dd22),segFN=segments_a,generation=10,filenames=[segments_a]
   [junit4]   2> 604 T89 C12 oasc.SolrDeletionPolicy.updateCommits newest commit = 10
   [junit4]   2> 605 T89 C12 oass.SolrIndexSearcher.<init> Opening Searcher@7e14d761 main
   [junit4]   2> 605 T89 C12 oass.SolrIndexSearcher.<init> WARNING WARNING: Directory impl does not support setting indexDir: org.apache.lucene.store.MockDirectoryWrapper
   [junit4]   2> 606 T89 C12 oasu.DirectUpdateHandler2.commit end_commit_flush
   [junit4]   2> 606 T90 oasc.QuerySenderListener.newSearcher QuerySenderListener sending requests to Searcher@7e14d761 main{StandardDirectoryReader(segments_a:20)}
   [junit4]   2> 607 T90 C12 REQ [collection1] webapp=null path=null params={start=0&event=newSearcher&q=solr&distrib=false&rows=10} hits=0 status=0 QTime=0 
   [junit4]   2> 607 T90 C12 REQ [collection1] webapp=null path=null params={start=0&event=newSearcher&q=rocks&distrib=false&rows=10} hits=0 status=0 QTime=0 
   [junit4]   2> 608 T90 C12 REQ [collection1] webapp=null path=null params={event=newSearcher&q=static+newSearcher+warming+query+from+solrconfig.xml&distrib=false} hits=0 status=0 QTime=0 
   [junit4]   2> 608 T90 oasc.QuerySenderListener.newSearcher QuerySenderListener done.
   [junit4]   2> 608 T90 oasc.SolrCore.registerSearcher [collection1] Registered new searcher Searcher@7e14d761 main{StandardDirectoryReader(segments_a:20)}
   [junit4]   2> 609 T89 C12 UPDATE [collection1] webapp=null path=null params={} {commit=} 0 6
   [junit4]   2> 611 T89 C12 oashd.DataImportHandler.processConfiguration No configuration specified in solrconfig.xml for DataImportHandler
   [junit4]   2> 613 T89 C12 oashd.DataImporter.loadDataConfig Data Configuration loaded successfully
   [junit4]   2> 614 T89 C12 oashd.DataImporter.doFullImport Starting Full Import
   [junit4]   2> 614 T89 C12 oashd.SimplePropertiesWriter.readIndexerProperties Read dataimport.properties
   [junit4]   2> 615 T89 C12 oasc.SolrException.log SEVERE Full Import failed:org.apache.solr.handler.dataimport.DataImportHandlerException: Properties is not writable. Delta imports are supported by data config but will not work. Processing Document # 1
   [junit4]   2> 		at org.apache.solr.handler.dataimport.DataImporter.checkWritablePersistFile(DataImporter.java:350)
   [junit4]   2> 		at org.apache.solr.handler.dataimport.DataImporter.doFullImport(DataImporter.java:332)
   [junit4]   2> 		at org.apache.solr.handler.dataimport.DataImporter.runCmd(DataImporter.java:399)
   [junit4]   2> 		at org.apache.solr.handler.dataimport.DataImportHandler.handleRequestBody(DataImportHandler.java:205)
   [junit4]   2> 		at org.apache.solr.handler.RequestHandlerBase.handleRequest(RequestHandlerBase.java:129)
   [junit4]   2> 		at org.apache.solr.core.SolrCore.execute(SolrCore.java:1561)
   [junit4]   2> 		at org.apache.solr.util.TestHarness.query(TestHarness.java:330)
   [junit4]   2> 		at org.apache.solr.handler.dataimport.AbstractDataImportHandlerTestCase.runFullImport(AbstractDataImportHandlerTestCase.java:96)
   [junit4]   2> 		at org.apache.solr.handler.dataimport.TestSqlEntityProcessorDelta3.add1document(TestSqlEntityProcessorDelta3.java:81)
   [junit4]   2> 		at org.apache.solr.handler.dataimport.TestSqlEntityProcessorDelta3.testCompositePk_FullImport(TestSqlEntityProcessorDelta3.java:92)
   [junit4]   2> 		at sun.reflect.NativeMethodAccessorImpl.invoke0(Native Method)
   [junit4]   2> 		at sun.reflect.NativeMethodAccessorImpl.invoke(NativeMethodAccessorImpl.java:57)
   [junit4]   2> 		at sun.reflect.DelegatingMethodAccessorImpl.invoke(DelegatingMethodAccessorImpl.java:43)
   [junit4]   2> 		at java.lang.reflect.Method.invoke(Method.java:601)
   [junit4]   2> 		at com.carrotsearch.randomizedtesting.RandomizedRunner.invoke(RandomizedRunner.java:1969)
   [junit4]   2> 		at com.carrotsearch.randomizedtesting.RandomizedRunner.access$1100(RandomizedRunner.java:132)
   [junit4]   2> 		at com.carrotsearch.randomizedtesting.RandomizedRunner$6.evaluate(RandomizedRunner.java:814)
   [junit4]   2> 		at com.carrotsearch.randomizedtesting.RandomizedRunner$7.evaluate(RandomizedRunner.java:875)
   [junit4]   2> 		at com.carrotsearch.randomizedtesting.RandomizedRunner$8.evaluate(RandomizedRunner.java:889)
   [junit4]   2> 		at com.carrotsearch.randomizedtesting.rules.SystemPropertiesRestoreRule$1.evaluate(SystemPropertiesRestoreRule.java:53)
   [junit4]   2> 		at org.apache.lucene.util.TestRuleSetupTeardownChained$1.evaluate(TestRuleSetupTeardownChained.java:50)
   [junit4]   2> 		at org.apache.lucene.util.TestRuleFieldCacheSanity$1.evaluate(TestRuleFieldCacheSanity.java:32)
   [junit4]   2> 		at org.apache.lucene.util.AbstractBeforeAfterRule$1.evaluate(AbstractBeforeAfterRule.java:45)
   [junit4]   2> 		at com.carrotsearch.randomizedtesting.rules.SystemPropertiesInvariantRule$1.evaluate(SystemPropertiesInvariantRule.java:55)
   [junit4]   2> 		at org.apache.lucene.util.TestRuleReportUncaughtExceptions$1.evaluate(TestRuleReportUncaughtExceptions.java:68)
   [junit4]   2> 		at org.apache.lucene.util.TestRuleThreadAndTestName$1.evaluate(TestRuleThreadAndTestName.java:48)
   [junit4]   2> 		at org.apache.lucene.util.TestRuleMarkFailure$1.evaluate(TestRuleMarkFailure.java:48)
   [junit4]   2> 		at com.carrotsearch.randomizedtesting.RandomizedRunner.runSingleTest(RandomizedRunner.java:821)
   [junit4]   2> 		at com.carrotsearch.randomizedtesting.RandomizedRunner.access$700(RandomizedRunner.java:132)
   [junit4]   2> 		at com.carrotsearch.randomizedtesting.RandomizedRunner$3$1.run(RandomizedRunner.java:669)
   [junit4]   2> 		at com.carrotsearch.randomizedtesting.RandomizedRunner$3.evaluate(RandomizedRunner.java:695)
   [junit4]   2> 		at com.carrotsearch.randomizedtesting.RandomizedRunner$4.evaluate(RandomizedRunner.java:734)
   [junit4]   2> 		at com.carrotsearch.randomizedtesting.RandomizedRunner$5.evaluate(RandomizedRunner.java:745)
   [junit4]   2> 		at com.carrotsearch.randomizedtesting.rules.SystemPropertiesRestoreRule$1.evaluate(SystemPropertiesRestoreRule.java:53)
   [junit4]   2> 		at org.apache.lucene.util.AbstractBeforeAfterRule$1.evaluate(AbstractBeforeAfterRule.java:45)
   [junit4]   2> 		at org.apache.lucene.util.TestRuleReportUncaughtExceptions$1.evaluate(TestRuleReportUncaughtExceptions.java:68)
   [junit4]   2> 		at org.apache.lucene.util.TestRuleStoreClassName$1.evaluate(TestRuleStoreClassName.java:38)
   [junit4]   2> 		at org.apache.lucene.util.TestRuleIcuHack$1.evaluate(TestRuleIcuHack.java:51)
   [junit4]   2> 		at com.carrotsearch.randomizedtesting.rules.SystemPropertiesInvariantRule$1.evaluate(SystemPropertiesInvariantRule.java:55)
   [junit4]   2> 		at org.apache.lucene.util.TestRuleNoInstanceHooksOverrides$1.evaluate(TestRuleNoInstanceHooksOverrides.java:53)
   [junit4]   2> 		at org.apache.lucene.util.TestRuleNoStaticHooksShadowing$1.evaluate(TestRuleNoStaticHooksShadowing.java:52)
   [junit4]   2> 		at org.apache.lucene.util.TestRuleAssertionsRequired$1.evaluate(TestRuleAssertionsRequired.java:36)
   [junit4]   2> 		at org.apache.lucene.util.TestRuleMarkFailure$1.evaluate(TestRuleMarkFailure.java:48)
   [junit4]   2> 		at org.apache.lucene.util.TestRuleIgnoreTestSuites$1.evaluate(TestRuleIgnoreTestSuites.java:56)
   [junit4]   2> 		at com.carrotsearch.randomizedtesting.RandomizedRunner.runSuite(RandomizedRunner.java:605)
   [junit4]   2> 		at com.carrotsearch.randomizedtesting.RandomizedRunner.access$400(RandomizedRunner.java:132)
   [junit4]   2> 		at com.carrotsearch.randomizedtesting.RandomizedRunner$2.run(RandomizedRunner.java:551)
   [junit4]   2> 	
   [junit4]   2> 615 T89 C12 oasu.DirectUpdateHandler2.rollback start rollback{flags=0,version=0}
   [junit4]   2> 617 T89 C12 oashd.SolrWriter.rollback SEVERE Exception while solr rollback. org.apache.lucene.index.IndexNotFoundException: no segments* file found in MockDirWrapper(org.apache.lucene.store.RAMDirectory@3922d60 lockFactory=org.apache.lucene.store.NativeFSLockFactory@699cb714): files: []
   [junit4]   2> 	at org.apache.lucene.index.SegmentInfos$FindSegmentsFile.run(SegmentInfos.java:710)
   [junit4]   2> 	at org.apache.lucene.index.SegmentInfos$FindSegmentsFile.run(SegmentInfos.java:600)
   [junit4]   2> 	at org.apache.lucene.index.SegmentInfos.read(SegmentInfos.java:326)
   [junit4]   2> 	at org.apache.lucene.index.IndexWriter.<init>(IndexWriter.java:641)
   [junit4]   2> 	at org.apache.solr.update.SolrIndexWriter.<init>(SolrIndexWriter.java:58)
   [junit4]   2> 	at org.apache.solr.update.DefaultSolrCoreState.createMainIndexWriter(DefaultSolrCoreState.java:112)
   [junit4]   2> 	at org.apache.solr.update.DefaultSolrCoreState.newIndexWriter(DefaultSolrCoreState.java:62)
   [junit4]   2> 	at org.apache.solr.update.DefaultSolrCoreState.rollbackIndexWriter(DefaultSolrCoreState.java:107)
   [junit4]   2> 	at org.apache.solr.update.DirectUpdateHandler2.rollbackWriter(DirectUpdateHandler2.java:145)
   [junit4]   2> 	at org.apache.solr.update.DirectUpdateHandler2.rollback(DirectUpdateHandler2.java:505)
   [junit4]   2> 	at org.apache.solr.update.processor.RunUpdateProcessor.processRollback(RunUpdateProcessorFactory.java:93)
   [junit4]   2> 	at org.apache.solr.update.processor.UpdateRequestProcessor.processRollback(UpdateRequestProcessor.java:72)
   [junit4]   2> 	at org.apache.solr.update.processor.UpdateRequestProcessor.processRollback(UpdateRequestProcessor.java:72)
   [junit4]   2> 	at org.apache.solr.handler.dataimport.AbstractDataImportHandlerTestCase$TestUpdateRequestProcessor.processRollback(AbstractDataImportHandlerTestCase.java:376)
   [junit4]   2> 	at org.apache.solr.handler.dataimport.SolrWriter.rollback(SolrWriter.java:117)
   [junit4]   2> 	at org.apache.solr.handler.dataimport.DocBuilder.rollback(DocBuilder.java:319)
   [junit4]   2> 	at org.apache.solr.handler.dataimport.DataImporter.doFullImport(DataImporter.java:338)
   [junit4]   2> 	at org.apache.solr.handler.dataimport.DataImporter.runCmd(DataImporter.java:399)
   [junit4]   2> 	at org.apache.solr.handler.dataimport.DataImportHandler.handleRequestBody(DataImportHandler.java:205)
   [junit4]   2> 	at org.apache.solr.handler.RequestHandlerBase.handleRequest(RequestHandlerBase.java:129)
   [junit4]   2> 	at org.apache.solr.core.SolrCore.execute(SolrCore.java:1561)
   [junit4]   2> 	at org.apache.solr.util.TestHarness.query(TestHarness.java:330)
   [junit4]   2> 	at org.apache.solr.handler.dataimport.AbstractDataImportHandlerTestCase.runFullImport(AbstractDataImportHandlerTestCase.java:96)
   [junit4]   2> 	at org.apache.solr.handler.dataimport.TestSqlEntityProcessorDelta3.add1document(TestSqlEntityProcessorDelta3.java:81)
   [junit4]   2> 	at org.apache.solr.handler.dataimport.TestSqlEntityProcessorDelta3.testCompositePk_FullImport(TestSqlEntityProcessorDelta3.java:92)
   [junit4]   2> 	at sun.reflect.NativeMethodAccessorImpl.invoke0(Native Method)
   [junit4]   2> 	at sun.reflect.NativeMethodAccessorImpl.invoke(NativeMethodAccessorImpl.java:57)
   [junit4]   2> 	at sun.reflect.DelegatingMethodAccessorImpl.invoke(DelegatingMethodAccessorImpl.java:43)
   [junit4]   2> 	at java.lang.reflect.Method.invoke(Method.java:601)
   [junit4]   2> 	at com.carrotsearch.randomizedtesting.RandomizedRunner.invoke(RandomizedRunner.java:1969)
   [junit4]   2> 	at com.carrotsearch.randomizedtesting.RandomizedRunner.access$1100(RandomizedRunner.java:132)
   [junit4]   2> 	at com.carrotsearch.randomizedtesting.RandomizedRunner$6.evaluate(RandomizedRunner.java:814)
   [junit4]   2> 	at com.carrotsearch.randomizedtesting.RandomizedRunner$7.evaluate(RandomizedRunner.java:875)
   [junit4]   2> 	at com.carrotsearch.randomizedtesting.RandomizedRunner$8.evaluate(RandomizedRunner.java:889)
   [junit4]   2> 	at com.carrotsearch.randomizedtesting.rules.SystemPropertiesRestoreRule$1.evaluate(SystemPropertiesRestoreRule.java:53)
   [junit4]   2> 	at org.apache.lucene.util.TestRuleSetupTeardownChained$1.evaluate(TestRuleSetupTeardownChained.java:50)
   [junit4]   2> 	at org.apache.lucene.util.TestRuleFieldCacheSanity$1.evaluate(TestRuleFieldCacheSanity.java:32)
   [junit4]   2> 	at org.apache.lucene.util.AbstractBeforeAfterRule$1.evaluate(AbstractBeforeAfterRule.java:45)
   [junit4]   2> 	at com.carrotsearch.randomizedtesting.rules.SystemPropertiesInvariantRule$1.evaluate(SystemPropertiesInvariantRule.java:55)
   [junit4]   2> 	at org.apache.lucene.util.TestRuleReportUncaughtExceptions$1.evaluate(TestRuleReportUncaughtExceptions.java:68)
   [junit4]   2> 	at org.apache.lucene.util.TestRuleThreadAndTestName$1.evaluate(TestRuleThreadAndTestName.java:48)
   [junit4]   2> 	at org.apache.lucene.util.TestRuleMarkFailure$1.evaluate(TestRuleMarkFailure.java:48)
   [junit4]   2> 	at com.carrotsearch.randomizedtesting.RandomizedRunner.runSingleTest(RandomizedRunner.java:821)
   [junit4]   2> 	at com.carrotsearch.randomizedtesting.RandomizedRunner.access$700(RandomizedRunner.java:132)
   [junit4]   2> 	at com.carrotsearch.randomizedtesting.RandomizedRunner$3$1.run(RandomizedRunner.java:669)
   [junit4]   2> 	at com.carrotsearch.randomizedtesting.RandomizedRunner$3.evaluate(RandomizedRunner.java:695)
   [junit4]   2> 	at com.carrotsearch.randomizedtesting.RandomizedRunner$4.evaluate(RandomizedRunner.java:734)
   [junit4]   2> 	at com.carrotsearch.randomizedtesting.RandomizedRunner$5.evaluate(RandomizedRunner.java:745)
   [junit4]   2> 	at com.carrotsearch.randomizedtesting.rules.SystemPropertiesRestoreRule$1.evaluate(SystemPropertiesRestoreRule.java:53)
   [junit4]   2> 	at org.apache.lucene.util.AbstractBeforeAfterRule$1.evaluate(AbstractBeforeAfterRule.java:45)
   [junit4]   2> 	at org.apache.lucene.util.TestRuleReportUncaughtExceptions$1.evaluate(TestRuleReportUncaughtExceptions.java:68)
   [junit4]   2> 	at org.apache.lucene.util.TestRuleStoreClassName$1.evaluate(TestRuleStoreClassName.java:38)
   [junit4]   2> 	at org.apache.lucene.util.TestRuleIcuHack$1.evaluate(TestRuleIcuHack.java:51)
   [junit4]   2> 	at com.carrotsearch.randomizedtesting.rules.SystemPropertiesInvariantRule$1.evaluate(SystemPropertiesInvariantRule.java:55)
   [junit4]   2> 	at org.apache.lucene.util.TestRuleNoInstanceHooksOverrides$1.evaluate(TestRuleNoInstanceHooksOverrides.java:53)
   [junit4]   2> 	at org.apache.lucene.util.TestRuleNoStaticHooksShadowing$1.evaluate(TestRuleNoStaticHooksShadowing.java:52)
   [junit4]   2> 	at org.apache.lucene.util.TestRuleAssertionsRequired$1.evaluate(TestRuleAssertionsRequired.java:36)
   [junit4]   2> 	at org.apache.lucene.util.TestRuleMarkFailure$1.evaluate(TestRuleMarkFailure.java:48)
   [junit4]   2> 	at org.apache.lucene.util.TestRuleIgnoreTestSuites$1.evaluate(TestRuleIgnoreTestSuites.java:56)
   [junit4]   2> 	at com.carrotsearch.randomizedtesting.RandomizedRunner.runSuite(RandomizedRunner.java:605)
   [junit4]   2> 	at com.carrotsearch.randomizedtesting.RandomizedRunner.access$400(RandomizedRunner.java:132)
   [junit4]   2> 	at com.carrotsearch.randomizedtesting.RandomizedRunner$2.run(RandomizedRunner.java:551)
   [junit4]   2> 
   [junit4]   2> 619 T89 C12 REQ [collection1] webapp=null path=null params={clean=true&dataConfig=<dataConfig>++<dataSource++type%3D"MockDataSource"/>%0a++<document>++++<entity+name%3D"parent"+pk%3D"parent_id"+rootEntity%3D"false"++++++++++++query%3D"select+*+from+parent"++++++++++++deltaQuery%3D"select+parent_id+from+parent+where+last_modified+>+NOW"++++++++++++deltaImportQuery%3D"select+*+from+parent+where+last_modified+>+NOW+AND+parent_id%3D${dih.delta.parent_id}">++++++<field+column%3D"desc"+name%3D"desc"/>++++++<entity+name%3D"child"+pk%3D"id"+rootEntity%3D"true"++++++++++++++query%3D"select+*+from+child"++++++++++++++deletedPkQuery%3D"select+id+from+child+where+last_modified+>+NOW+AND+deleted%3D'true'"++++++++++++++deltaQuery%3D"select+id+from+child+where+last_modified+>+NOW"++++++++++++++parentDeltaQuery%3D"select+parent_id+from+child+where+id%3D${child.id}"++++++++++++++deltaImportQuery%3D"select+*+from+child+where+last_modified+>+NOW+AND+parent_id%3D${dih.delta.parent_id}">++++++++<field+column%3D"id"+name%3D"id"+/>++++++</entity>++++</entity>++</document></dataConfig>%0a&commit=true&command=full-import&debug=on} status=0 QTime=8 
   [junit4]   2> 620 T89 C12 REQ [collection1] webapp=null path=null params={start=0&q=*:*+OR+add1document&qt=standard&rows=20&version=2.2} hits=0 status=0 QTime=0 
   [junit4]   2> 622 T89 oas.SolrTestCaseJ4.assertQ SEVERE REQUEST FAILED: xpath=//*[@numFound='1']
   [junit4]   2> 		xml response was: <?xml version="1.0" encoding="UTF-8"?>
   [junit4]   2> 	<response>
   [junit4]   2> 	<lst name="responseHeader"><int name="status">0</int><int name="QTime">0</int><lst name="params"><str name="start">0</str><str name="q">*:* OR add1document</str><str name="qt">standard</str><str name="rows">20</str><str name="version">2.2</str></lst></lst><result name="response" numFound="0" start="0"></result>
   [junit4]   2> 	</response>
   [junit4]   2> 	
   [junit4]   2> 		request was:start=0&q=*:*+OR+add1document&qt=standard&rows=20&version=2.2
   [junit4]   2> 623 T89 oasc.SolrException.log SEVERE REQUEST FAILED: start=0&q=*:*+OR+add1document&qt=standard&rows=20&version=2.2:java.lang.RuntimeException: REQUEST FAILED: xpath=//*[@numFound='1']
   [junit4]   2> 		xml response was: <?xml version="1.0" encoding="UTF-8"?>
   [junit4]   2> 	<response>
   [junit4]   2> 	<lst name="responseHeader"><int name="status">0</int><int name="QTime">0</int><lst name="params"><str name="start">0</str><str name="q">*:* OR add1document</str><str name="qt">standard</str><str name="rows">20</str><str name="version">2.2</str></lst></lst><result name="response" numFound="0" start="0"></result>
   [junit4]   2> 	</response>
   [junit4]   2> 	
   [junit4]   2> 		request was:start=0&q=*:*+OR+add1document&qt=standard&rows=20&version=2.2
   [junit4]   2> 		at org.apache.solr.SolrTestCaseJ4.assertQ(SolrTestCaseJ4.java:454)
   [junit4]   2> 		at org.apache.solr.SolrTestCaseJ4.assertQ(SolrTestCaseJ4.java:428)
   [junit4]   2> 		at org.apache.solr.handler.dataimport.TestSqlEntityProcessorDelta3.add1document(TestSqlEntityProcessorDelta3.java:83)
   [junit4]   2> 		at org.apache.solr.handler.dataimport.TestSqlEntityProcessorDelta3.testCompositePk_FullImport(TestSqlEntityProcessorDelta3.java:92)
   [junit4]   2> 		at sun.reflect.NativeMethodAccessorImpl.invoke0(Native Method)
   [junit4]   2> 		at sun.reflect.NativeMethodAccessorImpl.invoke(NativeMethodAccessorImpl.java:57)
   [junit4]   2> 		at sun.reflect.DelegatingMethodAccessorImpl.invoke(DelegatingMethodAccessorImpl.java:43)
   [junit4]   2> 		at java.lang.reflect.Method.invoke(Method.java:601)
   [junit4]   2> 		at com.carrotsearch.randomizedtesting.RandomizedRunner.invoke(RandomizedRunner.java:1969)
   [junit4]   2> 		at com.carrotsearch.randomizedtesting.RandomizedRunner.access$1100(RandomizedRunner.java:132)
   [junit4]   2> 		at com.carrotsearch.randomizedtesting.RandomizedRunner$6.evaluate(RandomizedRunner.java:814)
   [junit4]   2> 		at com.carrotsearch.randomizedtesting.RandomizedRunner$7.evaluate(RandomizedRunner.java:875)
   [junit4]   2> 		at com.carrotsearch.randomizedtesting.RandomizedRunner$8.evaluate(RandomizedRunner.java:889)
   [junit4]   2> 		at com.carrotsearch.randomizedtesting.rules.SystemPropertiesRestoreRule$1.evaluate(SystemPropertiesRestoreRule.java:53)
   [junit4]   2> 		at org.apache.lucene.util.TestRuleSetupTeardownChained$1.evaluate(TestRuleSetupTeardownChained.java:50)
   [junit4]   2> 		at org.apache.lucene.util.TestRuleFieldCacheSanity$1.evaluate(TestRuleFieldCacheSanity.java:32)
   [junit4]   2> 		at org.apache.lucene.util.AbstractBeforeAfterRule$1.evaluate(AbstractBeforeAfterRule.java:45)
   [junit4]   2> 		at com.carrotsearch.randomizedtesting.rules.SystemPropertiesInvariantRule$1.evaluate(SystemPropertiesInvariantRule.java:55)
   [junit4]   2> 		at org.apache.lucene.util.TestRuleReportUncaughtExceptions$1.evaluate(TestRuleReportUncaughtExceptions.java:68)
   [junit4]   2> 		at org.apache.lucene.util.TestRuleThreadAndTestName$1.evaluate(TestRuleThreadAndTestName.java:48)
   [junit4]   2> 		at org.apache.lucene.util.TestRuleMarkFailure$1.evaluate(TestRuleMarkFailure.java:48)
   [junit4]   2> 		at com.carrotsearch.randomizedtesting.RandomizedRunner.runSingleTest(RandomizedRunner.java:821)
   [junit4]   2> 		at com.carrotsearch.randomizedtesting.RandomizedRunner.access$700(RandomizedRunner.java:132)
   [junit4]   2> 		at com.carrotsearch.randomizedtesting.RandomizedRunner$3$1.run(RandomizedRunner.java:669)
   [junit4]   2> 		at com.carrotsearch.randomizedtesting.RandomizedRunner$3.evaluate(RandomizedRunner.java:695)
   [junit4]   2> 		at com.carrotsearch.randomizedtesting.RandomizedRunner$4.evaluate(RandomizedRunner.java:734)
   [junit4]   2> 		at com.carrotsearch.randomizedtesting.RandomizedRunner$5.evaluate(RandomizedRunner.java:745)
   [junit4]   2> 		at com.carrotsearch.randomizedtesting.rules.SystemPropertiesRestoreRule$1.evaluate(SystemPropertiesRestoreRule.java:53)
   [junit4]   2> 		at org.apache.lucene.util.AbstractBeforeAfterRule$1.evaluate(AbstractBeforeAfterRule.java:45)
   [junit4]   2> 		at org.apache.lucene.util.TestRuleReportUncaughtExceptions$1.evaluate(TestRuleReportUncaughtExceptions.java:68)
   [junit4]   2> 		at org.apache.lucene.util.TestRuleStoreClassName$1.evaluate(TestRuleStoreClassName.java:38)
   [junit4]   2> 		at org.apache.lucene.util.TestRuleIcuHack$1.evaluate(TestRuleIcuHack.java:51)
   [junit4]   2> 		at com.carrotsearch.randomizedtesting.rules.SystemPropertiesInvariantRule$1.evaluate(SystemPropertiesInvariantRule.java:55)
   [junit4]   2> 		at org.apache.lucene.util.TestRuleNoInstanceHooksOverrides$1.evaluate(TestRuleNoInstanceHooksOverrides.java:53)
   [junit4]   2> 		at org.apache.lucene.util.TestRuleNoStaticHooksShadowing$1.evaluate(TestRuleNoStaticHooksShadowing.java:52)
   [junit4]   2> 		at org.apache.lucene.util.TestRuleAssertionsRequired$1.evaluate(TestRuleAssertionsRequired.java:36)
   [junit4]   2> 		at org.apache.lucene.util.TestRuleMarkFailure$1.evaluate(TestRuleMarkFailure.java:48)
   [junit4]   2> 		at org.apache.lucene.util.TestRuleIgnoreTestSuites$1.evaluate(TestRuleIgnoreTestSuites.java:56)
   [junit4]   2> 		at com.carrotsearch.randomizedtesting.RandomizedRunner.runSuite(RandomizedRunner.java:605)
   [junit4]   2> 		at com.carrotsearch.randomizedtesting.RandomizedRunner.access$400(RandomizedRunner.java:132)
   [junit4]   2> 		at com.carrotsearch.randomizedtesting.RandomizedRunner$2.run(RandomizedRunner.java:551)
   [junit4]   2> 	
   [junit4]   2> 624 T89 oashd.AbstractDataImportHandlerTestCase.tearDown Looking for dataimport.properties at: /mnt/ssd/jenkins/workspace/Lucene-Solr-4.x-Linux-Java7-64/checkout/solr/build/contrib/solr-dataimporthandler/test/J0/solr/collection1/conf/dataimport.properties
   [junit4]   2> 624 T89 oas.SolrTestCaseJ4.tearDown ###Ending testCompositePk_FullImport
   [junit4]   2> NOTE: reproduce with: ant test  -Dtestcase=TestSqlEntityProcessorDelta3 -Dtests.method=testCompositePk_FullImport -Dtests.seed=8ECAEA0164565F55 -Dtests.multiplier=3 -Dtests.locale=sr -Dtests.timezone=Asia/Colombo -Dargs="-Dfile.encoding=UTF-8"
   [junit4]   2>
   [junit4] ERROR   0.02s J0 | TestSqlEntityProcessorDelta3.testCompositePk_DeltaImport_delete
   [junit4]    > Throwable #1: org.apache.solr.common.SolrException: org.apache.lucene.store.AlreadyClosedException: this IndexWriter is closed
   [junit4]    > 	at __randomizedtesting.SeedInfo.seed([8ECAEA0164565F55:AFF71C1F012B7739]:0)
   [junit4]    > 	at org.apache.solr.util.TestHarness.update(TestHarness.java:233)
   [junit4]    > 	at org.apache.solr.util.TestHarness.checkUpdateStatus(TestHarness.java:277)
   [junit4]    > 	at org.apache.solr.util.TestHarness.validateUpdate(TestHarness.java:247)
   [junit4]    > 	at org.apache.solr.SolrTestCaseJ4.checkUpdateU(SolrTestCaseJ4.java:415)
   [junit4]    > 	at org.apache.solr.SolrTestCaseJ4.assertU(SolrTestCaseJ4.java:394)
   [junit4]    > 	at org.apache.solr.SolrTestCaseJ4.assertU(SolrTestCaseJ4.java:388)
   [junit4]    > 	at org.apache.solr.SolrTestCaseJ4.clearIndex(SolrTestCaseJ4.java:760)
   [junit4]    > 	at org.apache.solr.handler.dataimport.TestSqlEntityProcessorDelta3.setUp(TestSqlEntityProcessorDelta3.java:67)
   [junit4]    > 	at sun.reflect.NativeMethodAccessorImpl.invoke0(Native Method)
   [junit4]    > 	at sun.reflect.NativeMethodAccessorImpl.invoke(NativeMethodAccessorImpl.java:57)
   [junit4]    > 	at sun.reflect.DelegatingMethodAccessorImpl.invoke(DelegatingMethodAccessorImpl.java:43)
   [junit4]    > 	at java.lang.reflect.Method.invoke(Method.java:601)
   [junit4]    > 	at com.carrotsearch.randomizedtesting.RandomizedRunner.invoke(RandomizedRunner.java:1969)
   [junit4]    > 	at com.carrotsearch.randomizedtesting.RandomizedRunner.access$1100(RandomizedRunner.java:132)
   [junit4]    > 	at com.carrotsearch.randomizedtesting.RandomizedRunner$7.evaluate(RandomizedRunner.java:873)
   [junit4]    > 	at com.carrotsearch.randomizedtesting.RandomizedRunner$8.evaluate(RandomizedRunner.java:889)
   [junit4]    > 	at com.carrotsearch.randomizedtesting.rules.SystemPropertiesRestoreRule$1.evaluate(SystemPropertiesRestoreRule.java:53)
   [junit4]    > 	at org.apache.lucene.util.TestRuleSetupTeardownChained$1.evaluate(TestRuleSetupTeardownChained.java:50)
   [junit4]    > 	at org.apache.lucene.util.TestRuleFieldCacheSanity$1.evaluate(TestRuleFieldCacheSanity.java:32)
   [junit4]    > 	at org.apache.lucene.util.AbstractBeforeAfterRule$1.evaluate(AbstractBeforeAfterRule.java:45)
   [junit4]    > 	at com.carrotsearch.randomizedtesting.rules.SystemPropertiesInvariantRule$1.evaluate(SystemPropertiesInvariantRule.java:55)
   [junit4]    > 	at org.apache.lucene.util.TestRuleReportUncaughtExceptions$1.evaluate(TestRuleReportUncaughtExceptions.java:68)
   [junit4]    > 	at org.apache.lucene.util.TestRuleThreadAndTestName$1.evaluate(TestRuleThreadAndTestName.java:48)
   [junit4]    > 	at org.apache.lucene.util.TestRuleMarkFailure$1.evaluate(TestRuleMarkFailure.java:48)
   [junit4]    > 	at com.carrotsearch.randomizedtesting.RandomizedRunner.runSingleTest(RandomizedRunner.java:821)
   [junit4]    > 	at com.carrotsearch.randomizedtesting.RandomizedRunner.access$700(RandomizedRunner.java:132)
   [junit4]    > 	at com.carrotsearch.randomizedtesting.RandomizedRunner$3$1.run(RandomizedRunner.java:669)
   [junit4]    > 	at com.carrotsearch.randomizedtesting.RandomizedRunner$3.evaluate(RandomizedRunner.java:695)
   [junit4]    > 	at com.carrotsearch.randomizedtesting.RandomizedRunner$4.evaluate(RandomizedRunner.java:734)
   [junit4]    > 	at com.carrotsearch.randomizedtesting.RandomizedRunner$5.evaluate(RandomizedRunner.java:745)
   [junit4]    > 	at com.carrotsearch.randomizedtesting.rules.SystemPropertiesRestoreRule$1.evaluate(SystemPropertiesRestoreRule.java:53)
   [junit4]    > 	at org.apache.lucene.util.AbstractBeforeAfterRule$1.evaluate(AbstractBeforeAfterRule.java:45)
   [junit4]    > 	at org.apache.lucene.util.TestRuleReportUncaughtExceptions$1.evaluate(TestRuleReportUncaughtExceptions.java:68)
   [junit4]    > 	at org.apache.lucene.util.TestRuleStoreClassName$1.evaluate(TestRuleStoreClassName.java:38)
   [junit4]    > 	at org.apache.lucene.util.TestRuleIcuHack$1.evaluate(TestRuleIcuHack.java:51)
   [junit4]    > 	at com.carrotsearch.randomizedtesting.rules.SystemPropertiesInvariantRule$1.evaluate(SystemPropertiesInvariantRule.java:55)
   [junit4]    > 	at org.apache.lucene.util.TestRuleNoInstanceHooksOverrides$1.evaluate(TestRuleNoInstanceHooksOverrides.java:53)
   [junit4]    > 	at org.apache.lucene.util.TestRuleNoStaticHooksShadowing$1.evaluate(TestRuleNoStaticHooksShadowing.java:52)
   [junit4]    > 	at org.apache.lucene.util.TestRuleAssertionsRequired$1.evaluate(TestRuleAssertionsRequired.java:36)
   [junit4]    > 	at org.apache.lucene.util.TestRuleMarkFailure$1.evaluate(TestRuleMarkFailure.java:48)
   [junit4]    > 	at org.apache.lucene.util.TestRuleIgnoreTestSuites$1.evaluate(TestRuleIgnoreTestSuites.java:56)
   [junit4]    > 	at com.carrotsearch.randomizedtesting.RandomizedRunner.runSuite(RandomizedRunner.java:605)
   [junit4]    > 	at com.carrotsearch.randomizedtesting.RandomizedRunner.access$400(RandomizedRunner.java:132)
   [junit4]    > 	at com.carrotsearch.randomizedtesting.RandomizedRunner$2.run(RandomizedRunner.java:551)
   [junit4]    > Caused by: org.apache.lucene.store.AlreadyClosedException: this IndexWriter is closed
   [junit4]    > 	at org.apache.lucene.index.IndexWriter.ensureOpen(IndexWriter.java:554)
   [junit4]    > 	at org.apache.lucene.index.IndexWriter.ensureOpen(IndexWriter.java:559)
   [junit4]    > 	at org.apache.lucene.index.IndexWriter.deleteAll(IndexWriter.java:1890)
   [junit4]    > 	at org.apache.solr.update.DirectUpdateHandler2.deleteAll(DirectUpdateHandler2.java:140)
   [junit4]    > 	at org.apache.solr.update.DirectUpdateHandler2.deleteByQuery(DirectUpdateHandler2.java:292)
   [junit4]    > 	at org.apache.solr.update.processor.RunUpdateProcessor.processDelete(RunUpdateProcessorFactory.java:67)
   [junit4]    > 	at org.apache.solr.update.processor.UpdateRequestProcessor.processDelete(UpdateRequestProcessor.java:55)
   [junit4]    > 	at org.apache.solr.update.processor.DistributedUpdateProcessor.doDeleteByQuery(DistributedUpdateProcessor.java:719)
   [junit4]    > 	at org.apache.solr.update.processor.DistributedUpdateProcessor.processDelete(DistributedUpdateProcessor.java:592)
   [junit4]    > 	at org.apache.solr.update.processor.UpdateRequestProcessor.processDelete(UpdateRequestProcessor.java:55)
   [junit4]    > 	at org.apache.solr.handler.dataimport.AbstractDataImportHandlerTestCase$TestUpdateRequestProcessor.processDelete(AbstractDataImportHandlerTestCase.java:364)
   [junit4]    > 	at org.apache.solr.handler.loader.XMLLoader.processDelete(XMLLoader.java:333)
   [junit4]    > 	at org.apache.solr.handler.loader.XMLLoader.processUpdate(XMLLoader.java:264)
   [junit4]    > 	at org.apache.solr.handler.loader.XMLLoader.load(XMLLoader.java:158)
   [junit4]    > 	at org.apache.solr.handler.UpdateRequestHandler$1.load(UpdateRequestHandler.java:92)
   [junit4]    > 	at org.apache.solr.handler.ContentStreamHandlerBase.handleRequestBody(ContentStreamHandlerBase.java:74)
   [junit4]    > 	at org.apache.solr.handler.RequestHandlerBase.handleRequest(RequestHandlerBase.java:129)
   [junit4]    > 	at org.apache.solr.core.SolrCore.execute(SolrCore.java:1561)
   [junit4]    > 	at org.apache.solr.servlet.DirectSolrConnection.request(DirectSolrConnection.java:131)
   [junit4]    > 	at org.apache.solr.util.TestHarness.update(TestHarness.java:229)
   [junit4]    > 	... 43 more
   [junit4]    > 
   [junit4]   2> 657 T89 oas.SolrTestCaseJ4.setUp ###Starting testCompositePk_DeltaImport_delete
   [junit4]   2> 661 T89 C12 oasu.DirectUpdateHandler2.deleteAll [collection1] REMOVING ALL DOCUMENTS FROM INDEX
   [junit4]   2> 661 T89 C12 UPDATE [collection1] webapp=null path=null params={} {} 0 1
   [junit4]   2> 662 T89 C12 oasc.SolrException.log SEVERE org.apache.lucene.store.AlreadyClosedException: this IndexWriter is closed
   [junit4]   2> 		at org.apache.lucene.index.IndexWriter.ensureOpen(IndexWriter.java:554)
   [junit4]   2> 		at org.apache.lucene.index.IndexWriter.ensureOpen(IndexWriter.java:559)
   [junit4]   2> 		at org.apache.lucene.index.IndexWriter.deleteAll(IndexWriter.java:1890)
   [junit4]   2> 		at org.apache.solr.update.DirectUpdateHandler2.deleteAll(DirectUpdateHandler2.java:140)
   [junit4]   2> 		at org.apache.solr.update.DirectUpdateHandler2.deleteByQuery(DirectUpdateHandler2.java:292)
   [junit4]   2> 		at org.apache.solr.update.processor.RunUpdateProcessor.processDelete(RunUpdateProcessorFactory.java:67)
   [junit4]   2> 		at org.apache.solr.update.processor.UpdateRequestProcessor.processDelete(UpdateRequestProcessor.java:55)
   [junit4]   2> 		at org.apache.solr.update.processor.DistributedUpdateProcessor.doDeleteByQuery(DistributedUpdateProcessor.java:719)
   [junit4]   2> 		at org.apache.solr.update.processor.DistributedUpdateProcessor.processDelete(DistributedUpdateProcessor.java:592)
   [junit4]   2> 		at org.apache.solr.update.processor.UpdateRequestProcessor.processDelete(UpdateRequestProcessor.java:55)
   [junit4]   2> 		at org.apache.solr.handler.dataimport.AbstractDataImportHandlerTestCase$TestUpdateRequestProcessor.processDelete(AbstractDataImportHandlerTestCase.java:364)
   [junit4]   2> 		at org.apache.solr.handler.loader.XMLLoader.processDelete(XMLLoader.java:333)
   [junit4]   2> 		at org.apache.solr.handler.loader.XMLLoader.processUpdate(XMLLoader.java:264)
   [junit4]   2> 		at org.apache.solr.handler.loader.XMLLoader.load(XMLLoader.java:158)
   [junit4]   2> 		at org.apache.solr.handler.UpdateRequestHandler$1.load(UpdateRequestHandler.java:92)
   [junit4]   2> 		at org.apache.solr.handler.ContentStreamHandlerBase.handleRequestBody(ContentStreamHandlerBase.java:74)
   [junit4]   2> 		at org.apache.solr.handler.RequestHandlerBase.handleRequest(RequestHandlerBase.java:129)
   [junit4]   2> 		at org.apache.solr.core.SolrCore.execute(SolrCore.java:1561)
   [junit4]   2> 		at org.apache.solr.servlet.DirectSolrConnection.request(DirectSolrConnection.java:131)
   [junit4]   2> 		at org.apache.solr.util.TestHarness.update(TestHarness.java:229)
   [junit4]   2> 		at org.apache.solr.util.TestHarness.checkUpdateStatus(TestHarness.java:277)
   [junit4]   2> 		at org.apache.solr.util.TestHarness.validateUpdate(TestHarness.java:247)
   [junit4]   2> 		at org.apache.solr.SolrTestCaseJ4.checkUpdateU(SolrTestCaseJ4.java:415)
   [junit4]   2> 		at org.apache.solr.SolrTestCaseJ4.assertU(SolrTestCaseJ4.java:394)
   [junit4]   2> 		at org.apache.solr.SolrTestCaseJ4.assertU(SolrTestCaseJ4.java:388)
   [junit4]   2> 		at org.apache.solr.SolrTestCaseJ4.clearIndex(SolrTestCaseJ4.java:760)
   [junit4]   2> 		at org.apache.solr.handler.dataimport.TestSqlEntityProcessorDelta3.setUp(TestSqlEntityProcessorDelta3.java:67)
   [junit4]   2> 		at sun.reflect.NativeMethodAccessorImpl.invoke0(Native Method)
   [junit4]   2> 		at sun.reflect.NativeMethodAccessorImpl.invoke(NativeMethodAccessorImpl.java:57)
   [junit4]   2> 		at sun.reflect.DelegatingMethodAccessorImpl.invoke(DelegatingMethodAccessorImpl.java:43)
   [junit4]   2> 		at java.lang.reflect.Method.invoke(Method.java:601)
   [junit4]   2> 		at com.carrotsearch.randomizedtesting.RandomizedRunner.invoke(RandomizedRunner.java:1969)
   [junit4]   2> 		at com.carrotsearch.randomizedtesting.RandomizedRunner.access$1100(RandomizedRunner.java:132)
   [junit4]   2> 		at com.carrotsearch.randomizedtesting.RandomizedRunner$7.evaluate(RandomizedRunner.java:873)
   [junit4]   2> 		at com.carrotsearch.randomizedtesting.RandomizedRunner$8.evaluate(RandomizedRunner.java:889)
   [junit4]   2> 		at com.carrotsearch.randomizedtesting.rules.SystemPropertiesRestoreRule$1.evaluate(SystemPropertiesRestoreRule.java:53)
   [junit4]   2> 		at org.apache.lucene.util.TestRuleSetupTeardownChained$1.evaluate(TestRuleSetupTeardownChained.java:50)
   [junit4]   2> 		at org.apache.lucene.util.TestRuleFieldCacheSanity$1.evaluate(TestRuleFieldCacheSanity.java:32)
   [junit4]   2> 		at org.apache.lucene.util.AbstractBeforeAfterRule$1.evaluate(AbstractBeforeAfterRule.java:45)
   [junit4]   2> 		at com.carrotsearch.randomizedtesting.rules.SystemPropertiesInvariantRule$1.evaluate(SystemPropertiesInvariantRule.java:55)
   [junit4]   2> 		at org.apache.lucene.util.TestRuleReportUncaughtExceptions$1.evaluate(TestRuleReportUncaughtExceptions.java:68)
   [junit4]   2> 		at org.apache.lucene.util.TestRuleThreadAndTestName$1.evaluate(TestRuleThreadAndTestName.java:48)
   [junit4]   2> 		at org.apache.lucene.util.TestRuleMarkFailure$1.evaluate(TestRuleMarkFailure.java:48)
   [junit4]   2> 		at com.carrotsearch.randomizedtesting.RandomizedRunner.runSingleTest(RandomizedRunner.java:821)
   [junit4]   2> 		at com.carrotsearch.randomizedtesting.RandomizedRunner.access$700(RandomizedRunner.java:132)
   [junit4]   2> 		at com.carrotsearch.randomizedtesting.RandomizedRunner$3$1.run(RandomizedRunner.java:669)
   [junit4]   2> 		at com.carrotsearch.randomizedtesting.RandomizedRunner$3.evaluate(RandomizedRunner.java:695)
   [junit4]   2> 		at com.carrotsearch.randomizedtesting.RandomizedRunner$4.evaluate(RandomizedRunner.java:734)
   [junit4]   2> 		at com.carrotsearch.randomizedtesting.RandomizedRunner$5.evaluate(RandomizedRunner.java:745)
   [junit4]   2> 		at com.carrotsearch.randomizedtesting.rules.SystemPropertiesRestoreRule$1.evaluate(SystemPropertiesRestoreRule.java:53)
   [junit4]   2> 		at org.apache.lucene.util.AbstractBeforeAfterRule$1.evaluate(AbstractBeforeAfterRule.java:45)
   [junit4]   2> 		at org.apache.lucene.util.TestRuleReportUncaughtExceptions$1.evaluate(TestRuleReportUncaughtExceptions.java:68)
   [junit4]   2> 		at org.apache.lucene.util.TestRuleStoreClassName$1.evaluate(TestRuleStoreClassName.java:38)
   [junit4]   2> 		at org.apache.lucene.util.TestRuleIcuHack$1.evaluate(TestRuleIcuHack.java:51)
   [junit4]   2> 		at com.carrotsearch.randomizedtesting.rules.SystemPropertiesInvariantRule$1.evaluate(SystemPropertiesInvariantRule.java:55)
   [junit4]   2> 		at org.apache.lucene.util.TestRuleNoInstanceHooksOverrides$1.evaluate(TestRuleNoInstanceHooksOverrides.java:53)
   [junit4]   2> 		at org.apache.lucene.util.TestRuleNoStaticHooksShadowing$1.evaluate(TestRuleNoStaticHooksShadowing.java:52)
   [junit4]   2> 		at org.apache.lucene.util.TestRuleAssertionsRequired$1.evaluate(TestRuleAssertionsRequired.java:36)
   [junit4]   2> 		at org.apache.lucene.util.TestRuleMarkFailure$1.evaluate(TestRuleMarkFailure.java:48)
   [junit4]   2> 		at org.apache.lucene.util.TestRuleIgnoreTestSuites$1.evaluate(TestRuleIgnoreTestSuites.java:56)
   [junit4]   2> 		at com.carrotsearch.randomizedtesting.RandomizedRunner.runSuite(RandomizedRunner.java:605)
   [junit4]   2> 		at com.carrotsearch.randomizedtesting.RandomizedRunner.access$400(RandomizedRunner.java:132)
   [junit4]   2> 		at com.carrotsearch.randomizedtesting.RandomizedRunner$2.run(RandomizedRunner.java:551)
   [junit4]   2> 	
   [junit4]   2> 663 T89 oashd.AbstractDataImportHandlerTestCase.tearDown Looking for dataimport.properties at: /mnt/ssd/jenkins/workspace/Lucene-Solr-4.x-Linux-Java7-64/checkout/solr/build/contrib/solr-dataimporthandler/test/J0/solr/collection1/conf/dataimport.properties
   [junit4]   2> 663 T89 oas.SolrTestCaseJ4.tearDown ###Ending testCompositePk_DeltaImport_delete
   [junit4]   2> NOTE: reproduce with: ant test  -Dtestcase=TestSqlEntityProcessorDelta3 -Dtests.method=testCompositePk_DeltaImport_delete -Dtests.seed=8ECAEA0164565F55 -Dtests.multiplier=3 -Dtests.locale=sr -Dtests.timezone=Asia/Colombo -Dargs="-Dfile.encoding=UTF-8"
   [junit4]   2>
   [junit4] ERROR   0.07s J0 | TestSqlEntityProcessorDelta3.testCompositePk_DeltaImport_empty
   [junit4]    > Throwable #1: org.apache.solr.common.SolrException: org.apache.lucene.store.AlreadyClosedException: this IndexWriter is closed
   [junit4]    > 	at __randomizedtesting.SeedInfo.seed([8ECAEA0164565F55:49C9716EC5C30257]:0)
   [junit4]    > 	at org.apache.solr.util.TestHarness.update(TestHarness.java:233)
   [junit4]    > 	at org.apache.solr.util.TestHarness.checkUpdateStatus(TestHarness.java:277)
   [junit4]    > 	at org.apache.solr.util.TestHarness.validateUpdate(TestHarness.java:247)
   [junit4]    > 	at org.apache.solr.SolrTestCaseJ4.checkUpdateU(SolrTestCaseJ4.java:415)
   [junit4]    > 	at org.apache.solr.SolrTestCaseJ4.assertU(SolrTestCaseJ4.java:394)
   [junit4]    > 	at org.apache.solr.SolrTestCaseJ4.assertU(SolrTestCaseJ4.java:388)
   [junit4]    > 	at org.apache.solr.SolrTestCaseJ4.clearIndex(SolrTestCaseJ4.java:760)
   [junit4]    > 	at org.apache.solr.handler.dataimport.TestSqlEntityProcessorDelta3.setUp(TestSqlEntityProcessorDelta3.java:67)
   [junit4]    > 	at sun.reflect.NativeMethodAccessorImpl.invoke0(Native Method)
   [junit4]    > 	at sun.reflect.NativeMethodAccessorImpl.invoke(NativeMethodAccessorImpl.java:57)
   [junit4]    > 	at sun.reflect.DelegatingMethodAccessorImpl.invoke(DelegatingMethodAccessorImpl.java:43)
   [junit4]    > 	at java.lang.reflect.Method.invoke(Method.java:601)
   [junit4]    > 	at com.carrotsearch.randomizedtesting.RandomizedRunner.invoke(RandomizedRunner.java:1969)
   [junit4]    > 	at com.carrotsearch.randomizedtesting.RandomizedRunner.access$1100(RandomizedRunner.java:132)
   [junit4]    > 	at com.carrotsearch.randomizedtesting.RandomizedRunner$7.evaluate(RandomizedRunner.java:873)
   [junit4]    > 	at com.carrotsearch.randomizedtesting.RandomizedRunner$8.evaluate(RandomizedRunner.java:889)
   [junit4]    > 	at com.carrotsearch.randomizedtesting.rules.SystemPropertiesRestoreRule$1.evaluate(SystemPropertiesRestoreRule.java:53)
   [junit4]    > 	at org.apache.lucene.util.TestRuleSetupTeardownChained$1.evaluate(TestRuleSetupTeardownChained.java:50)
   [junit4]    > 	at org.apache.lucene.util.TestRuleFieldCacheSanity$1.evaluate(TestRuleFieldCacheSanity.java:32)
   [junit4]    > 	at org.apache.lucene.util.AbstractBeforeAfterRule$1.evaluate(AbstractBeforeAfterRule.java:45)
   [junit4]    > 	at com.carrotsearch.randomizedtesting.rules.SystemPropertiesInvariantRule$1.evaluate(SystemPropertiesInvariantRule.java:55)
   [junit4]    > 	at org.apache.lucene.util.TestRuleReportUncaughtExceptions$1.evaluate(TestRuleReportUncaughtExceptions.java:68)
   [junit4]    > 	at org.apache.lucene.util.TestRuleThreadAndTestName$1.evaluate(TestRuleThreadAndTestName.java:48)
   [junit4]    > 	at org.apache.lucene.util.TestRuleMarkFailure$1.evaluate(TestRuleMarkFailure.java:48)
   [junit4]    > 	at com.carrotsearch.randomizedtesting.RandomizedRunner.runSingleTest(RandomizedRunner.java:821)
   [junit4]    > 	at com.carrotsearch.randomizedtesting.RandomizedRunner.access$700(RandomizedRunner.java:132)
   [junit4]    > 	at com.carrotsearch.randomizedtesting.RandomizedRunner$3$1.run(RandomizedRunner.java:669)
   [junit4]    > 	at com.carrotsearch.randomizedtesting.RandomizedRunner$3.evaluate(RandomizedRunner.java:695)
   [junit4]    > 	at com.carrotsearch.randomizedtesting.RandomizedRunner$4.evaluate(RandomizedRunner.java:734)
   [junit4]    > 	at com.carrotsearch.randomizedtesting.RandomizedRunner$5.evaluate(RandomizedRunner.java:745)
   [junit4]    > 	at com.carrotsearch.randomizedtesting.rules.SystemPropertiesRestoreRule$1.evaluate(SystemPropertiesRestoreRule.java:53)
   [junit4]    > 	at org.apache.lucene.util.AbstractBeforeAfterRule$1.evaluate(AbstractBeforeAfterRule.java:45)
   [junit4]    > 	at org.apache.lucene.util.TestRuleReportUncaughtExceptions$1.evaluate(TestRuleReportUncaughtExceptions.java:68)
   [junit4]    > 	at org.apache.lucene.util.TestRuleStoreClassName$1.evaluate(TestRuleStoreClassName.java:38)
   [junit4]    > 	at org.apache.lucene.util.TestRuleIcuHack$1.evaluate(TestRuleIcuHack.java:51)
   [junit4]    > 	at com.carrotsearch.randomizedtesting.rules.SystemPropertiesInvariantRule$1.evaluate(SystemPropertiesInvariantRule.java:55)
   [junit4]    > 	at org.apache.lucene.util.TestRuleNoInstanceHooksOverrides$1.evaluate(TestRuleNoInstanceHooksOverrides.java:53)
   [junit4]    > 	at org.apache.lucene.util.TestRuleNoStaticHooksShadowing$1.evaluate(TestRuleNoStaticHooksShadowing.java:52)
   [junit4]    > 	at org.apache.lucene.util.TestRuleAssertionsRequired$1.evaluate(TestRuleAssertionsRequired.java:36)
   [junit4]    > 	at org.apache.lucene.util.TestRuleMarkFailure$1.evaluate(TestRuleMarkFailure.java:48)
   [junit4]    > 	at org.apache.lucene.util.TestRuleIgnoreTestSuites$1.evaluate(TestRuleIgnoreTestSuites.java:56)
   [junit4]    > 	at com.carrotsearch.randomizedtesting.RandomizedRunner.runSuite(RandomizedRunner.java:605)
   [junit4]    > 	at com.carrotsearch.randomizedtesting.RandomizedRunner.access$400(RandomizedRunner.java:132)
   [junit4]    > 	at com.carrotsearch.randomizedtesting.RandomizedRunner$2.run(RandomizedRunner.java:551)
   [junit4]    > Caused by: org.apache.lucene.store.AlreadyClosedException: this IndexWriter is closed
   [junit4]    > 	at org.apache.lucene.index.IndexWriter.ensureOpen(IndexWriter.java:554)
   [junit4]    > 	at org.apache.lucene.index.IndexWriter.ensureOpen(IndexWriter.java:559)
   [junit4]    > 	at org.apache.lucene.index.IndexWriter.deleteAll(IndexWriter.java:1890)
   [junit4]    > 	at org.apache.solr.update.DirectUpdateHandler2.deleteAll(DirectUpdateHandler2.java:140)
   [junit4]    > 	at org.apache.solr.update.DirectUpdateHandler2.deleteByQuery(DirectUpdateHandler2.java:292)
   [junit4]    > 	at org.apache.solr.update.processor.RunUpdateProcessor.processDelete(RunUpdateProcessorFactory.java:67)
   [junit4]    > 	at org.apache.solr.update.processor.UpdateRequestProcessor.processDelete(UpdateRequestProcessor.java:55)
   [junit4]    > 	at org.apache.solr.update.processor.DistributedUpdateProcessor.doDeleteByQuery(DistributedUpdateProcessor.java:719)
   [junit4]    > 	at org.apache.solr.update.processor.DistributedUpdateProcessor.processDelete(DistributedUpdateProcessor.java:592)
   [junit4]    > 	at org.apache.solr.update.processor.UpdateRequestProcessor.processDelete(UpdateRequestProcessor.java:55)
   [junit4]    > 	at org.apache.solr.handler.dataimport.AbstractDataImportHandlerTestCase$TestUpdateRequestProcessor.processDelete(AbstractDataImportHandlerTestCase.java:364)
   [junit4]    > 	at org.apache.solr.handler.loader.XMLLoader.processDelete(XMLLoader.java:333)
   [junit4]    > 	at org.apache.solr.handler.loader.XMLLoader.processUpdate(XMLLoader.java:264)
   [junit4]    > 	at org.apache.solr.handler.loader.XMLLoader.load(XMLLoader.java:158)
   [junit4]    > 	at org.apache.solr.handler.UpdateRequestHandler$1.load(UpdateRequestHandler.java:92)
   [junit4]    > 	at org.apache.solr.handler.ContentStreamHandlerBase.handleRequestBody(ContentStreamHandlerBase.java:74)
   [junit4]    > 	at org.apache.solr.handler.RequestHandlerBase.handleRequest(RequestHandlerBase.java:129)
   [junit4]    > 	at org.apache.solr.core.SolrCore.execute(SolrCore.java:1561)
   [junit4]    > 	at org.apache.solr.servlet.DirectSolrConnection.request(DirectSolrConnection.java:131)
   [junit4]    > 	at org.apache.solr.util.TestHarness.update(TestHarness.java:229)
   [junit4]    > 	... 43 more
   [junit4]    > 
   [junit4]   2> 677 T89 oas.SolrTestCaseJ4.setUp ###Starting testCompositePk_DeltaImport_empty
   [junit4]   2> 682 T89 C12 oasu.DirectUpdateHandler2.deleteAll [collection1] REMOVING ALL DOCUMENTS FROM INDEX
   [junit4]   2> 682 T89 C12 UPDATE [collection1] webapp=null path=null params={} {} 0 1
   [junit4]   2> 684 T89 C12 oasc.SolrException.log SEVERE org.apache.lucene.store.AlreadyClosedException: this IndexWriter is closed
   [junit4]   2> 		at org.apache.lucene.index.IndexWriter.ensureOpen(IndexWriter.java:554)
   [junit4]   2> 		at org.apache.lucene.index.IndexWriter.ensureOpen(IndexWriter.java:559)
   [junit4]   2> 		at org.apache.lucene.index.IndexWriter.deleteAll(IndexWriter.java:1890)
   [junit4]   2> 		at org.apache.solr.update.DirectUpdateHandler2.deleteAll(DirectUpdateHandler2.java:140)
   [junit4]   2> 		at org.apache.solr.update.DirectUpdateHandler2.deleteByQuery(DirectUpdateHandler2.java:292)
   [junit4]   2> 		at org.apache.solr.update.processor.RunUpdateProcessor.processDelete(RunUpdateProcessorFactory.java:67)
   [junit4]   2> 		at org.apache.solr.update.processor.UpdateRequestProcessor.processDelete(UpdateRequestProcessor.java:55)
   [junit4]   2> 		at org.apache.solr.update.processor.DistributedUpdateProcessor.doDeleteByQuery(DistributedUpdateProcessor.java:719)
   [junit4]   2> 		at org.apache.solr.update.processor.DistributedUpdateProcessor.processDelete(DistributedUpdateProcessor.java:592)
   [junit4]   2> 		at org.apache.solr.update.processor.UpdateRequestProcessor.processDelete(UpdateRequestProcessor.java:55)
   [junit4]   2> 		at org.apache.solr.handler.dataimport.AbstractDataImportHandlerTestCase$TestUpdateRequestProcessor.processDelete(AbstractDataImportHandlerTestCase.java:364)
   [junit4]   2> 		at org.apache.solr.handler.loader.XMLLoader.processDelete(XMLLoader.java:333)
   [junit4]   2> 		at org.apache.solr.handler.loader.XMLLoader.processUpdate(XMLLoader.java:264)
   [junit4]   2> 		at org.apache.solr.handler.loader.XMLLoader.load(XMLLoader.java:158)
   [junit4]   2> 		at org.apache.solr.handler.UpdateRequestHandler$1.load(UpdateRequestHandler.java:92)
   [junit4]   2> 		at org.apache.solr.handler.ContentStreamHandlerBase.handleRequestBody(ContentStreamHandlerBase.java:74)
   [junit4]   2> 		at org.apache.solr.handler.RequestHandlerBase.handleRequest(RequestHandlerBase.java:129)
   [junit4]   2> 		at org.apache.solr.core.SolrCore.execute(SolrCore.java:1561)
   [junit4]   2> 		at org.apache.solr.servlet.DirectSolrConnection.request(DirectSolrConnection.java:131)
   [junit4]   2> 		at org.apache.solr.util.TestHarness.update(TestHarness.java:229)
   [junit4]   2> 		at org.apache.solr.util.TestHarness.checkUpdateStatus(TestHarness.java:277)
   [junit4]   2> 		at org.apache.solr.util.TestHarness.validateUpdate(TestHarness.java:247)
   [junit4]   2> 		at org.apache.solr.SolrTestCaseJ4.checkUpdateU(SolrTestCaseJ4.java:415)
   [junit4]   2> 		at org.apache.solr.SolrTestCaseJ4.assertU(SolrTestCaseJ4.java:394)
   [junit4]   2> 		at org.apache.solr.SolrTestCaseJ4.assertU(SolrTestCaseJ4.java:388)
   [junit4]   2> 		at org.apache.solr.SolrTestCaseJ4.clearIndex(SolrTestCaseJ4.java:760)
   [junit4]   2> 		at org.apache.solr.handler.dataimport.TestSqlEntityProcessorDelta3.setUp(TestSqlEntityProcessorDelta3.java:67)
   [junit4]   2> 		at sun.reflect.NativeMethodAccessorImpl.invoke0(Native Method)
   [junit4]   2> 		at sun.reflect.NativeMethodAccessorImpl.invoke(NativeMethodAccessorImpl.java:57)
   [junit4]   2> 		at sun.reflect.DelegatingMethodAccessorImpl.invoke(DelegatingMethodAccessorImpl.java:43)
   [junit4]   2> 		at java.lang.reflect.Method.invoke(Method.java:601)
   [junit4]   2> 		at com.carrotsearch.randomizedtesting.RandomizedRunner.invoke(RandomizedRunner.java:1969)
   [junit4]   2> 		at com.carrotsearch.randomizedtesting.RandomizedRunner.access$1100(RandomizedRunner.java:132)
   [junit4]   2> 		at com.carrotsearch.randomizedtesting.RandomizedRunner$7.evaluate(RandomizedRunner.java:873)
   [junit4]   2> 		at com.carrotsearch.randomizedtesting.RandomizedRunner$8.evaluate(RandomizedRunner.java:889)
   [junit4]   2> 		at com.carrotsearch.randomizedtesting.rules.SystemPropertiesRestoreRule$1.evaluate(SystemPropertiesRestoreRule.java:53)
   [junit4]   2> 		at org.apache.lucene.util.TestRuleSetupTeardownChained$1.evaluate(TestRuleSetupTeardownChained.java:50)
   [junit4]   2> 		at org.apache.lucene.util.TestRuleFieldCacheSanity$1.evaluate(TestRuleFieldCacheSanity.java:32)
   [junit4]   2> 		at org.apache.lucene.util.AbstractBeforeAfterRule$1.evaluate(AbstractBeforeAfterRule.java:45)
   [junit4]   2> 		at com.carrotsearch.randomizedtesting.rules.SystemPropertiesInvariantRule$1.evaluate(SystemPropertiesInvariantRule.java:55)
   [junit4]   2> 		at org.apache.lucene.util.TestRuleReportUncaughtExceptions$1.evaluate(TestRuleReportUncaughtExceptions.java:68)
   [junit4]   2> 		at org.apache.lucene.util.TestRuleThreadAndTestName$1.evaluate(TestRuleThreadAndTestName.java:48)
   [junit4]   2> 		at org.apache.lucene.util.TestRuleMarkFailure$1.evaluate(TestRuleMarkFailure.java:48)
   [junit4]   2> 		at com.carrotsearch.randomizedtesting.RandomizedRunner.runSingleTest(RandomizedRunner.java:821)
   [junit4]   2> 		at com.carrotsearch.randomizedtesting.RandomizedRunner.access$700(RandomizedRunner.java:132)
   [junit4]   2> 		at com.carrotsearch.randomizedtesting.RandomizedRunner$3$1.run(RandomizedRunner.java:669)
   [junit4]   2> 		at com.carrotsearch.randomizedtesting.RandomizedRunner$3.evaluate(RandomizedRunner.java:695)
   [junit4]   2> 		at com.carrotsearch.randomizedtesting.RandomizedRunner$4.evaluate(RandomizedRunner.java:734)
   [junit4]   2> 		at com.carrotsearch.randomizedtesting.RandomizedRunner$5.evaluate(RandomizedRunner.java:745)
   [junit4]   2> 		at com.carrotsearch.randomizedtesting.rules.SystemPropertiesRestoreRule$1.evaluate(SystemPropertiesRestoreRule.java:53)
   [junit4]   2> 		at org.apache.lucene.util.AbstractBeforeAfterRule$1.evaluate(AbstractBeforeAfterRule.java:45)
   [junit4]   2> 		at org.apache.lucene.util.TestRuleReportUncaughtExceptions$1.evaluate(TestRuleReportUncaughtExceptions.java:68)
   [junit4]   2> 		at org.apache.lucene.util.TestRuleStoreClassName$1.evaluate(TestRuleStoreClassName.java:38)
   [junit4]   2> 		at org.apache.lucene.util.TestRuleIcuHack$1.evaluate(TestRuleIcuHack.java:51)
   [junit4]   2> 		at com.carrotsearch.randomizedtesting.rules.SystemPropertiesInvariantRule$1.evaluate(SystemPropertiesInvariantRule.java:55)
   [junit4]   2> 		at org.apache.lucene.util.TestRuleNoInstanceHooksOverrides$1.evaluate(TestRuleNoInstanceHooksOverrides.java:53)
   [junit4]   2> 		at org.apache.lucene.util.TestRuleNoStaticHooksShadowing$1.evaluate(TestRuleNoStaticHooksShadowing.java:52)
   [junit4]   2> 		at org.apache.lucene.util.TestRuleAssertionsRequired$1.evaluate(TestRuleAssertionsRequired.java:36)
   [junit4]   2> 		at org.apache.lucene.util.TestRuleMarkFailure$1.evaluate(TestRuleMarkFailure.java:48)
   [junit4]   2> 		at org.apache.lucene.util.TestRuleIgnoreTestSuites$1.evaluate(TestRuleIgnoreTestSuites.java:56)
   [junit4]   2> 		at com.carrotsearch.randomizedtesting.RandomizedRunner.runSuite(RandomizedRunner.java:605)
   [junit4]   2> 		at com.carrotsearch.randomizedtesting.RandomizedRunner.access$400(RandomizedRunner.java:132)
   [junit4]   2> 		at com.carrotsearch.randomizedtesting.RandomizedRunner$2.run(RandomizedRunner.java:551)
   [junit4]   2> 	
   [junit4]   2> 685 T89 oashd.AbstractDataImportHandlerTestCase.tearDown Looking for dataimport.properties at: /mnt/ssd/jenkins/workspace/Lucene-Solr-4.x-Linux-Java7-64/checkout/solr/build/contrib/solr-dataimporthandler/test/J0/solr/collection1/conf/dataimport.properties
   [junit4]   2> 685 T89 oas.SolrTestCaseJ4.tearDown ###Ending testCompositePk_DeltaImport_empty
   [junit4]   2> NOTE: reproduce with: ant test  -Dtestcase=TestSqlEntityProcessorDelta3 -Dtests.method=testCompositePk_DeltaImport_empty -Dtests.seed=8ECAEA0164565F55 -Dtests.multiplier=3 -Dtests.locale=sr -Dtests.timezone=Asia/Colombo -Dargs="-Dfile.encoding=UTF-8"
   [junit4]   2>
   [junit4]    > (@AfterClass output)
   [junit4]   2> 742 T89 oas.SolrTestCaseJ4.deleteCore ###deleteCore
   [junit4]   2> 742 T89 oasc.CoreContainer.shutdown Shutting down CoreContainer instance=669807864
   [junit4]   2> 742 T89 oasc.SolrCore.close [collection1]  CLOSING SolrCore org.apache.solr.core.SolrCore@2d50e341
   [junit4]   2> 743 T89 oasc.SolrCore.closeSearcher [collection1] Closing main searcher on request.
   [junit4]   2> 743 T89 oasu.DirectUpdateHandler2.close closing DirectUpdateHandler2{commits=9,autocommits=0,soft autocommits=0,optimizes=0,rollbacks=1,expungeDeletes=0,docsPending=0,adds=0,deletesById=0,deletesByQuery=2,errors=3,cumulative_adds=5,cumulative_deletesById=0,cumulative_deletesByQuery=9,cumulative_errors=2}
   [junit4]   2> 744 T89 oasu.DefaultSolrCoreState.decref SEVERE Error during shutdown of writer. java.lang.IllegalArgumentException: Unknown directory: MockDirWrapper(org.apache.lucene.store.RAMDirectory@14f35a42 lockFactory=org.apache.lucene.store.NativeFSLockFactory@4ee2dd22) {MockDirWrapper(org.apache.lucene.store.RAMDirectory@3922d60 lockFactory=org.apache.lucene.store.NativeFSLockFactory@699cb714)=org.apache.solr.core.CachingDirectoryFactory$CacheValue@44e5b006}
   [junit4]   2> 	at org.apache.solr.core.CachingDirectoryFactory.close(CachingDirectoryFactory.java:77)
   [junit4]   2> 	at org.apache.solr.core.CachingDirectoryFactory.release(CachingDirectoryFactory.java:184)
   [junit4]   2> 	at org.apache.solr.update.SolrIndexWriter.close(SolrIndexWriter.java:131)
   [junit4]   2> 	at org.apache.solr.update.DirectUpdateHandler2.closeWriter(DirectUpdateHandler2.java:613)
   [junit4]   2> 	at org.apache.solr.update.DefaultSolrCoreState.decref(DefaultSolrCoreState.java:73)
   [junit4]   2> 	at org.apache.solr.update.DirectUpdateHandler2.close(DirectUpdateHandler2.java:542)
   [junit4]   2> 	at org.apache.solr.core.SolrCore.close(SolrCore.java:779)
   [junit4]   2> 	at org.apache.solr.core.CoreContainer.shutdown(CoreContainer.java:563)
   [junit4]   2> 	at org.apache.solr.util.TestHarness.close(TestHarness.java:407)
   [junit4]   2> 	at org.apache.solr.SolrTestCaseJ4.deleteCore(SolrTestCaseJ4.java:361)
   [junit4]   2> 	at org.apache.solr.SolrTestCaseJ4.afterClass(SolrTestCaseJ4.java:80)
   [junit4]   2> 	at sun.reflect.NativeMethodAccessorImpl.invoke0(Native Method)
   [junit4]   2> 	at sun.reflect.NativeMethodAccessorImpl.invoke(NativeMethodAccessorImpl.java:57)
   [junit4]   2> 	at sun.reflect.DelegatingMethodAccessorImpl.invoke(DelegatingMethodAccessorImpl.java:43)
   [junit4]   2> 	at java.lang.reflect.Method.invoke(Method.java:601)
   [junit4]   2> 	at com.carrotsearch.randomizedtesting.RandomizedRunner.invoke(RandomizedRunner.java:1969)
   [junit4]   2> 	at com.carrotsearch.randomizedtesting.RandomizedRunner.access$1100(RandomizedRunner.java:132)
   [junit4]   2> 	at com.carrotsearch.randomizedtesting.RandomizedRunner$5.evaluate(RandomizedRunner.java:752)
   [junit4]   2> 	at com.carrotsearch.randomizedtesting.rules.SystemPropertiesRestoreRule$1.evaluate(SystemPropertiesRestoreRule.java:53)
   [junit4]   2> 	at org.apache.lucene.util.AbstractBeforeAfterRule$1.evaluate(AbstractBeforeAfterRule.java:45)
   [junit4]   2> 	at org.apache.lucene.util.TestRuleReportUncaughtExceptions$1.evaluate(TestRuleReportUncaughtExceptions.java:68)
   [junit4]   2> 	at org.apache.lucene.util.TestRuleStoreClassName$1.evaluate(TestRuleStoreClassName.java:38)
   [junit4]   2> 	at org.apache.lucene.util.TestRuleIcuHack$1.evaluate(TestRuleIcuHack.java:51)
   [junit4]   2> 	at com.carrotsearch.randomizedtesting.rules.SystemPropertiesInvariantRule$1.evaluate(SystemPropertiesInvariantRule.java:55)
   [junit4]   2> 	at org.apache.lucene.util.TestRuleNoInstanceHooksOverrides$1.evaluate(TestRuleNoInstanceHooksOverrides.java:53)
   [junit4]   2> 	at org.apache.lucene.util.TestRuleNoStaticHooksShadowing$1.evaluate(TestRuleNoStaticHooksShadowing.java:52)
   [junit4]   2> 	at org.apache.lucene.util.TestRuleAssertionsRequired$1.evaluate(TestRuleAssertionsRequired.java:36)
   [junit4]   2> 	at org.apache.lucene.util.TestRuleMarkFailure$1.evaluate(TestRuleMarkFailure.java:48)
   [junit4]   2> 	at org.apache.lucene.util.TestRuleIgnoreTestSuites$1.evaluate(TestRuleIgnoreTestSuites.java:56)
   [junit4]   2> 	at com.carrotsearch.randomizedtesting.RandomizedRunner.runSuite(RandomizedRunner.java:605)
   [junit4]   2> 	at com.carrotsearch.randomizedtesting.RandomizedRunner.access$400(RandomizedRunner.java:132)
   [junit4]   2> 	at com.carrotsearch.randomizedtesting.RandomizedRunner$2.run(RandomizedRunner.java:551)
   [junit4]   2> 
   [junit4]   2> NOTE: test params are: codec=SimpleText, sim=RandomSimilarityProvider(queryNorm=false,coord=true): {}, locale=sr, timezone=Asia/Colombo
   [junit4]   2> NOTE: Linux 2.6.32-41-server amd64/Oracle Corporation 1.7.0_04 (64-bit)/cpus=8,threads=1,free=124130168,total=131072000
   [junit4]   2> NOTE: All tests run in this JVM: [TestRegexTransformer, TestURLDataSource, TestFileListEntityProcessor, TestSqlEntityProcessorDeltaPrefixedPk, TestClobTransformer, TestPlainTextEntityProcessor, TestSolrEntityProcessorEndToEnd, TestDocBuilder, TestSqlEntityProcessor, TestLineEntityProcessor, TestSqlEntityProcessorDelta3]
   [junit4]   2> 
   [junit4] Completed on J0 in 0.77s, 6 tests, 3 errors <<< FAILURES!

[...truncated 48 lines...]
BUILD FAILED
/mnt/ssd/jenkins/workspace/Lucene-Solr-4.x-Linux-Java7-64/checkout/build.xml:29: The following error occurred while executing this line:
/mnt/ssd/jenkins/workspace/Lucene-Solr-4.x-Linux-Java7-64/checkout/solr/build.xml:163: The following error occurred while executing this line:
/mnt/ssd/jenkins/workspace/Lucene-Solr-4.x-Linux-Java7-64/checkout/solr/common-build.xml:358: The following error occurred while executing this line:
/mnt/ssd/jenkins/workspace/Lucene-Solr-4.x-Linux-Java7-64/checkout/lucene/module-build.xml:62: The following error occurred while executing this line:
/mnt/ssd/jenkins/workspace/Lucene-Solr-4.x-Linux-Java7-64/checkout/lucene/common-build.xml:1036: The following error occurred while executing this line:
/mnt/ssd/jenkins/workspace/Lucene-Solr-4.x-Linux-Java7-64/checkout/lucene/common-build.xml:759: There were test failures: 36 suites, 167 tests, 3 errors, 5 ignored

Total time: 24 minutes 54 seconds
Build step 'Execute shell' marked build as failure
Archiving artifacts
Recording test results
Email was triggered for: Failure
Sending email for trigger: Failure




Mime
View raw message