lucene-dev mailing list archives

Site index · List index
Message view « Date » · « Thread »
Top « Date » · « Thread »
From Policeman Jenkins Server <jenk...@sd-datasolutions.de>
Subject [JENKINS] Lucene-Solr-4.x-Windows-Java6-64 - Build # 172 - Failure!
Date Tue, 26 Jun 2012 01:08:28 GMT
Build: http://jenkins.sd-datasolutions.de/job/Lucene-Solr-4.x-Windows-Java6-64/172/

1 tests failed.
REGRESSION:  org.apache.solr.handler.component.SpellCheckComponentTest.test

Error Message:
List size mismatch @ spellcheck/suggestions

Stack Trace:
java.lang.RuntimeException: List size mismatch @ spellcheck/suggestions
	at __randomizedtesting.SeedInfo.seed([4335CBB00F2C2CE7:CB61F46AA1D0411F]:0)
	at org.apache.solr.SolrTestCaseJ4.assertJQ(SolrTestCaseJ4.java:545)
	at org.apache.solr.SolrTestCaseJ4.assertJQ(SolrTestCaseJ4.java:493)
	at org.apache.solr.handler.component.SpellCheckComponentTest.test(SpellCheckComponentTest.java:92)
	at sun.reflect.NativeMethodAccessorImpl.invoke0(Native Method)
	at sun.reflect.NativeMethodAccessorImpl.invoke(NativeMethodAccessorImpl.java:39)
	at sun.reflect.DelegatingMethodAccessorImpl.invoke(DelegatingMethodAccessorImpl.java:25)
	at java.lang.reflect.Method.invoke(Method.java:597)
	at com.carrotsearch.randomizedtesting.RandomizedRunner.invoke(RandomizedRunner.java:1969)
	at com.carrotsearch.randomizedtesting.RandomizedRunner.access$1100(RandomizedRunner.java:132)
	at com.carrotsearch.randomizedtesting.RandomizedRunner$6.evaluate(RandomizedRunner.java:814)
	at com.carrotsearch.randomizedtesting.RandomizedRunner$7.evaluate(RandomizedRunner.java:875)
	at com.carrotsearch.randomizedtesting.RandomizedRunner$8.evaluate(RandomizedRunner.java:889)
	at com.carrotsearch.randomizedtesting.rules.SystemPropertiesRestoreRule$1.evaluate(SystemPropertiesRestoreRule.java:53)
	at org.apache.lucene.util.TestRuleSetupTeardownChained$1.evaluate(TestRuleSetupTeardownChained.java:50)
	at org.apache.lucene.util.TestRuleFieldCacheSanity$1.evaluate(TestRuleFieldCacheSanity.java:32)
	at org.apache.lucene.util.AbstractBeforeAfterRule$1.evaluate(AbstractBeforeAfterRule.java:45)
	at com.carrotsearch.randomizedtesting.rules.SystemPropertiesInvariantRule$1.evaluate(SystemPropertiesInvariantRule.java:55)
	at org.apache.lucene.util.TestRuleReportUncaughtExceptions$1.evaluate(TestRuleReportUncaughtExceptions.java:68)
	at org.apache.lucene.util.TestRuleThreadAndTestName$1.evaluate(TestRuleThreadAndTestName.java:48)
	at org.apache.lucene.util.TestRuleMarkFailure$1.evaluate(TestRuleMarkFailure.java:48)
	at com.carrotsearch.randomizedtesting.RandomizedRunner.runSingleTest(RandomizedRunner.java:821)
	at com.carrotsearch.randomizedtesting.RandomizedRunner.access$700(RandomizedRunner.java:132)
	at com.carrotsearch.randomizedtesting.RandomizedRunner$3$1.run(RandomizedRunner.java:669)
	at com.carrotsearch.randomizedtesting.RandomizedRunner$3.evaluate(RandomizedRunner.java:695)
	at com.carrotsearch.randomizedtesting.RandomizedRunner$4.evaluate(RandomizedRunner.java:734)
	at com.carrotsearch.randomizedtesting.RandomizedRunner$5.evaluate(RandomizedRunner.java:745)
	at com.carrotsearch.randomizedtesting.rules.SystemPropertiesRestoreRule$1.evaluate(SystemPropertiesRestoreRule.java:53)
	at org.apache.lucene.util.AbstractBeforeAfterRule$1.evaluate(AbstractBeforeAfterRule.java:45)
	at org.apache.lucene.util.TestRuleReportUncaughtExceptions$1.evaluate(TestRuleReportUncaughtExceptions.java:68)
	at org.apache.lucene.util.TestRuleStoreClassName$1.evaluate(TestRuleStoreClassName.java:38)
	at org.apache.lucene.util.TestRuleIcuHack$1.evaluate(TestRuleIcuHack.java:51)
	at com.carrotsearch.randomizedtesting.rules.SystemPropertiesInvariantRule$1.evaluate(SystemPropertiesInvariantRule.java:55)
	at org.apache.lucene.util.TestRuleNoInstanceHooksOverrides$1.evaluate(TestRuleNoInstanceHooksOverrides.java:53)
	at org.apache.lucene.util.TestRuleNoStaticHooksShadowing$1.evaluate(TestRuleNoStaticHooksShadowing.java:52)
	at org.apache.lucene.util.TestRuleAssertionsRequired$1.evaluate(TestRuleAssertionsRequired.java:36)
	at org.apache.lucene.util.TestRuleMarkFailure$1.evaluate(TestRuleMarkFailure.java:48)
	at org.apache.lucene.util.TestRuleIgnoreTestSuites$1.evaluate(TestRuleIgnoreTestSuites.java:56)
	at com.carrotsearch.randomizedtesting.RandomizedRunner.runSuite(RandomizedRunner.java:605)
	at com.carrotsearch.randomizedtesting.RandomizedRunner.access$400(RandomizedRunner.java:132)
	at com.carrotsearch.randomizedtesting.RandomizedRunner$2.run(RandomizedRunner.java:551)




Build Log:
[...truncated 6938 lines...]
   [junit4] Suite: org.apache.solr.handler.component.SpellCheckComponentTest
   [junit4]    > (@BeforeClass output)
   [junit4]   2> 1 T1943 oas.SolrTestCaseJ4.initCore ####initCore
   [junit4]   2> Creating dataDir: C:\Jenkins\workspace\Lucene-Solr-4.x-Windows-Java6-64\solr\build\solr-core\test\J0\.\solrtest-SpellCheckComponentTest-1340672421071
   [junit4]   2> 1 T1943 oasc.SolrResourceLoader.locateSolrHome JNDI not configured for
solr (NoInitialContextEx)
   [junit4]   2> 1 T1943 oasc.SolrResourceLoader.locateSolrHome using system property solr.solr.home:
C:\Jenkins\workspace\Lucene-Solr-4.x-Windows-Java6-64\solr\build\solr-core\test-files\solr
   [junit4]   2> 1 T1943 oasc.SolrResourceLoader.<init> new SolrResourceLoader for
deduced Solr Home: 'C:\Jenkins\workspace\Lucene-Solr-4.x-Windows-Java6-64\solr\build\solr-core\test-files\solr\'
   [junit4]   2> 2 T1943 oasc.SolrResourceLoader.replaceClassLoader Adding 'file:/C:/Jenkins/workspace/Lucene-Solr-4.x-Windows-Java6-64/solr/build/solr-core/test-files/solr/lib/classes/'
to classloader
   [junit4]   2> 2 T1943 oasc.SolrResourceLoader.replaceClassLoader Adding 'file:/C:/Jenkins/workspace/Lucene-Solr-4.x-Windows-Java6-64/solr/build/solr-core/test-files/solr/lib/README'
to classloader
   [junit4]   2> 35 T1943 oasc.SolrConfig.<init> Using Lucene MatchVersion: LUCENE_40
   [junit4]   2> 100 T1943 oasc.SolrConfig.<init> Loaded SolrConfig: solrconfig-spellcheckcomponent.xml
   [junit4]   2> 100 T1943 oass.IndexSchema.readSchema Reading Solr Schema
   [junit4]   2> 109 T1943 oass.IndexSchema.readSchema Schema name=test
   [junit4]   2> 215 T3 oasc.SolrCore.finalize SEVERE REFCOUNT ERROR: unreferenced org.apache.solr.core.SolrCore@4c1d06ca
(collection1) has a reference count of 1
   [junit4]   2> 215 T3 oasc.CoreContainer.finalize SEVERE CoreContainer was not shutdown
prior to finalize(), indicates a bug -- POSSIBLE RESOURCE LEAK!!!  instance=626675598
   [junit4]   2> 805 T1943 oass.OpenExchangeRatesOrgProvider.init Initialized with rates=open-exchange-rates.json,
refreshInterval=1440.
   [junit4]   2> 819 T1943 oass.IndexSchema.readSchema default search field in schema is
text
   [junit4]   2> 824 T1943 oass.IndexSchema.readSchema unique key field: id
   [junit4]   2> 830 T1943 oass.FileExchangeRateProvider.reload Reloading exchange rates
from file currency.xml
   [junit4]   2> 833 T1943 oass.FileExchangeRateProvider.reload Reloading exchange rates
from file currency.xml
   [junit4]   2> 837 T1943 oass.OpenExchangeRatesOrgProvider.reload Reloading exchange
rates from open-exchange-rates.json
   [junit4]   2> 837 T1943 oass.OpenExchangeRatesOrgProvider.reload Reloading exchange
rates from open-exchange-rates.json
   [junit4]   2> 837 T1943 oasc.SolrResourceLoader.locateSolrHome JNDI not configured for
solr (NoInitialContextEx)
   [junit4]   2> 837 T1943 oasc.SolrResourceLoader.locateSolrHome using system property
solr.solr.home: C:\Jenkins\workspace\Lucene-Solr-4.x-Windows-Java6-64\solr\build\solr-core\test-files\solr
   [junit4]   2> 837 T1943 oasc.SolrResourceLoader.<init> new SolrResourceLoader
for directory: 'C:\Jenkins\workspace\Lucene-Solr-4.x-Windows-Java6-64\solr\build\solr-core\test-files\solr\'
   [junit4]   2> 838 T1943 oasc.SolrResourceLoader.replaceClassLoader Adding 'file:/C:/Jenkins/workspace/Lucene-Solr-4.x-Windows-Java6-64/solr/build/solr-core/test-files/solr/lib/classes/'
to classloader
   [junit4]   2> 838 T1943 oasc.SolrResourceLoader.replaceClassLoader Adding 'file:/C:/Jenkins/workspace/Lucene-Solr-4.x-Windows-Java6-64/solr/build/solr-core/test-files/solr/lib/README'
to classloader
   [junit4]   2> 838 T1943 oasc.CoreContainer.<init> New CoreContainer 1336477757
   [junit4]   2> 839 T1943 oasc.SolrCore.<init> [collection1] Opening new SolrCore
at C:\Jenkins\workspace\Lucene-Solr-4.x-Windows-Java6-64\solr\build\solr-core\test-files\solr\,
dataDir=C:\Jenkins\workspace\Lucene-Solr-4.x-Windows-Java6-64\solr\build\solr-core\test\J0\.\solrtest-SpellCheckComponentTest-1340672421071\
   [junit4]   2> 839 T1943 oasc.SolrCore.<init> JMX monitoring not detected for core:
collection1
   [junit4]   2> 839 T1943 oasc.SolrCore.getNewIndexDir WARNING New index directory detected:
old=null new=C:\Jenkins\workspace\Lucene-Solr-4.x-Windows-Java6-64\solr\build\solr-core\test\J0\.\solrtest-SpellCheckComponentTest-1340672421071\index/
   [junit4]   2> 840 T1943 oasc.SolrCore.initIndex WARNING [collection1] Solr index directory
'C:\Jenkins\workspace\Lucene-Solr-4.x-Windows-Java6-64\solr\build\solr-core\test\J0\.\solrtest-SpellCheckComponentTest-1340672421071\index'
doesn't exist. Creating new index...
   [junit4]   2> 843 T1943 oasc.SolrDeletionPolicy.onCommit SolrDeletionPolicy.onCommit:
commits:num=1
   [junit4]   2> 		commit{dir=MockDirWrapper(org.apache.lucene.store.RAMDirectory@625c05a6
lockFactory=org.apache.lucene.store.NativeFSLockFactory@179d0d1f),segFN=segments_1,generation=1,filenames=[segments_1]
   [junit4]   2> 843 T1943 oasc.SolrDeletionPolicy.updateCommits newest commit = 1
   [junit4]   2> 843 T1943 oasc.RequestHandlers.initHandlersFromConfig created standard:
solr.StandardRequestHandler
   [junit4]   2> 843 T1943 oasc.RequestHandlers.initHandlersFromConfig created spellCheckCompRH:
org.apache.solr.handler.component.SearchHandler
   [junit4]   2> 843 T1943 oasc.RequestHandlers.initHandlersFromConfig created spellCheckCompRH1:
org.apache.solr.handler.component.SearchHandler
   [junit4]   2> 843 T1943 oasc.RequestHandlers.initHandlersFromConfig created spellCheckWithWordbreak:
org.apache.solr.handler.component.SearchHandler
   [junit4]   2> 849 T1943 oass.SolrIndexSearcher.<init> Opening Searcher@51fa0653
main
   [junit4]   2> 849 T1943 oass.SolrIndexSearcher.<init> WARNING WARNING: Directory
impl does not support setting indexDir: org.apache.lucene.store.MockDirectoryWrapper
   [junit4]   2> 850 T1943 oasu.CommitTracker.<init> Hard AutoCommit: disabled
   [junit4]   2> 850 T1943 oasu.CommitTracker.<init> Soft AutoCommit: disabled
   [junit4]   2> 850 T1943 oashc.SpellCheckComponent.inform Initializing spell checkers
   [junit4]   2> 859 T1943 oashc.SpellCheckComponent.inform Registering newSearcher listener
for spellchecker: default
   [junit4]   2> 869 T1943 oashc.SpellCheckComponent.inform Registering newSearcher listener
for spellchecker: default_teststop
   [junit4]   2> 869 T1943 oass.DirectSolrSpellChecker.init init: {name=direct,classname=solr.DirectSolrSpellChecker,minQueryLength=3,maxQueryFrequency=100.0,field=teststop}
   [junit4]   2> 869 T1943 oass.DirectSolrSpellChecker.init init: {name=direct_lowerfilt,classname=solr.DirectSolrSpellChecker,minQueryLength=3,maxQueryFrequency=100.0,field=lowerfilt}
   [junit4]   2> 881 T1943 oashc.SpellCheckComponent.inform Registering newSearcher listener
for spellchecker: threshold
   [junit4]   2> 881 T1943 oass.DirectSolrSpellChecker.init init: {name=threshold_direct,classname=solr.DirectSolrSpellChecker,field=lowerfilt,spellcheckIndexDir=spellcheckerThreshold,buildOnCommit=true,thresholdTokenFrequency=0.29}
   [junit4]   2> 881 T1943 oashc.SpellCheckComponent.inform Registering newSearcher listener
for spellchecker: threshold_direct
   [junit4]   2> 891 T1943 oashc.SpellCheckComponent.inform Registering newSearcher listener
for spellchecker: multipleFields
   [junit4]   2> 922 T1943 oashc.SpellCheckComponent.inform Registering newSearcher listener
for spellchecker: freq
   [junit4]   2> 931 T1943 oashc.SpellCheckComponent.inform Registering newSearcher listener
for spellchecker: fqcn
   [junit4]   2> 932 T1943 oashc.HttpShardHandlerFactory.getParameter Setting socketTimeout
to: 0
   [junit4]   2> 932 T1943 oashc.HttpShardHandlerFactory.getParameter Setting urlScheme
to: http://
   [junit4]   2> 932 T1943 oashc.HttpShardHandlerFactory.getParameter Setting connTimeout
to: 0
   [junit4]   2> 932 T1943 oashc.HttpShardHandlerFactory.getParameter Setting maxConnectionsPerHost
to: 20
   [junit4]   2> 932 T1943 oashc.HttpShardHandlerFactory.getParameter Setting corePoolSize
to: 0
   [junit4]   2> 933 T1943 oashc.HttpShardHandlerFactory.getParameter Setting maximumPoolSize
to: 2147483647
   [junit4]   2> 933 T1943 oashc.HttpShardHandlerFactory.getParameter Setting maxThreadIdleTime
to: 5
   [junit4]   2> 933 T1943 oashc.HttpShardHandlerFactory.getParameter Setting sizeOfQueue
to: -1
   [junit4]   2> 933 T1943 oashc.HttpShardHandlerFactory.getParameter Setting fairnessPolicy
to: false
   [junit4]   2> 933 T1943 oascsi.HttpClientUtil.createClient Creating new http client,
config:maxConnectionsPerHost=20&maxConnections=10000&socketTimeout=0&connTimeout=0&retry=false
   [junit4]   2> 936 T1943 oasc.CoreContainer.register registering core: collection1
   [junit4]   2> 937 T1943 oas.SolrTestCaseJ4.initCore ####initCore end
   [junit4]   2> 
   [junit4] ERROR   1.27s | SpellCheckComponentTest.test
   [junit4]    > Throwable #1: java.lang.RuntimeException: List size mismatch @ spellcheck/suggestions
   [junit4]    > 	at __randomizedtesting.SeedInfo.seed([4335CBB00F2C2CE7:CB61F46AA1D0411F]:0)
   [junit4]    > 	at org.apache.solr.SolrTestCaseJ4.assertJQ(SolrTestCaseJ4.java:545)
   [junit4]    > 	at org.apache.solr.SolrTestCaseJ4.assertJQ(SolrTestCaseJ4.java:493)
   [junit4]    > 	at org.apache.solr.handler.component.SpellCheckComponentTest.test(SpellCheckComponentTest.java:92)
   [junit4]    > 	at sun.reflect.NativeMethodAccessorImpl.invoke0(Native Method)
   [junit4]    > 	at sun.reflect.NativeMethodAccessorImpl.invoke(NativeMethodAccessorImpl.java:39)
   [junit4]    > 	at sun.reflect.DelegatingMethodAccessorImpl.invoke(DelegatingMethodAccessorImpl.java:25)
   [junit4]    > 	at java.lang.reflect.Method.invoke(Method.java:597)
   [junit4]    > 	at com.carrotsearch.randomizedtesting.RandomizedRunner.invoke(RandomizedRunner.java:1969)
   [junit4]    > 	at com.carrotsearch.randomizedtesting.RandomizedRunner.access$1100(RandomizedRunner.java:132)
   [junit4]    > 	at com.carrotsearch.randomizedtesting.RandomizedRunner$6.evaluate(RandomizedRunner.java:814)
   [junit4]    > 	at com.carrotsearch.randomizedtesting.RandomizedRunner$7.evaluate(RandomizedRunner.java:875)
   [junit4]    > 	at com.carrotsearch.randomizedtesting.RandomizedRunner$8.evaluate(RandomizedRunner.java:889)
   [junit4]    > 	at com.carrotsearch.randomizedtesting.rules.SystemPropertiesRestoreRule$1.evaluate(SystemPropertiesRestoreRule.java:53)
   [junit4]    > 	at org.apache.lucene.util.TestRuleSetupTeardownChained$1.evaluate(TestRuleSetupTeardownChained.java:50)
   [junit4]    > 	at org.apache.lucene.util.TestRuleFieldCacheSanity$1.evaluate(TestRuleFieldCacheSanity.java:32)
   [junit4]    > 	at org.apache.lucene.util.AbstractBeforeAfterRule$1.evaluate(AbstractBeforeAfterRule.java:45)
   [junit4]    > 	at com.carrotsearch.randomizedtesting.rules.SystemPropertiesInvariantRule$1.evaluate(SystemPropertiesInvariantRule.java:55)
   [junit4]    > 	at org.apache.lucene.util.TestRuleReportUncaughtExceptions$1.evaluate(TestRuleReportUncaughtExceptions.java:68)
   [junit4]    > 	at org.apache.lucene.util.TestRuleThreadAndTestName$1.evaluate(TestRuleThreadAndTestName.java:48)
   [junit4]    > 	at org.apache.lucene.util.TestRuleMarkFailure$1.evaluate(TestRuleMarkFailure.java:48)
   [junit4]    > 	at com.carrotsearch.randomizedtesting.RandomizedRunner.runSingleTest(RandomizedRunner.java:821)
   [junit4]    > 	at com.carrotsearch.randomizedtesting.RandomizedRunner.access$700(RandomizedRunner.java:132)
   [junit4]    > 	at com.carrotsearch.randomizedtesting.RandomizedRunner$3$1.run(RandomizedRunner.java:669)
   [junit4]    > 	at com.carrotsearch.randomizedtesting.RandomizedRunner$3.evaluate(RandomizedRunner.java:695)
   [junit4]    > 	at com.carrotsearch.randomizedtesting.RandomizedRunner$4.evaluate(RandomizedRunner.java:734)
   [junit4]    > 	at com.carrotsearch.randomizedtesting.RandomizedRunner$5.evaluate(RandomizedRunner.java:745)
   [junit4]    > 	at com.carrotsearch.randomizedtesting.rules.SystemPropertiesRestoreRule$1.evaluate(SystemPropertiesRestoreRule.java:53)
   [junit4]    > 	at org.apache.lucene.util.AbstractBeforeAfterRule$1.evaluate(AbstractBeforeAfterRule.java:45)
   [junit4]    > 	at org.apache.lucene.util.TestRuleReportUncaughtExceptions$1.evaluate(TestRuleReportUncaughtExceptions.java:68)
   [junit4]    > 	at org.apache.lucene.util.TestRuleStoreClassName$1.evaluate(TestRuleStoreClassName.java:38)
   [junit4]    > 	at org.apache.lucene.util.TestRuleIcuHack$1.evaluate(TestRuleIcuHack.java:51)
   [junit4]    > 	at com.carrotsearch.randomizedtesting.rules.SystemPropertiesInvariantRule$1.evaluate(SystemPropertiesInvariantRule.java:55)
   [junit4]    > 	at org.apache.lucene.util.TestRuleNoInstanceHooksOverrides$1.evaluate(TestRuleNoInstanceHooksOverrides.java:53)
   [junit4]    > 	at org.apache.lucene.util.TestRuleNoStaticHooksShadowing$1.evaluate(TestRuleNoStaticHooksShadowing.java:52)
   [junit4]    > 	at org.apache.lucene.util.TestRuleAssertionsRequired$1.evaluate(TestRuleAssertionsRequired.java:36)
   [junit4]    > 	at org.apache.lucene.util.TestRuleMarkFailure$1.evaluate(TestRuleMarkFailure.java:48)
   [junit4]    > 	at org.apache.lucene.util.TestRuleIgnoreTestSuites$1.evaluate(TestRuleIgnoreTestSuites.java:56)
   [junit4]    > 	at com.carrotsearch.randomizedtesting.RandomizedRunner.runSuite(RandomizedRunner.java:605)
   [junit4]    > 	at com.carrotsearch.randomizedtesting.RandomizedRunner.access$400(RandomizedRunner.java:132)
   [junit4]    > 	at com.carrotsearch.randomizedtesting.RandomizedRunner$2.run(RandomizedRunner.java:551)
   [junit4]    > 
   [junit4]   2> 940 T1943 oas.SolrTestCaseJ4.setUp ###Starting test
   [junit4]   2> ASYNC  NEW_CORE C111 name=collection1 org.apache.solr.core.SolrCore@192efd90
   [junit4]   2> 1021 T1943 C111 oasc.SolrDeletionPolicy.onInit SolrDeletionPolicy.onInit:
commits:num=1
   [junit4]   2> 		commit{dir=MockDirWrapper(org.apache.lucene.store.RAMDirectory@625c05a6
lockFactory=org.apache.lucene.store.NativeFSLockFactory@179d0d1f),segFN=segments_1,generation=1,filenames=[segments_1]
   [junit4]   2> 1021 T1943 C111 oasc.SolrDeletionPolicy.updateCommits newest commit =
1
   [junit4]   2> 1023 T1943 C111 UPDATE [collection1] webapp=null path=null params={} {add=[0]}
0 79
   [junit4]   2> 1036 T1943 C111 UPDATE [collection1] webapp=null path=null params={} {add=[1]}
0 1
   [junit4]   2> 1047 T1943 C111 UPDATE [collection1] webapp=null path=null params={} {add=[2]}
0 2
   [junit4]   2> 1057 T1943 C111 UPDATE [collection1] webapp=null path=null params={} {add=[3]}
0 1
   [junit4]   2> 1065 T1943 C111 UPDATE [collection1] webapp=null path=null params={} {add=[4]}
0 1
   [junit4]   2> 1073 T1943 C111 UPDATE [collection1] webapp=null path=null params={} {add=[5]}
0 1
   [junit4]   2> 1080 T1943 C111 UPDATE [collection1] webapp=null path=null params={} {add=[6]}
0 1
   [junit4]   2> 1087 T1943 C111 UPDATE [collection1] webapp=null path=null params={} {add=[7]}
0 1
   [junit4]   2> 1094 T1943 C111 UPDATE [collection1] webapp=null path=null params={} {add=[8]}
0 1
   [junit4]   2> 1102 T1943 C111 UPDATE [collection1] webapp=null path=null params={} {add=[9]}
0 1
   [junit4]   2> 1109 T1943 C111 oasu.DirectUpdateHandler2.commit start commit{flags=0,version=0,optimize=false,openSearcher=true,waitSearcher=true,expungeDeletes=false,softCommit=false}
   [junit4]   2> 1111 T1943 C111 oasc.SolrDeletionPolicy.onCommit SolrDeletionPolicy.onCommit:
commits:num=2
   [junit4]   2> 		commit{dir=MockDirWrapper(org.apache.lucene.store.RAMDirectory@625c05a6
lockFactory=org.apache.lucene.store.NativeFSLockFactory@179d0d1f),segFN=segments_1,generation=1,filenames=[segments_1]
   [junit4]   2> 		commit{dir=MockDirWrapper(org.apache.lucene.store.RAMDirectory@625c05a6
lockFactory=org.apache.lucene.store.NativeFSLockFactory@179d0d1f),segFN=segments_2,generation=2,filenames=[_0_Lucene40_0.tim,
_0.fnm, _0_Lucene40_0.frq, _0_nrm.cfe, segments_2, _0.fdx, _0_nrm.cfs, _0.si, _0_Lucene40_0.prx,
_0.fdt, _0_Lucene40_0.tip]
   [junit4]   2> 1112 T1943 C111 oasc.SolrDeletionPolicy.updateCommits newest commit =
2
   [junit4]   2> 1112 T1943 C111 oasc.SolrCore.getSearcher WARNING [collection1] PERFORMANCE
WARNING: Overlapping onDeckSearchers=2
   [junit4]   2> 1114 T1943 C111 oass.SolrIndexSearcher.<init> Opening Searcher@4ab8cbfc
main
   [junit4]   2> 1114 T1943 C111 oass.SolrIndexSearcher.<init> WARNING WARNING: Directory
impl does not support setting indexDir: org.apache.lucene.store.MockDirectoryWrapper
   [junit4]   2> 1114 T1943 C111 oasu.DirectUpdateHandler2.commit end_commit_flush
   [junit4]   2> 2103 T1944 oasc.SolrCore.registerSearcher [collection1] Registered new
searcher Searcher@51fa0653 main{StandardDirectoryReader(segments_1:1)}
   [junit4]   2> 2104 T1944 oashc.SpellCheckComponent$SpellCheckerListener.newSearcher
Loading spell index for spellchecker: default
   [junit4]   2> 2106 T1944 oashc.SpellCheckComponent$SpellCheckerListener.newSearcher
Loading spell index for spellchecker: default_teststop
   [junit4]   2> 2107 T1944 oashc.SpellCheckComponent$SpellCheckerListener.newSearcher
Loading spell index for spellchecker: direct
   [junit4]   2> 2107 T1944 oashc.SpellCheckComponent$SpellCheckerListener.newSearcher
Loading spell index for spellchecker: direct_lowerfilt
   [junit4]   2> 2107 T1944 oashc.SpellCheckComponent$SpellCheckerListener.newSearcher
Loading spell index for spellchecker: wordbreak
   [junit4]   2> 2107 T1944 oashc.SpellCheckComponent$SpellCheckerListener.newSearcher
Loading spell index for spellchecker: threshold
   [junit4]   2> 2109 T1944 oashc.SpellCheckComponent$SpellCheckerListener.newSearcher
Loading spell index for spellchecker: threshold_direct
   [junit4]   2> 2109 T1944 oashc.SpellCheckComponent$SpellCheckerListener.newSearcher
Loading spell index for spellchecker: multipleFields
   [junit4]   2> 2110 T1944 oashc.SpellCheckComponent$SpellCheckerListener.newSearcher
Loading spell index for spellchecker: jarowinkler
   [junit4]   2> 2112 T1944 oashc.SpellCheckComponent$SpellCheckerListener.newSearcher
Loading spell index for spellchecker: external
   [junit4]   2> 2112 T1944 oashc.SpellCheckComponent$SpellCheckerListener.newSearcher
Loading spell index for spellchecker: freq
   [junit4]   2> 2113 T1944 oashc.SpellCheckComponent$SpellCheckerListener.newSearcher
Loading spell index for spellchecker: fqcn
   [junit4]   2> 2115 T1944 oashc.SpellCheckComponent$SpellCheckerListener.newSearcher
Loading spell index for spellchecker: perDict
   [junit4]   2> 2116 T1944 oasc.SolrCore.registerSearcher [collection1] Registered new
searcher Searcher@4ab8cbfc main{StandardDirectoryReader(segments_2:3 _0(4.0):C10)}
   [junit4]   2> 2116 T1943 C111 UPDATE [collection1] webapp=null path=null params={} {commit=}
0 1007
   [junit4]   2> 2119 T1943 C111 REQ [collection1] webapp=null path=null params={spellcheck=true&q=documemt&qt=spellCheckCompRH}
hits=0 status=0 QTime=1 
   [junit4]   2> 2119 T1943 oas.SolrTestCaseJ4.assertJQ SEVERE query failed JSON validation.
error=List size mismatch @ spellcheck/suggestions
   [junit4]   2> 	 expected =/spellcheck=={"suggestions":["documemt",{"numFound":1,"startOffset":0,"endOffset":8,"suggestion":["document"]}]}
   [junit4]   2> 	 response = {
   [junit4]   2> 	  "responseHeader":{
   [junit4]   2> 	    "status":0,
   [junit4]   2> 	    "QTime":1},
   [junit4]   2> 	  "response":{"numFound":0,"start":0,"docs":[]
   [junit4]   2> 	  },
   [junit4]   2> 	  "spellcheck":{
   [junit4]   2> 	    "suggestions":[]}}
   [junit4]   2> 	
   [junit4]   2> 	 request = spellcheck=true&q=documemt&qt=spellCheckCompRH
   [junit4]   2> 2120 T1943 oas.SolrTestCaseJ4.tearDown ###Ending test
   [junit4]   2> 2125 T1943 C111 oasu.DirectUpdateHandler2.deleteAll [collection1] REMOVING
ALL DOCUMENTS FROM INDEX
   [junit4]   2> 2128 T1943 C111 UPDATE [collection1] webapp=null path=null params={} {deleteByQuery=*:*}
0 3
   [junit4]   2> 2135 T1943 C111 oasu.DirectUpdateHandler2.commit start commit{flags=0,version=0,optimize=false,openSearcher=true,waitSearcher=true,expungeDeletes=false,softCommit=false}
   [junit4]   2> 2136 T1943 C111 oasc.SolrDeletionPolicy.onCommit SolrDeletionPolicy.onCommit:
commits:num=2
   [junit4]   2> 		commit{dir=MockDirWrapper(org.apache.lucene.store.RAMDirectory@625c05a6
lockFactory=org.apache.lucene.store.NativeFSLockFactory@179d0d1f),segFN=segments_2,generation=2,filenames=[_0_Lucene40_0.tim,
_0.fnm, _0_Lucene40_0.frq, _0_nrm.cfe, segments_2, _0.fdx, _0_nrm.cfs, _0.si, _0_Lucene40_0.prx,
_0.fdt, _0_Lucene40_0.tip]
   [junit4]   2> 		commit{dir=MockDirWrapper(org.apache.lucene.store.RAMDirectory@625c05a6
lockFactory=org.apache.lucene.store.NativeFSLockFactory@179d0d1f),segFN=segments_3,generation=3,filenames=[segments_3]
   [junit4]   2> 2137 T1943 C111 oasc.SolrDeletionPolicy.updateCommits newest commit =
3
   [junit4]   2> 2137 T1943 C111 oass.SolrIndexSearcher.<init> Opening Searcher@7726ac8d
main
   [junit4]   2> 2137 T1943 C111 oass.SolrIndexSearcher.<init> WARNING WARNING: Directory
impl does not support setting indexDir: org.apache.lucene.store.MockDirectoryWrapper
   [junit4]   2> 2138 T1944 oashc.SpellCheckComponent$SpellCheckerListener.buildSpellIndex
Building spell index for spell checker: default
   [junit4]   2> 2146 T1944 oashc.SpellCheckComponent$SpellCheckerListener.buildSpellIndex
Building spell index for spell checker: default_teststop
   [junit4]   2> 2157 T1944 oashc.SpellCheckComponent$SpellCheckerListener.buildSpellIndex
Building spell index for spell checker: threshold
   [junit4]   2> 2166 T1944 oashc.SpellCheckComponent$SpellCheckerListener.buildSpellIndex
Building spell index for spell checker: threshold_direct
   [junit4]   2> 2166 T1944 oashc.SpellCheckComponent$SpellCheckerListener.buildSpellIndex
Building spell index for spell checker: multipleFields
   [junit4]   2> 2176 T1944 oashc.SpellCheckComponent$SpellCheckerListener.buildSpellIndex
Building spell index for spell checker: freq
   [junit4]   2> 2186 T1944 oashc.SpellCheckComponent$SpellCheckerListener.buildSpellIndex
Building spell index for spell checker: fqcn
   [junit4]   2> 2197 T1944 oasc.SolrCore.registerSearcher [collection1] Registered new
searcher Searcher@7726ac8d main{StandardDirectoryReader(segments_3:4)}
   [junit4]   2> 2198 T1943 C111 oasu.DirectUpdateHandler2.commit end_commit_flush
   [junit4]   2> 2198 T1943 C111 UPDATE [collection1] webapp=null path=null params={} {commit=}
0 63
   [junit4]   2> NOTE: reproduce with: ant test  -Dtestcase=SpellCheckComponentTest -Dtests.method=test
-Dtests.seed=4335CBB00F2C2CE7 -Dtests.locale=sk_SK -Dtests.timezone=Mideast/Riyadh88 -Dargs="-Dfile.encoding=Cp1252"
   [junit4]   2>
   [junit4]    > (@AfterClass output)
   [junit4]   2> 6845 T1943 oas.SolrTestCaseJ4.deleteCore ###deleteCore
   [junit4]   2> 6846 T1943 oasc.CoreContainer.shutdown Shutting down CoreContainer instance=1336477757
   [junit4]   2> 6846 T1943 oasc.SolrCore.close [collection1]  CLOSING SolrCore org.apache.solr.core.SolrCore@192efd90
   [junit4]   2> 6847 T1943 oasc.SolrCore.closeSearcher [collection1] Closing main searcher
on request.
   [junit4]   2> 6847 T1943 oasu.DirectUpdateHandler2.close closing DirectUpdateHandler2{commits=20,autocommits=0,soft
autocommits=0,optimizes=0,rollbacks=0,expungeDeletes=0,docsPending=0,adds=0,deletesById=0,deletesByQuery=0,errors=0,cumulative_adds=92,cumulative_deletesById=0,cumulative_deletesByQuery=9,cumulative_errors=0}
   [junit4]   2> !!!! WARNING: best effort to remove C:\Jenkins\workspace\Lucene-Solr-4.x-Windows-Java6-64\solr\build\solr-core\test\J0\.\solrtest-SpellCheckComponentTest-1340672421071\spellchecker1\_a.fdt
FAILED !!!!!
   [junit4]   2> !!!! WARNING: best effort to remove C:\Jenkins\workspace\Lucene-Solr-4.x-Windows-Java6-64\solr\build\solr-core\test\J0\.\solrtest-SpellCheckComponentTest-1340672421071\spellchecker1
FAILED !!!!!
   [junit4]   2> !!!! WARNING: best effort to remove C:\Jenkins\workspace\Lucene-Solr-4.x-Windows-Java6-64\solr\build\solr-core\test\J0\.\solrtest-SpellCheckComponentTest-1340672421071
FAILED !!!!!
   [junit4]   2> NOTE: test params are: codec=Lucene3x, sim=DefaultSimilarity, locale=sk_SK,
timezone=Mideast/Riyadh88
   [junit4]   2> NOTE: Windows 7 6.1 amd64/Sun Microsystems Inc. 1.6.0_32 (64-bit)/cpus=2,threads=1,free=122374736,total=170196992
   [junit4]   2> NOTE: All tests run in this JVM: [FastVectorHighlighterTest, BadIndexSchemaTest,
TestIrishLowerCaseFilterFactory, FieldMutatingUpdateProcessorTest, TestMultiWordSynonyms,
ConvertedLegacyTest, QueryParsingTest, SolrRequestParserTest, TestLuceneMatchVersion, TestFiltering,
TestCollationKeyRangeQueries, SuggesterFSTTest, RecoveryZkTest, TestFunctionQuery, PluginInfoTest,
MinimalSchemaTest, DirectUpdateHandlerTest, TestPropInject, TestDefaultSimilarityFactory,
TestSystemIdResolver, TestCJKTokenizerFactory, TestGermanNormalizationFilterFactory, TestKeywordMarkerFilterFactory,
FileUtilsTest, BasicZkTest, TestMultiCoreConfBootstrap, SearchHandlerTest, PeerSyncTest, TestLatvianStemFilterFactory,
TestIndexingPerformance, UniqFieldsUpdateProcessorFactoryTest, DirectUpdateHandlerOptimizeTest,
TestPortugueseLightStemFilterFactory, CommonGramsFilterFactoryTest, SuggesterWFSTTest, TestSynonymMap,
TestMergePolicyConfig, TestJmxMonitoredMap, BasicDistributedZkTest, PingRequestHandlerTest,
CommonGramsQueryFilterFactoryTest, TestSearchPerf, DefaultValueUpdateProcessorTest, TestPhraseSuggestions,
TestElisionFilterFactory, SimpleFacetsTest, TestNorwegianMinimalStemFilterFactory, TestOmitPositions,
TestFrenchLightStemFilterFactory, XmlUpdateRequestHandlerTest, SuggesterTest, LeaderElectionIntegrationTest,
TestHashPartitioner, TestHungarianLightStemFilterFactory, TestBinaryField, NumericFieldsTest,
TestPortugueseMinimalStemFilterFactory, SampleTest, ZkControllerTest, TestKStemFilterFactory,
DateMathParserTest, TestRecovery, DirectSolrConnectionTest, UpdateRequestProcessorFactoryTest,
TestMappingCharFilterFactory, TestTrimFilterFactory, TestTrie, TestBulgarianStemFilterFactory,
TestQueryTypes, TestBM25SimilarityFactory, TermsComponentTest, TestExtendedDismaxParser, TestLMDirichletSimilarityFactory,
OverseerTest, CoreAdminHandlerTest, TestConfig, TestStemmerOverrideFilterFactory, TermVectorComponentTest,
TestUtils, SolrPluginUtilsTest, TestXIncludeConfig, TestHindiFilters, TestRussianFilters,
DocumentAnalysisRequestHandlerTest, DistributedQueryElevationComponentTest, TestGalicianStemFilterFactory,
TestFaceting, TestLFUCache, TestPluginEnable, TestRemoveDuplicatesTokenFilterFactory, TestUAX29URLEmailTokenizerFactory,
SpellingQueryConverterTest, DirectSolrSpellCheckerTest, AutoCommitTest, TestDictionaryCompoundWordTokenFilterFactory,
TestBeiderMorseFilterFactory, CloudStateUpdateTest, TestUpdate, TestRussianLightStemFilterFactory,
TestSort, TestQuerySenderNoQuery, ReturnFieldsTest, JsonLoaderTest, TestPorterStemFilterFactory,
TestNGramFilters, TestCJKWidthFilterFactory, TestFinnishLightStemFilterFactory, TestSurroundQueryParser,
DistributedTermsComponentTest, TestRealTimeGet, SortByFunctionTest, TestPerFieldSimilarity,
OutputWriterTest, TestSolrQueryParser, UUIDFieldTest, CSVRequestHandlerTest, TestPersianNormalizationFilterFactory,
TestDocSet, TestJapaneseTokenizerFactory, TestSynonymFilterFactory, TestShingleFilterFactory,
TestKeepFilterFactory, TestCollationField, TestIndonesianStemFilterFactory, IndexSchemaRuntimeFieldTest,
TestSolrDeletionPolicy1, TestGermanLightStemFilterFactory, TestLMJelinekMercerSimilarityFactory,
TestJapaneseBaseFormFilterFactory, TestSuggestSpellingConverter, TestHyphenationCompoundWordTokenFilterFactory,
DistanceFunctionTest, TestSolrDeletionPolicy2, TestCzechStemFilterFactory, DocumentBuilderTest,
ResourceLoaderTest, TestSwedishLightStemFilterFactory, SolrCoreCheckLockOnStartupTest, TestPatternReplaceFilterFactory,
TestJapanesePartOfSpeechStopFilterFactory, SpellCheckComponentTest]
   [junit4]   2> 
   [junit4] Completed in 6.86s, 9 tests, 1 error <<< FAILURES!

[...truncated 692 lines...]
BUILD FAILED
C:\Jenkins\workspace\Lucene-Solr-4.x-Windows-Java6-64\build.xml:29: The following error occurred
while executing this line:
C:\Jenkins\workspace\Lucene-Solr-4.x-Windows-Java6-64\solr\build.xml:144: The following error
occurred while executing this line:
C:\Jenkins\workspace\Lucene-Solr-4.x-Windows-Java6-64\lucene\module-build.xml:62: The following
error occurred while executing this line:
C:\Jenkins\workspace\Lucene-Solr-4.x-Windows-Java6-64\lucene\common-build.xml:1036: The following
error occurred while executing this line:
C:\Jenkins\workspace\Lucene-Solr-4.x-Windows-Java6-64\lucene\common-build.xml:757: There were
test failures: 290 suites, 1049 tests, 1 error, 10 ignored (5 assumptions)

Total time: 41 minutes 29 seconds
Build step 'Invoke Ant' marked build as failure
Recording test results
Email was triggered for: Failure
Sending email for trigger: Failure




Mime
View raw message