lucene-dev mailing list archives

Site index · List index
Message view « Date » · « Thread »
Top « Date » · « Thread »
From jenk...@sd-datasolutions.de
Subject [JENKINS] Lucene-Solr-4.x-Linux-Java6-64 - Build # 46 - Failure!
Date Sat, 09 Jun 2012 12:14:42 GMT
Build: http://jenkins.sd-datasolutions.de/job/Lucene-Solr-4.x-Linux-Java6-64/46/

1 tests failed.
REGRESSION:  org.apache.lucene.index.TestNRTThreads.testNRTThreads

Error Message:
Thread threw an uncaught exception, thread: Thread[Thread-1149,5,]

Stack Trace:
java.lang.RuntimeException: Thread threw an uncaught exception, thread: Thread[Thread-1149,5,]
	at com.carrotsearch.randomizedtesting.RunnerThreadGroup.processUncaught(RunnerThreadGroup.java:96)
	at com.carrotsearch.randomizedtesting.RandomizedRunner.runSingleTest(RandomizedRunner.java:857)
	at com.carrotsearch.randomizedtesting.RandomizedRunner.access$700(RandomizedRunner.java:132)
	at com.carrotsearch.randomizedtesting.RandomizedRunner$3$1.run(RandomizedRunner.java:669)
	at com.carrotsearch.randomizedtesting.RandomizedRunner$3.evaluate(RandomizedRunner.java:695)
	at com.carrotsearch.randomizedtesting.RandomizedRunner$4.evaluate(RandomizedRunner.java:734)
	at com.carrotsearch.randomizedtesting.RandomizedRunner$5.evaluate(RandomizedRunner.java:745)
	at org.apache.lucene.util.AbstractBeforeAfterRule$1.evaluate(AbstractBeforeAfterRule.java:45)
	at org.apache.lucene.util.TestRuleReportUncaughtExceptions$1.evaluate(TestRuleReportUncaughtExceptions.java:68)
	at org.apache.lucene.util.TestRuleStoreClassName$1.evaluate(TestRuleStoreClassName.java:38)
	at org.apache.lucene.util.TestRuleIcuHack$1.evaluate(TestRuleIcuHack.java:51)
	at com.carrotsearch.randomizedtesting.rules.SystemPropertiesInvariantRule$1.evaluate(SystemPropertiesInvariantRule.java:55)
	at org.apache.lucene.util.TestRuleNoInstanceHooksOverrides$1.evaluate(TestRuleNoInstanceHooksOverrides.java:53)
	at org.apache.lucene.util.TestRuleNoStaticHooksShadowing$1.evaluate(TestRuleNoStaticHooksShadowing.java:52)
	at org.apache.lucene.util.TestRuleAssertionsRequired$1.evaluate(TestRuleAssertionsRequired.java:36)
	at org.apache.lucene.util.TestRuleMarkFailure$1.evaluate(TestRuleMarkFailure.java:48)
	at org.apache.lucene.util.TestRuleIgnoreTestSuites$1.evaluate(TestRuleIgnoreTestSuites.java:56)
	at com.carrotsearch.randomizedtesting.RandomizedRunner.runSuite(RandomizedRunner.java:605)
	at com.carrotsearch.randomizedtesting.RandomizedRunner.access$400(RandomizedRunner.java:132)
	at com.carrotsearch.randomizedtesting.RandomizedRunner$2.run(RandomizedRunner.java:551)
Caused by: java.lang.RuntimeException: java.lang.AssertionError: sub reader _6(4.0):c48/8
wasn't warmed: {SegmentCoreReader(owner=_d(4.0):C1)=true}
	at __randomizedtesting.SeedInfo.seed([55CFB6B28705E6A1]:0)
	at org.apache.lucene.index.ThreadedIndexingAndSearchingTestCase$2.run(ThreadedIndexingAndSearchingTestCase.java:397)
Caused by: java.lang.AssertionError: sub reader _6(4.0):c48/8 wasn't warmed: {SegmentCoreReader(owner=_d(4.0):C1)=true}
	at org.junit.Assert.fail(Assert.java:93)
	at org.junit.Assert.assertTrue(Assert.java:43)
	at org.apache.lucene.index.ThreadedIndexingAndSearchingTestCase$2.run(ThreadedIndexingAndSearchingTestCase.java:347)




Build Log:
[...truncated 1439 lines...]
   [junit4]    > 	at org.apache.lucene.util.AbstractBeforeAfterRule$1.evaluate(AbstractBeforeAfterRule.java:45)
   [junit4]    > 	at org.apache.lucene.util.TestRuleReportUncaughtExceptions$1.evaluate(TestRuleReportUncaughtExceptions.java:68)
   [junit4]    > 	at org.apache.lucene.util.TestRuleStoreClassName$1.evaluate(TestRuleStoreClassName.java:38)
   [junit4]    > 	at org.apache.lucene.util.TestRuleIcuHack$1.evaluate(TestRuleIcuHack.java:51)
   [junit4]    > 	at com.carrotsearch.randomizedtesting.rules.SystemPropertiesInvariantRule$1.evaluate(SystemPropertiesInvariantRule.java:55)
   [junit4]    > 	at org.apache.lucene.util.TestRuleNoInstanceHooksOverrides$1.evaluate(TestRuleNoInstanceHooksOverrides.java:53)
   [junit4]    > 	at org.apache.lucene.util.TestRuleNoStaticHooksShadowing$1.evaluate(TestRuleNoStaticHooksShadowing.java:52)
   [junit4]    > 	at org.apache.lucene.util.TestRuleAssertionsRequired$1.evaluate(TestRuleAssertionsRequired.java:36)
   [junit4]    > 	at org.apache.lucene.util.TestRuleMarkFailure$1.evaluate(TestRuleMarkFailure.java:48)
   [junit4]    > 	at org.apache.lucene.util.TestRuleIgnoreTestSuites$1.evaluate(TestRuleIgnoreTestSuites.java:56)
   [junit4]    > 	at com.carrotsearch.randomizedtesting.RandomizedRunner.runSuite(RandomizedRunner.java:605)
   [junit4]    > 	at com.carrotsearch.randomizedtesting.RandomizedRunner.access$400(RandomizedRunner.java:132)
   [junit4]    > 	at com.carrotsearch.randomizedtesting.RandomizedRunner$2.run(RandomizedRunner.java:551)
   [junit4]    > Caused by: java.lang.RuntimeException: java.lang.AssertionError: sub reader
_6(4.0):c48/8 wasn't warmed: {SegmentCoreReader(owner=_d(4.0):C1)=true}
   [junit4]    > 	at __randomizedtesting.SeedInfo.seed([55CFB6B28705E6A1]:0)
   [junit4]    > 	at org.apache.lucene.index.ThreadedIndexingAndSearchingTestCase$2.run(ThreadedIndexingAndSearchingTestCase.java:397)
   [junit4]    > Caused by: java.lang.AssertionError: sub reader _6(4.0):c48/8 wasn't warmed:
{SegmentCoreReader(owner=_d(4.0):C1)=true}
   [junit4]    > 	at org.junit.Assert.fail(Assert.java:93)
   [junit4]    > 	at org.junit.Assert.assertTrue(Assert.java:43)
   [junit4]    > 	at org.apache.lucene.index.ThreadedIndexingAndSearchingTestCase$2.run(ThreadedIndexingAndSearchingTestCase.java:347)
   [junit4]    > Throwable #3: java.lang.RuntimeException: Thread threw an uncaught exception,
thread: Thread[Thread-1150,5,]
   [junit4]    > 	at com.carrotsearch.randomizedtesting.RunnerThreadGroup.processUncaught(RunnerThreadGroup.java:96)
   [junit4]    > 	at com.carrotsearch.randomizedtesting.RandomizedRunner.runSingleTest(RandomizedRunner.java:857)
   [junit4]    > 	at com.carrotsearch.randomizedtesting.RandomizedRunner.access$700(RandomizedRunner.java:132)
   [junit4]    > 	at com.carrotsearch.randomizedtesting.RandomizedRunner$3$1.run(RandomizedRunner.java:669)
   [junit4]    > 	at com.carrotsearch.randomizedtesting.RandomizedRunner$3.evaluate(RandomizedRunner.java:695)
   [junit4]    > 	at com.carrotsearch.randomizedtesting.RandomizedRunner$4.evaluate(RandomizedRunner.java:734)
   [junit4]    > 	at com.carrotsearch.randomizedtesting.RandomizedRunner$5.evaluate(RandomizedRunner.java:745)
   [junit4]    > 	at org.apache.lucene.util.AbstractBeforeAfterRule$1.evaluate(AbstractBeforeAfterRule.java:45)
   [junit4]    > 	at org.apache.lucene.util.TestRuleReportUncaughtExceptions$1.evaluate(TestRuleReportUncaughtExceptions.java:68)
   [junit4]    > 	at org.apache.lucene.util.TestRuleStoreClassName$1.evaluate(TestRuleStoreClassName.java:38)
   [junit4]    > 	at org.apache.lucene.util.TestRuleIcuHack$1.evaluate(TestRuleIcuHack.java:51)
   [junit4]    > 	at com.carrotsearch.randomizedtesting.rules.SystemPropertiesInvariantRule$1.evaluate(SystemPropertiesInvariantRule.java:55)
   [junit4]    > 	at org.apache.lucene.util.TestRuleNoInstanceHooksOverrides$1.evaluate(TestRuleNoInstanceHooksOverrides.java:53)
   [junit4]    > 	at org.apache.lucene.util.TestRuleNoStaticHooksShadowing$1.evaluate(TestRuleNoStaticHooksShadowing.java:52)
   [junit4]    > 	at org.apache.lucene.util.TestRuleAssertionsRequired$1.evaluate(TestRuleAssertionsRequired.java:36)
   [junit4]    > 	at org.apache.lucene.util.TestRuleMarkFailure$1.evaluate(TestRuleMarkFailure.java:48)
   [junit4]    > 	at org.apache.lucene.util.TestRuleIgnoreTestSuites$1.evaluate(TestRuleIgnoreTestSuites.java:56)
   [junit4]    > 	at com.carrotsearch.randomizedtesting.RandomizedRunner.runSuite(RandomizedRunner.java:605)
   [junit4]    > 	at com.carrotsearch.randomizedtesting.RandomizedRunner.access$400(RandomizedRunner.java:132)
   [junit4]    > 	at com.carrotsearch.randomizedtesting.RandomizedRunner$2.run(RandomizedRunner.java:551)
   [junit4]    > Caused by: java.lang.RuntimeException: java.lang.AssertionError: sub reader
_6(4.0):c48/8 wasn't warmed: {SegmentCoreReader(owner=_d(4.0):C1)=true}
   [junit4]    > 	at __randomizedtesting.SeedInfo.seed([55CFB6B28705E6A1]:0)
   [junit4]    > 	at org.apache.lucene.index.ThreadedIndexingAndSearchingTestCase$2.run(ThreadedIndexingAndSearchingTestCase.java:397)
   [junit4]    > Caused by: java.lang.AssertionError: sub reader _6(4.0):c48/8 wasn't warmed:
{SegmentCoreReader(owner=_d(4.0):C1)=true}
   [junit4]    > 	at org.junit.Assert.fail(Assert.java:93)
   [junit4]    > 	at org.junit.Assert.assertTrue(Assert.java:43)
   [junit4]    > 	at org.apache.lucene.index.ThreadedIndexingAndSearchingTestCase$2.run(ThreadedIndexingAndSearchingTestCase.java:347)
   [junit4]    > Throwable #4: java.lang.RuntimeException: Thread threw an uncaught exception,
thread: Thread[Thread-1151,5,]
   [junit4]    > 	at com.carrotsearch.randomizedtesting.RunnerThreadGroup.processUncaught(RunnerThreadGroup.java:96)
   [junit4]    > 	at com.carrotsearch.randomizedtesting.RandomizedRunner.runSingleTest(RandomizedRunner.java:857)
   [junit4]    > 	at com.carrotsearch.randomizedtesting.RandomizedRunner.access$700(RandomizedRunner.java:132)
   [junit4]    > 	at com.carrotsearch.randomizedtesting.RandomizedRunner$3$1.run(RandomizedRunner.java:669)
   [junit4]    > 	at com.carrotsearch.randomizedtesting.RandomizedRunner$3.evaluate(RandomizedRunner.java:695)
   [junit4]    > 	at com.carrotsearch.randomizedtesting.RandomizedRunner$4.evaluate(RandomizedRunner.java:734)
   [junit4]    > 	at com.carrotsearch.randomizedtesting.RandomizedRunner$5.evaluate(RandomizedRunner.java:745)
   [junit4]    > 	at org.apache.lucene.util.AbstractBeforeAfterRule$1.evaluate(AbstractBeforeAfterRule.java:45)
   [junit4]    > 	at org.apache.lucene.util.TestRuleReportUncaughtExceptions$1.evaluate(TestRuleReportUncaughtExceptions.java:68)
   [junit4]    > 	at org.apache.lucene.util.TestRuleStoreClassName$1.evaluate(TestRuleStoreClassName.java:38)
   [junit4]    > 	at org.apache.lucene.util.TestRuleIcuHack$1.evaluate(TestRuleIcuHack.java:51)
   [junit4]    > 	at com.carrotsearch.randomizedtesting.rules.SystemPropertiesInvariantRule$1.evaluate(SystemPropertiesInvariantRule.java:55)
   [junit4]    > 	at org.apache.lucene.util.TestRuleNoInstanceHooksOverrides$1.evaluate(TestRuleNoInstanceHooksOverrides.java:53)
   [junit4]    > 	at org.apache.lucene.util.TestRuleNoStaticHooksShadowing$1.evaluate(TestRuleNoStaticHooksShadowing.java:52)
   [junit4]    > 	at org.apache.lucene.util.TestRuleAssertionsRequired$1.evaluate(TestRuleAssertionsRequired.java:36)
   [junit4]    > 	at org.apache.lucene.util.TestRuleMarkFailure$1.evaluate(TestRuleMarkFailure.java:48)
   [junit4]    > 	at org.apache.lucene.util.TestRuleIgnoreTestSuites$1.evaluate(TestRuleIgnoreTestSuites.java:56)
   [junit4]    > 	at com.carrotsearch.randomizedtesting.RandomizedRunner.runSuite(RandomizedRunner.java:605)
   [junit4]    > 	at com.carrotsearch.randomizedtesting.RandomizedRunner.access$400(RandomizedRunner.java:132)
   [junit4]    > 	at com.carrotsearch.randomizedtesting.RandomizedRunner$2.run(RandomizedRunner.java:551)
   [junit4]    > Caused by: java.lang.RuntimeException: java.lang.AssertionError: sub reader
_6(4.0):c48/8 wasn't warmed: {SegmentCoreReader(owner=_d(4.0):C1)=true}
   [junit4]    > 	at __randomizedtesting.SeedInfo.seed([55CFB6B28705E6A1]:0)
   [junit4]    > 	at org.apache.lucene.index.ThreadedIndexingAndSearchingTestCase$2.run(ThreadedIndexingAndSearchingTestCase.java:397)
   [junit4]    > Caused by: java.lang.AssertionError: sub reader _6(4.0):c48/8 wasn't warmed:
{SegmentCoreReader(owner=_d(4.0):C1)=true}
   [junit4]    > 	at org.junit.Assert.fail(Assert.java:93)
   [junit4]    > 	at org.junit.Assert.assertTrue(Assert.java:43)
   [junit4]    > 	at org.apache.lucene.index.ThreadedIndexingAndSearchingTestCase$2.run(ThreadedIndexingAndSearchingTestCase.java:347)
   [junit4]    > 
   [junit4]   1> Thread-1149: hit exc
   [junit4]   1> Thread-1150: hit exc
   [junit4]   1> java.lang.AssertionError: sub reader _6(4.0):c48/8 wasn't warmed: {SegmentCoreReader(owner=_d(4.0):C1)=true}
   [junit4]   1> 	at org.junit.Assert.fail(Assert.java:93)
   [junit4]   1> 	at org.junit.Assert.assertTrue(Assert.java:43)
   [junit4]   1> 	at org.apache.lucene.index.ThreadedIndexingAndSearchingTestCase$2.run(ThreadedIndexingAndSearchingTestCase.java:347)
   [junit4]   1> Thread-1151: hit exc
   [junit4]   1> java.lang.AssertionError: sub reader _6(4.0):c48/8 wasn't warmed: {SegmentCoreReader(owner=_d(4.0):C1)=true}
   [junit4]   1> 	at org.junit.Assert.fail(Assert.java:93)
   [junit4]   1> 	at org.junit.Assert.assertTrue(Assert.java:43)
   [junit4]   1> 	at org.apache.lucene.index.ThreadedIndexingAndSearchingTestCase$2.run(ThreadedIndexingAndSearchingTestCase.java:347)
   [junit4]   1> java.lang.AssertionError: sub reader _6(4.0):c48/8 wasn't warmed: {SegmentCoreReader(owner=_d(4.0):C1)=true}
   [junit4]   1> 	at org.junit.Assert.fail(Assert.java:93)
   [junit4]   1> 	at org.junit.Assert.assertTrue(Assert.java:43)
   [junit4]   1> 	at org.apache.lucene.index.ThreadedIndexingAndSearchingTestCase$2.run(ThreadedIndexingAndSearchingTestCase.java:347)
   [junit4]   2> NOTE: reproduce with: ant test  -Dtestcase=TestNRTThreads -Dtests.method=testNRTThreads
-Dtests.seed=55CFB6B28705E6A1 -Dtests.multiplier=3 -Dtests.locale=es_EC -Dtests.timezone=Africa/Niamey
-Dargs="-Dfile.encoding=UTF-8"
   [junit4]   1> 
   [junit4]   2>
   [junit4]    > (@AfterClass output)
   [junit4]   2> NOTE: test params are: codec=Lucene40: {extra12=Lucene40(minBlockSize=41
maxBlockSize=89), body=Lucene40(minBlockSize=41 maxBlockSize=89), extra11=PostingsFormat(name=NestedPulsing),
extra27=Pulsing40(freqCutoff=12 minBlockSize=41 maxBlockSize=89), extra26=Lucene40(minBlockSize=41
maxBlockSize=89), extra16=MockFixedIntBlock(blockSize=202), packID=PostingsFormat(name=Lucene40WithOrds),
extra0=PostingsFormat(name=NestedPulsing), extra1=Lucene40(minBlockSize=41 maxBlockSize=89),
date=PostingsFormat(name=NestedPulsing), extra6=PostingsFormat(name=MockRandom), extra7=MockVariableIntBlock(baseBlockSize=44),
docid=Pulsing40(freqCutoff=6 minBlockSize=41 maxBlockSize=89), title=Pulsing40(freqCutoff=12
minBlockSize=41 maxBlockSize=89), titleTokenized=PostingsFormat(name=MockRandom), extra31=PostingsFormat(name=MockSep),
extra32=MockFixedIntBlock(blockSize=202), extra10=PostingsFormat(name=MockSep)}, sim=DefaultSimilarity,
locale=es_EC, timezone=Africa/Niamey
   [junit4]   2> NOTE: Linux 2.6.32-41-server amd64/Sun Microsystems Inc. 1.6.0_32 (64-bit)/cpus=8,threads=1,free=111970872,total=343539712
   [junit4]   2> NOTE: All tests run in this JVM: [TestNumericUtils, TestMultiThreadTermVectors,
TestPrefixFilter, ThrowInUncaught, TestNoMergeScheduler, TestPayloadProcessorProvider, TestVirtualMethod,
TestTypePromotion, Nested1, TestNumericTokenStream, TestGraphTokenizers, TestDeterminism,
TestQueryWrapperFilter, TestLookaheadTokenFilter, TestMinimize, TestByteSlices, TestTermScorer,
TestRegexpQuery, TestSearcherManager, TestSimpleAttributeImpl, TestMockAnalyzer, TestDocsAndPositions,
TestPositionIncrement, TestTermsEnum2, TestTransactions, TestForTooMuchCloning, TestIndexWriterNRTIsCurrent,
TestCrashCausesCorruptIndex, TestBinaryTerms, TestIsCurrent, TestRAMDirectory, TestSizeBoundedForceMerge,
TestDateFilter, InBeforeClass, InAfterClass, InTestMethod, NonStringProperties, TestCachingWrapperFilter,
TestSimilarity, TestTermInfosReaderIndex, TestCloseableThreadLocal, TestIndexInput, TestCustomNorms,
TestImpersonation, TestReaderClosed, Nested1, Nested2, Nested3, TestRandomStoredFields, TestScorerPerf,
TestDirectoryReader, TestParallelCompositeReader, TestDocumentsWriterDeleteQueue, TestBasics,
TestFieldCacheRangeFilter, TestOmitPositions, TestSpansAdvanced, TestOpenBitSet, TestBitVector,
TestDateTools, TestLazyProxSkipping, TestNGramPhraseQuery, TestFSTs, TestMergeSchedulerExternal,
TestExplanations, TestByteBlockPool, TestNumericRangeQuery32, TestMultiMMap, TestSimpleExplanationsOfNonMatches,
TestTimeLimitingCollector, TestCustomSearcherSort, TestPrefixInBooleanQuery, TestIndexFileDeleter,
TestFieldValueFilter, TestAppendingCodec, TestPostingsOffsets, TestDocIdSet, TestLock, TestUnicodeUtil,
TestIndexableField, TestDocTermOrds, TestWindowsMMap, TestDeletionPolicy, TestExternalCodecs,
TestDisjunctionMaxQuery, TestFileSwitchDirectory, TestPerFieldPostingsFormat, Test10KPulsings,
TestTermsEnum, TestWildcard, TestNamedSPILoader, TestFlushByRamOrCountsPolicy, TestAtomicUpdate,
TestStressIndexing, TestIndexWriterUnicode, TestSetOnce, TestBytesRefHash, TestConsistentFieldNumbers,
TestParallelAtomicReader, TestSimpleExplanations, TestMixedCodecs, TestFieldCacheRewriteMethod,
TestRecyclingByteBlockAllocator, TestPulsingReuse, TestDocumentWriter, TestDocBoost, TestArrayUtil,
TestNeverDelete, TestSegmentReader, TestIndexWriterWithThreads, TestDocValuesTypeCompatibility,
TestPrefixRandom, TestTopDocsMerge, TestLongPostings, Nested, TestIntsRef, TestSimilarityBase,
TestTermVectorsReader, TestNRTThreads]
   [junit4]   2> 
   [junit4] Completed on J0 in 0.31s, 1 test, 1 error <<< FAILURES!
[...truncated 154 lines...]

[...truncated 1694 lines...]

[...truncated 1694 lines...]

[...truncated 1694 lines...]

[...truncated 1694 lines...]

[...truncated 1694 lines...]



Mime
View raw message