lucene-dev mailing list archives

Site index · List index
Message view « Date » · « Thread »
Top « Date » · « Thread »
From jenk...@sd-datasolutions.de
Subject [JENKINS] Lucene-Solr-trunk-Windows-Java6-64 - Build # 429 - Failure!
Date Tue, 05 Jun 2012 10:23:04 GMT
Build: http://jenkins.sd-datasolutions.de/job/Lucene-Solr-trunk-Windows-Java6-64/429/

1 tests failed.
REGRESSION:  org.apache.solr.spelling.suggest.SuggesterTSTTest.testRebuild

Error Message:
Exception during query

Stack Trace:
java.lang.RuntimeException: Exception during query
	at __randomizedtesting.SeedInfo.seed([D9FA168D7C46E7DD:82DFB4CE48469D47]:0)
	at org.apache.solr.SolrTestCaseJ4.assertQ(SolrTestCaseJ4.java:459)
	at org.apache.solr.SolrTestCaseJ4.assertQ(SolrTestCaseJ4.java:426)
	at org.apache.solr.spelling.suggest.SuggesterTest.testRebuild(SuggesterTest.java:105)
	at sun.reflect.NativeMethodAccessorImpl.invoke0(Native Method)
	at sun.reflect.NativeMethodAccessorImpl.invoke(NativeMethodAccessorImpl.java:39)
	at sun.reflect.DelegatingMethodAccessorImpl.invoke(DelegatingMethodAccessorImpl.java:25)
	at java.lang.reflect.Method.invoke(Method.java:597)
	at com.carrotsearch.randomizedtesting.RandomizedRunner.invoke(RandomizedRunner.java:1969)
	at com.carrotsearch.randomizedtesting.RandomizedRunner.access$1100(RandomizedRunner.java:132)
	at com.carrotsearch.randomizedtesting.RandomizedRunner$6.evaluate(RandomizedRunner.java:814)
	at com.carrotsearch.randomizedtesting.RandomizedRunner$7.evaluate(RandomizedRunner.java:875)
	at com.carrotsearch.randomizedtesting.RandomizedRunner$8.evaluate(RandomizedRunner.java:889)
	at com.carrotsearch.randomizedtesting.rules.SystemPropertiesRestoreRule$1.evaluate(SystemPropertiesRestoreRule.java:53)
	at org.apache.lucene.util.TestRuleSetupTeardownChained$1.evaluate(TestRuleSetupTeardownChained.java:50)
	at org.apache.lucene.util.TestRuleFieldCacheSanity$1.evaluate(TestRuleFieldCacheSanity.java:32)
	at org.apache.lucene.util.AbstractBeforeAfterRule$1.evaluate(AbstractBeforeAfterRule.java:45)
	at com.carrotsearch.randomizedtesting.rules.SystemPropertiesInvariantRule$1.evaluate(SystemPropertiesInvariantRule.java:55)
	at org.apache.lucene.util.TestRuleReportUncaughtExceptions$1.evaluate(TestRuleReportUncaughtExceptions.java:68)
	at org.apache.lucene.util.TestRuleThreadAndTestName$1.evaluate(TestRuleThreadAndTestName.java:48)
	at org.apache.lucene.util.TestRuleMarkFailure$1.evaluate(TestRuleMarkFailure.java:48)
	at com.carrotsearch.randomizedtesting.RandomizedRunner.runSingleTest(RandomizedRunner.java:821)
	at com.carrotsearch.randomizedtesting.RandomizedRunner.access$700(RandomizedRunner.java:132)
	at com.carrotsearch.randomizedtesting.RandomizedRunner$3$1.run(RandomizedRunner.java:669)
	at com.carrotsearch.randomizedtesting.RandomizedRunner$3.evaluate(RandomizedRunner.java:695)
	at com.carrotsearch.randomizedtesting.RandomizedRunner$4.evaluate(RandomizedRunner.java:734)
	at com.carrotsearch.randomizedtesting.RandomizedRunner$5.evaluate(RandomizedRunner.java:745)
	at com.carrotsearch.randomizedtesting.rules.SystemPropertiesRestoreRule$1.evaluate(SystemPropertiesRestoreRule.java:53)
	at org.apache.lucene.util.AbstractBeforeAfterRule$1.evaluate(AbstractBeforeAfterRule.java:45)
	at org.apache.lucene.util.TestRuleReportUncaughtExceptions$1.evaluate(TestRuleReportUncaughtExceptions.java:68)
	at org.apache.lucene.util.TestRuleStoreClassName$1.evaluate(TestRuleStoreClassName.java:38)
	at org.apache.lucene.util.TestRuleIcuHack$1.evaluate(TestRuleIcuHack.java:51)
	at com.carrotsearch.randomizedtesting.rules.SystemPropertiesInvariantRule$1.evaluate(SystemPropertiesInvariantRule.java:55)
	at org.apache.lucene.util.TestRuleNoInstanceHooksOverrides$1.evaluate(TestRuleNoInstanceHooksOverrides.java:53)
	at org.apache.lucene.util.TestRuleNoStaticHooksShadowing$1.evaluate(TestRuleNoStaticHooksShadowing.java:52)
	at org.apache.lucene.util.TestRuleAssertionsRequired$1.evaluate(TestRuleAssertionsRequired.java:36)
	at org.apache.lucene.util.TestRuleMarkFailure$1.evaluate(TestRuleMarkFailure.java:48)
	at org.apache.lucene.util.TestRuleIgnoreTestSuites$1.evaluate(TestRuleIgnoreTestSuites.java:56)
	at com.carrotsearch.randomizedtesting.RandomizedRunner.runSuite(RandomizedRunner.java:605)
	at com.carrotsearch.randomizedtesting.RandomizedRunner.access$400(RandomizedRunner.java:132)
	at com.carrotsearch.randomizedtesting.RandomizedRunner$2.run(RandomizedRunner.java:551)
Caused by: java.lang.RuntimeException: REQUEST FAILED: xpath=//lst[@name='spellcheck']/lst[@name='suggestions']/lst[@name='ac']/int[@name='numFound'][.='2']
	xml response was: <?xml version="1.0" encoding="UTF-8"?>
<response>
<lst name="responseHeader"><int name="status">0</int><int name="QTime">0</int></lst><lst
name="spellcheck"><lst name="suggestions"/></lst>
</response>

	request was:q=ac&spellcheck.count=2&qt=/suggest_tst&spellcheck.onlyMorePopular=true
	at org.apache.solr.SolrTestCaseJ4.assertQ(SolrTestCaseJ4.java:452)
	... 39 more




Build Log:
[...truncated 10463 lines...]
   [junit4]   2> 
   [junit4]   2> 304 T3576 oashc.SpellCheckComponent$SpellCheckerListener.newSearcher Loading
spell index for spellchecker: suggest_fst
   [junit4]   2> 304 T3576 oasss.Suggester.reload reload()
   [junit4]   2> 304 T3576 oashc.SpellCheckComponent$SpellCheckerListener.newSearcher SEVERE
Exception in reloading spell check index for spellchecker: suggest_fst java.io.FileNotFoundException:
C:\Jenkins\workspace\Lucene-Solr-trunk-Windows-Java6-64\solr\build\solr-core\test\J0\.\solrtest-SuggesterTSTTest-1338891740429\suggest_fst\fst.bin
(The system cannot find the file specified)
   [junit4]   2> 	at java.io.FileInputStream.open(Native Method)
   [junit4]   2> 	at java.io.FileInputStream.<init>(FileInputStream.java:120)
   [junit4]   2> 	at org.apache.solr.spelling.suggest.Suggester.reload(Suggester.java:164)
   [junit4]   2> 	at org.apache.solr.handler.component.SpellCheckComponent$SpellCheckerListener.newSearcher(SpellCheckComponent.java:673)
   [junit4]   2> 	at org.apache.solr.core.SolrCore$3.call(SolrCore.java:1335)
   [junit4]   2> 	at java.util.concurrent.FutureTask$Sync.innerRun(FutureTask.java:303)
   [junit4]   2> 	at java.util.concurrent.FutureTask.run(FutureTask.java:138)
   [junit4]   2> 	at java.util.concurrent.ThreadPoolExecutor$Worker.runTask(ThreadPoolExecutor.java:886)
   [junit4]   2> 	at java.util.concurrent.ThreadPoolExecutor$Worker.run(ThreadPoolExecutor.java:908)
   [junit4]   2> 	at java.lang.Thread.run(Thread.java:662)
   [junit4]   2> 
   [junit4]   2> 304 T3576 oashc.SpellCheckComponent$SpellCheckerListener.newSearcher Loading
spell index for spellchecker: suggest_wfst
   [junit4]   2> 304 T3576 oasss.Suggester.reload reload()
   [junit4]   2> 304 T3576 oashc.SpellCheckComponent$SpellCheckerListener.newSearcher SEVERE
Exception in reloading spell check index for spellchecker: suggest_wfst java.io.FileNotFoundException:
C:\Jenkins\workspace\Lucene-Solr-trunk-Windows-Java6-64\solr\build\solr-core\test\J0\.\solrtest-SuggesterTSTTest-1338891740429\suggest_wfst\wfst.bin
(The system cannot find the file specified)
   [junit4]   2> 	at java.io.FileInputStream.open(Native Method)
   [junit4]   2> 	at java.io.FileInputStream.<init>(FileInputStream.java:120)
   [junit4]   2> 	at org.apache.solr.spelling.suggest.Suggester.reload(Suggester.java:164)
   [junit4]   2> 	at org.apache.solr.handler.component.SpellCheckComponent$SpellCheckerListener.newSearcher(SpellCheckComponent.java:673)
   [junit4]   2> 	at org.apache.solr.core.SolrCore$3.call(SolrCore.java:1335)
   [junit4]   2> 	at java.util.concurrent.FutureTask$Sync.innerRun(FutureTask.java:303)
   [junit4]   2> 	at java.util.concurrent.FutureTask.run(FutureTask.java:138)
   [junit4]   2> 	at java.util.concurrent.ThreadPoolExecutor$Worker.runTask(ThreadPoolExecutor.java:886)
   [junit4]   2> 	at java.util.concurrent.ThreadPoolExecutor$Worker.run(ThreadPoolExecutor.java:908)
   [junit4]   2> 	at java.lang.Thread.run(Thread.java:662)
   [junit4]   2> 
   [junit4]   2> 307 T3576 oasc.SolrCore.registerSearcher [collection1] Registered new
searcher Searcher@6c951a58 main{StandardDirectoryReader(segments_2:3 _0(5.0):C3)}
   [junit4]   2> 307 T3575 C218 UPDATE [collection1] webapp=null path=null params={} {commit=}
0 37
   [junit4]   2> 311 T3575 C218 REQ [collection1] webapp=null path=null params={q=ac&spellcheck.count=2&qt=/suggest_tst&spellcheck.onlyMorePopular=true}
status=0 QTime=0 
   [junit4]   2> 315 T3575 oas.SolrTestCaseJ4.assertQ SEVERE REQUEST FAILED: xpath=//lst[@name='spellcheck']/lst[@name='suggestions']/lst[@name='ac']/int[@name='numFound'][.='2']
   [junit4]   2> 		xml response was: <?xml version="1.0" encoding="UTF-8"?>
   [junit4]   2> 	<response>
   [junit4]   2> 	<lst name="responseHeader"><int name="status">0</int><int
name="QTime">0</int></lst><lst name="spellcheck"><lst name="suggestions"/></lst>
   [junit4]   2> 	</response>
   [junit4]   2> 	
   [junit4]   2> 		request was:q=ac&spellcheck.count=2&qt=/suggest_tst&spellcheck.onlyMorePopular=true
   [junit4]   2> 316 T3575 oasc.SolrException.log SEVERE REQUEST FAILED: q=ac&spellcheck.count=2&qt=/suggest_tst&spellcheck.onlyMorePopular=true:java.lang.RuntimeException:
REQUEST FAILED: xpath=//lst[@name='spellcheck']/lst[@name='suggestions']/lst[@name='ac']/int[@name='numFound'][.='2']
   [junit4]   2> 		xml response was: <?xml version="1.0" encoding="UTF-8"?>
   [junit4]   2> 	<response>
   [junit4]   2> 	<lst name="responseHeader"><int name="status">0</int><int
name="QTime">0</int></lst><lst name="spellcheck"><lst name="suggestions"/></lst>
   [junit4]   2> 	</response>
   [junit4]   2> 	
   [junit4]   2> 		request was:q=ac&spellcheck.count=2&qt=/suggest_tst&spellcheck.onlyMorePopular=true
   [junit4]   2> 		at org.apache.solr.SolrTestCaseJ4.assertQ(SolrTestCaseJ4.java:452)
   [junit4]   2> 		at org.apache.solr.SolrTestCaseJ4.assertQ(SolrTestCaseJ4.java:426)
   [junit4]   2> 		at org.apache.solr.spelling.suggest.SuggesterTest.testRebuild(SuggesterTest.java:105)
   [junit4]   2> 		at sun.reflect.NativeMethodAccessorImpl.invoke0(Native Method)
   [junit4]   2> 		at sun.reflect.NativeMethodAccessorImpl.invoke(NativeMethodAccessorImpl.java:39)
   [junit4]   2> 		at sun.reflect.DelegatingMethodAccessorImpl.invoke(DelegatingMethodAccessorImpl.java:25)
   [junit4]   2> 		at java.lang.reflect.Method.invoke(Method.java:597)
   [junit4]   2> 		at com.carrotsearch.randomizedtesting.RandomizedRunner.invoke(RandomizedRunner.java:1969)
   [junit4]   2> 		at com.carrotsearch.randomizedtesting.RandomizedRunner.access$1100(RandomizedRunner.java:132)
   [junit4]   2> 		at com.carrotsearch.randomizedtesting.RandomizedRunner$6.evaluate(RandomizedRunner.java:814)
   [junit4]   2> 		at com.carrotsearch.randomizedtesting.RandomizedRunner$7.evaluate(RandomizedRunner.java:875)
   [junit4]   2> 		at com.carrotsearch.randomizedtesting.RandomizedRunner$8.evaluate(RandomizedRunner.java:889)
   [junit4]   2> 		at com.carrotsearch.randomizedtesting.rules.SystemPropertiesRestoreRule$1.evaluate(SystemPropertiesRestoreRule.java:53)
   [junit4]   2> 		at org.apache.lucene.util.TestRuleSetupTeardownChained$1.evaluate(TestRuleSetupTeardownChained.java:50)
   [junit4]   2> 		at org.apache.lucene.util.TestRuleFieldCacheSanity$1.evaluate(TestRuleFieldCacheSanity.java:32)
   [junit4]   2> 		at org.apache.lucene.util.AbstractBeforeAfterRule$1.evaluate(AbstractBeforeAfterRule.java:45)
   [junit4]   2> 		at com.carrotsearch.randomizedtesting.rules.SystemPropertiesInvariantRule$1.evaluate(SystemPropertiesInvariantRule.java:55)
   [junit4]   2> 		at org.apache.lucene.util.TestRuleReportUncaughtExceptions$1.evaluate(TestRuleReportUncaughtExceptions.java:68)
   [junit4]   2> 		at org.apache.lucene.util.TestRuleThreadAndTestName$1.evaluate(TestRuleThreadAndTestName.java:48)
   [junit4]   2> 		at org.apache.lucene.util.TestRuleMarkFailure$1.evaluate(TestRuleMarkFailure.java:48)
   [junit4]   2> 		at com.carrotsearch.randomizedtesting.RandomizedRunner.runSingleTest(RandomizedRunner.java:821)
   [junit4]   2> 		at com.carrotsearch.randomizedtesting.RandomizedRunner.access$700(RandomizedRunner.java:132)
   [junit4]   2> 		at com.carrotsearch.randomizedtesting.RandomizedRunner$3$1.run(RandomizedRunner.java:669)
   [junit4]   2> 		at com.carrotsearch.randomizedtesting.RandomizedRunner$3.evaluate(RandomizedRunner.java:695)
   [junit4]   2> 		at com.carrotsearch.randomizedtesting.RandomizedRunner$4.evaluate(RandomizedRunner.java:734)
   [junit4]   2> 		at com.carrotsearch.randomizedtesting.RandomizedRunner$5.evaluate(RandomizedRunner.java:745)
   [junit4]   2> 		at com.carrotsearch.randomizedtesting.rules.SystemPropertiesRestoreRule$1.evaluate(SystemPropertiesRestoreRule.java:53)
   [junit4]   2> 		at org.apache.lucene.util.AbstractBeforeAfterRule$1.evaluate(AbstractBeforeAfterRule.java:45)
   [junit4]   2> 		at org.apache.lucene.util.TestRuleReportUncaughtExceptions$1.evaluate(TestRuleReportUncaughtExceptions.java:68)
   [junit4]   2> 		at org.apache.lucene.util.TestRuleStoreClassName$1.evaluate(TestRuleStoreClassName.java:38)
   [junit4]   2> 		at org.apache.lucene.util.TestRuleIcuHack$1.evaluate(TestRuleIcuHack.java:51)
   [junit4]   2> 		at com.carrotsearch.randomizedtesting.rules.SystemPropertiesInvariantRule$1.evaluate(SystemPropertiesInvariantRule.java:55)
   [junit4]   2> 		at org.apache.lucene.util.TestRuleNoInstanceHooksOverrides$1.evaluate(TestRuleNoInstanceHooksOverrides.java:53)
   [junit4]   2> 		at org.apache.lucene.util.TestRuleNoStaticHooksShadowing$1.evaluate(TestRuleNoStaticHooksShadowing.java:52)
   [junit4]   2> 		at org.apache.lucene.util.TestRuleAssertionsRequired$1.evaluate(TestRuleAssertionsRequired.java:36)
   [junit4]   2> 		at org.apache.lucene.util.TestRuleMarkFailure$1.evaluate(TestRuleMarkFailure.java:48)
   [junit4]   2> 		at org.apache.lucene.util.TestRuleIgnoreTestSuites$1.evaluate(TestRuleIgnoreTestSuites.java:56)
   [junit4]   2> 		at com.carrotsearch.randomizedtesting.RandomizedRunner.runSuite(RandomizedRunner.java:605)
   [junit4]   2> 		at com.carrotsearch.randomizedtesting.RandomizedRunner.access$400(RandomizedRunner.java:132)
   [junit4]   2> 		at com.carrotsearch.randomizedtesting.RandomizedRunner$2.run(RandomizedRunner.java:551)
   [junit4]   2> 	
   [junit4]   2> 317 T3575 oas.SolrTestCaseJ4.tearDown ###Ending testRebuild
   [junit4]   2> NOTE: reproduce with: ant test  -Dtestcase=SuggesterTSTTest -Dtests.method=testRebuild
-Dtests.seed=D9FA168D7C46E7DD -Dtests.locale=be_BY -Dtests.timezone=America/Cancun -Dargs="-Dfile.encoding=Cp1252"
   [junit4]   2>
   [junit4]    > (@AfterClass output)
   [junit4]   2> 1570 T3575 oas.SolrTestCaseJ4.deleteCore ###deleteCore
   [junit4]   2> 1571 T3575 oasc.CoreContainer.shutdown Shutting down CoreContainer instance=366101980
   [junit4]   2> 1571 T3575 oasc.SolrCore.close [collection1]  CLOSING SolrCore org.apache.solr.core.SolrCore@6a846f66
   [junit4]   2> 1571 T3575 oasc.SolrCore.closeSearcher [collection1] Closing main searcher
on request.
   [junit4]   2> 1572 T3575 oasu.DirectUpdateHandler2.close closing DirectUpdateHandler2{commits=1,autocommits=0,soft
autocommits=0,optimizes=0,rollbacks=0,expungeDeletes=0,docsPending=0,adds=0,deletesById=0,deletesByQuery=0,errors=0,cumulative_adds=3,cumulative_deletesById=0,cumulative_deletesByQuery=0,cumulative_errors=0}
   [junit4]   2> NOTE: test params are: codec=Lucene40: {}, sim=DefaultSimilarity, locale=be_BY,
timezone=America/Cancun
   [junit4]   2> NOTE: Windows 7 6.1 amd64/Sun Microsystems Inc. 1.6.0_32 (64-bit)/cpus=2,threads=1,free=133133160,total=287637504
   [junit4]   2> NOTE: All tests run in this JVM: [HighlighterTest, CoreAdminHandlerTest,
DOMUtilTest, TestDocSet, TestBeiderMorseFilterFactory, OverseerTest, TestBulgarianStemFilterFactory,
BadIndexSchemaTest, TestTypeTokenFilterFactory, TestNumberUtils, TestRangeQuery, TestSwedishLightStemFilterFactory,
UpdateRequestProcessorFactoryTest, CSVRequestHandlerTest, SolrRequestParserTest, TestPortugueseStemFilterFactory,
SolrCmdDistributorTest, TestSolrDeletionPolicy1, TestJmxIntegration, MBeansHandlerTest, TestPatternTokenizerFactory,
TestDictionaryCompoundWordTokenFilterFactory, SampleTest, TestRemoveDuplicatesTokenFilterFactory,
TestGroupingSearch, XsltUpdateRequestHandlerTest, DirectSolrConnectionTest, TestWriterPerf,
DateMathParserTest, SortByFunctionTest, TestTurkishLowerCaseFilterFactory, MinimalSchemaTest,
MultiTermTest, SolrInfoMBeanTest, TestMultiWordSynonyms, TestWikipediaTokenizerFactory, FullSolrCloudDistribCmdsTest,
SpellPossibilityIteratorTest, TestQuerySenderNoQuery, ReturnFieldsTest, PeerSyncTest, TestSearchPerf,
TestValueSourceCache, TestDefaultSimilarityFactory, DistanceFunctionTest, SignatureUpdateProcessorFactoryTest,
TestSort, TestKStemFilterFactory, TestFrenchLightStemFilterFactory, TestWordDelimiterFilterFactory,
MoreLikeThisHandlerTest, BasicFunctionalityTest, SpellCheckComponentTest, TestJapaneseBaseFormFilterFactory,
TestCzechStemFilterFactory, TestRealTimeGet, TestDistributedSearch, IndexSchemaRuntimeFieldTest,
SolrPluginUtilsTest, TestCJKBigramFilterFactory, ConvertedLegacyTest, TestHTMLStripCharFilterFactory,
TestPersianNormalizationFilterFactory, TestJapaneseTokenizerFactory, SuggesterFSTTest, TimeZoneUtilsTest,
DefaultValueUpdateProcessorTest, NotRequiredUniqueKeyTest, TestSystemIdResolver, TestUpdate,
SolrCoreCheckLockOnStartupTest, JsonLoaderTest, TestPatternReplaceFilterFactory, TestPhoneticFilterFactory,
ZkSolrClientTest, TestFinnishLightStemFilterFactory, TestSpanishLightStemFilterFactory, TestRandomFaceting,
UpdateParamsTest, LukeRequestHandlerTest, LengthFilterTest, FullSolrCloudTest, PluginInfoTest,
StandardRequestHandlerTest, DisMaxRequestHandlerTest, SystemInfoHandlerTest, TestStemmerOverrideFilterFactory,
TestPropInjectDefaults, TestGermanStemFilterFactory, TestUtils, ZkNodePropsTest, QueryElevationComponentTest,
DoubleMetaphoneFilterFactoryTest, OpenExchangeRatesOrgProviderTest, CacheHeaderTest, TestIBSimilarityFactory,
DirectSolrSpellCheckerTest, TestLFUCache, HighlighterConfigTest, BadComponentTest, TestPluginEnable,
TestExtendedDismaxParser, TestIndonesianStemFilterFactory, IndexReaderFactoryTest, TestBadConfig,
TestDFRSimilarityFactory, TestConfig, TestSolrDeletionPolicy2, BinaryUpdateRequestHandlerTest,
TestCSVResponseWriter, TestMappingCharFilterFactory, TestBinaryField, TestFoldingMultitermQuery,
TestGalicianStemFilterFactory, TestItalianLightStemFilterFactory, UUIDFieldTest, DocumentAnalysisRequestHandlerTest,
AlternateDirectoryTest, LeaderElectionIntegrationTest, TestPerFieldSimilarity, RecoveryZkTest,
OutputWriterTest, TestReplicationHandler, TestJapanesePartOfSpeechStopFilterFactory, RequestHandlersTest,
URLClassifyProcessorTest, TestPhraseSuggestions, AutoCommitTest, TestArabicFilters, JSONWriterTest,
CloudStateTest, TermsComponentTest, TestSuggestSpellingConverter, ResourceLoaderTest, FileUtilsTest,
TestHashPartitioner, DirectUpdateHandlerOptimizeTest, DebugComponentTest, TestPortugueseMinimalStemFilterFactory,
TestPropInject, FieldMutatingUpdateProcessorTest, TestCodecSupport, TestBrazilianStemFilterFactory,
ShowFileRequestHandlerTest, CloudStateUpdateTest, DateFieldTest, TestCoreContainer, TestPatternReplaceCharFilterFactory,
TestFrenchMinimalStemFilterFactory, TestGermanNormalizationFilterFactory, SnowballPorterFilterFactoryTest,
TermVectorComponentTest, TestLMJelinekMercerSimilarityFactory, TestKeepFilterFactory, FastVectorHighlighterTest,
BasicZkTest, TestSurroundQueryParser, CommonGramsFilterFactoryTest, TestBM25SimilarityFactory,
TestGermanMinimalStemFilterFactory, TestNorwegianMinimalStemFilterFactory, CurrencyFieldTest,
TestEnglishMinimalStemFilterFactory, TestPorterStemFilterFactory, TestSynonymFilterFactory,
RequiredFieldsTest, TestIndexingPerformance, TestStandardFactories, TestQueryUtils, TestLatvianStemFilterFactory,
TestSolrQueryParser, DocumentBuilderTest, TestNGramFilters, TestQueryTypes, TestMergePolicyConfig,
TestJmxMonitoredMap, TestFastLRUCache, TestShingleFilterFactory, TestNorwegianLightStemFilterFactory,
PrimUtilsTest, LoggingHandlerTest, SoftAutoCommitTest, TestHungarianLightStemFilterFactory,
TestOmitPositions, IndexSchemaTest, TestRecovery, SpatialFilterTest, SearchHandlerTest, TestFiltering,
EchoParamsTest, TestHindiFilters, TestKeywordMarkerFilterFactory, PrimitiveFieldTypeTest,
SpellCheckCollatorTest, SimpleFacetsTest, BasicDistributedZkTest, WordBreakSolrSpellCheckerTest,
TestDistributedGrouping, TestGreekLowerCaseFilterFactory, TestMultiCoreConfBootstrap, TestQuerySenderListener,
LeaderElectionTest, NodeStateWatcherTest, DistributedSpellCheckComponentTest, DistributedTermsComponentTest,
TestJoin, TestFaceting, ZkControllerTest, DirectUpdateHandlerTest, TestFunctionQuery, DistributedQueryElevationComponentTest,
TestTrie, SolrCoreTest, StatsComponentTest, SuggesterTest, IndexBasedSpellCheckerTest, TestPseudoReturnFields,
TestLMDirichletSimilarityFactory, UniqFieldsUpdateProcessorFactoryTest, TestRemoteStreaming,
SuggesterTSTTest]
   [junit4]   2> 
   [junit4] Completed in 1.60s, 4 tests, 1 error <<< FAILURES!
[...truncated 169 lines...]

[...truncated 10733 lines...]

[...truncated 10733 lines...]

[...truncated 10733 lines...]


Mime
View raw message