lucene-dev mailing list archives

Site index · List index
Message view « Date » · « Thread »
Top « Date » · « Thread »
From jenk...@sd-datasolutions.de
Subject [JENKINS] Lucene-Solr-4.x-Windows-Java6-64 - Build # 63 - Failure!
Date Wed, 13 Jun 2012 09:50:40 GMT
Build: http://jenkins.sd-datasolutions.de/job/Lucene-Solr-4.x-Windows-Java6-64/63/

2 tests failed.
REGRESSION:  org.apache.solr.cloud.LeaderElectionTest.testStressElection

Error Message:
Could not get leader props

Stack Trace:
java.lang.RuntimeException: Could not get leader props
	at __randomizedtesting.SeedInfo.seed([620F9E32BEC15560:9D594A9CD98F4473]:0)
	at org.apache.solr.cloud.LeaderElectionTest.getLeaderUrl(LeaderElectionTest.java:210)
	at org.apache.solr.cloud.LeaderElectionTest.getLeaderThread(LeaderElectionTest.java:309)
	at org.apache.solr.cloud.LeaderElectionTest.testStressElection(LeaderElectionTest.java:421)
	at sun.reflect.NativeMethodAccessorImpl.invoke0(Native Method)
	at sun.reflect.NativeMethodAccessorImpl.invoke(NativeMethodAccessorImpl.java:39)
	at sun.reflect.DelegatingMethodAccessorImpl.invoke(DelegatingMethodAccessorImpl.java:25)
	at java.lang.reflect.Method.invoke(Method.java:597)
	at com.carrotsearch.randomizedtesting.RandomizedRunner.invoke(RandomizedRunner.java:1969)
	at com.carrotsearch.randomizedtesting.RandomizedRunner.access$1100(RandomizedRunner.java:132)
	at com.carrotsearch.randomizedtesting.RandomizedRunner$6.evaluate(RandomizedRunner.java:814)
	at com.carrotsearch.randomizedtesting.RandomizedRunner$7.evaluate(RandomizedRunner.java:875)
	at com.carrotsearch.randomizedtesting.RandomizedRunner$8.evaluate(RandomizedRunner.java:889)
	at com.carrotsearch.randomizedtesting.rules.SystemPropertiesRestoreRule$1.evaluate(SystemPropertiesRestoreRule.java:53)
	at org.apache.lucene.util.TestRuleSetupTeardownChained$1.evaluate(TestRuleSetupTeardownChained.java:50)
	at org.apache.lucene.util.TestRuleFieldCacheSanity$1.evaluate(TestRuleFieldCacheSanity.java:32)
	at org.apache.lucene.util.AbstractBeforeAfterRule$1.evaluate(AbstractBeforeAfterRule.java:45)
	at com.carrotsearch.randomizedtesting.rules.SystemPropertiesInvariantRule$1.evaluate(SystemPropertiesInvariantRule.java:55)
	at org.apache.lucene.util.TestRuleReportUncaughtExceptions$1.evaluate(TestRuleReportUncaughtExceptions.java:68)
	at org.apache.lucene.util.TestRuleThreadAndTestName$1.evaluate(TestRuleThreadAndTestName.java:48)
	at org.apache.lucene.util.TestRuleMarkFailure$1.evaluate(TestRuleMarkFailure.java:48)
	at com.carrotsearch.randomizedtesting.RandomizedRunner.runSingleTest(RandomizedRunner.java:821)
	at com.carrotsearch.randomizedtesting.RandomizedRunner.access$700(RandomizedRunner.java:132)
	at com.carrotsearch.randomizedtesting.RandomizedRunner$3$1.run(RandomizedRunner.java:669)
	at com.carrotsearch.randomizedtesting.RandomizedRunner$3.evaluate(RandomizedRunner.java:695)
	at com.carrotsearch.randomizedtesting.RandomizedRunner$4.evaluate(RandomizedRunner.java:734)
	at com.carrotsearch.randomizedtesting.RandomizedRunner$5.evaluate(RandomizedRunner.java:745)
	at com.carrotsearch.randomizedtesting.rules.SystemPropertiesRestoreRule$1.evaluate(SystemPropertiesRestoreRule.java:53)
	at org.apache.lucene.util.AbstractBeforeAfterRule$1.evaluate(AbstractBeforeAfterRule.java:45)
	at org.apache.lucene.util.TestRuleReportUncaughtExceptions$1.evaluate(TestRuleReportUncaughtExceptions.java:68)
	at org.apache.lucene.util.TestRuleStoreClassName$1.evaluate(TestRuleStoreClassName.java:38)
	at org.apache.lucene.util.TestRuleIcuHack$1.evaluate(TestRuleIcuHack.java:51)
	at com.carrotsearch.randomizedtesting.rules.SystemPropertiesInvariantRule$1.evaluate(SystemPropertiesInvariantRule.java:55)
	at org.apache.lucene.util.TestRuleNoInstanceHooksOverrides$1.evaluate(TestRuleNoInstanceHooksOverrides.java:53)
	at org.apache.lucene.util.TestRuleNoStaticHooksShadowing$1.evaluate(TestRuleNoStaticHooksShadowing.java:52)
	at org.apache.lucene.util.TestRuleAssertionsRequired$1.evaluate(TestRuleAssertionsRequired.java:36)
	at org.apache.lucene.util.TestRuleMarkFailure$1.evaluate(TestRuleMarkFailure.java:48)
	at org.apache.lucene.util.TestRuleIgnoreTestSuites$1.evaluate(TestRuleIgnoreTestSuites.java:56)
	at com.carrotsearch.randomizedtesting.RandomizedRunner.runSuite(RandomizedRunner.java:605)
	at com.carrotsearch.randomizedtesting.RandomizedRunner.access$400(RandomizedRunner.java:132)
	at com.carrotsearch.randomizedtesting.RandomizedRunner$2.run(RandomizedRunner.java:551)


FAILED:  junit.framework.TestSuite.org.apache.solr.cloud.LeaderElectionTest

Error Message:
ERROR: SolrZkClient opens=52 closes=50

Stack Trace:
java.lang.AssertionError: ERROR: SolrZkClient opens=52 closes=50
	at __randomizedtesting.SeedInfo.seed([620F9E32BEC15560]:0)
	at org.junit.Assert.fail(Assert.java:93)
	at org.apache.solr.SolrTestCaseJ4.endTrackingZkClients(SolrTestCaseJ4.java:204)
	at org.apache.solr.SolrTestCaseJ4.afterClass(SolrTestCaseJ4.java:83)
	at sun.reflect.GeneratedMethodAccessor15.invoke(Unknown Source)
	at sun.reflect.DelegatingMethodAccessorImpl.invoke(DelegatingMethodAccessorImpl.java:25)
	at java.lang.reflect.Method.invoke(Method.java:597)
	at com.carrotsearch.randomizedtesting.RandomizedRunner.invoke(RandomizedRunner.java:1969)
	at com.carrotsearch.randomizedtesting.RandomizedRunner.access$1100(RandomizedRunner.java:132)
	at com.carrotsearch.randomizedtesting.RandomizedRunner$5.evaluate(RandomizedRunner.java:752)
	at com.carrotsearch.randomizedtesting.rules.SystemPropertiesRestoreRule$1.evaluate(SystemPropertiesRestoreRule.java:53)
	at org.apache.lucene.util.AbstractBeforeAfterRule$1.evaluate(AbstractBeforeAfterRule.java:45)
	at org.apache.lucene.util.TestRuleReportUncaughtExceptions$1.evaluate(TestRuleReportUncaughtExceptions.java:68)
	at org.apache.lucene.util.TestRuleStoreClassName$1.evaluate(TestRuleStoreClassName.java:38)
	at org.apache.lucene.util.TestRuleIcuHack$1.evaluate(TestRuleIcuHack.java:51)
	at com.carrotsearch.randomizedtesting.rules.SystemPropertiesInvariantRule$1.evaluate(SystemPropertiesInvariantRule.java:55)
	at org.apache.lucene.util.TestRuleNoInstanceHooksOverrides$1.evaluate(TestRuleNoInstanceHooksOverrides.java:53)
	at org.apache.lucene.util.TestRuleNoStaticHooksShadowing$1.evaluate(TestRuleNoStaticHooksShadowing.java:52)
	at org.apache.lucene.util.TestRuleAssertionsRequired$1.evaluate(TestRuleAssertionsRequired.java:36)
	at org.apache.lucene.util.TestRuleMarkFailure$1.evaluate(TestRuleMarkFailure.java:48)
	at org.apache.lucene.util.TestRuleIgnoreTestSuites$1.evaluate(TestRuleIgnoreTestSuites.java:56)
	at com.carrotsearch.randomizedtesting.RandomizedRunner.runSuite(RandomizedRunner.java:605)
	at com.carrotsearch.randomizedtesting.RandomizedRunner.access$400(RandomizedRunner.java:132)
	at com.carrotsearch.randomizedtesting.RandomizedRunner$2.run(RandomizedRunner.java:551)




Build Log:
[...truncated 10660 lines...]
   [junit4]   2> 	at sun.nio.ch.SocketChannelImpl.checkConnect(Native Method)
   [junit4]   2> 	at sun.nio.ch.SocketChannelImpl.finishConnect(SocketChannelImpl.java:599)
   [junit4]   2> 	at org.apache.zookeeper.ClientCnxn$SendThread.run(ClientCnxn.java:1146)
   [junit4]   2> 
   [junit4]   2> 56116 T896 oaz.ClientCnxn$SendThread.startConnect Opening socket connection
to server 127.0.0.1/127.0.0.1:50473
   [junit4]   2> 56906 T896 oaz.ClientCnxn$SendThread.run WARNING Session 0x137e53200f80010
for server null, unexpected error, closing socket connection and attempting reconnect java.net.ConnectException:
Connection refused: no further information
   [junit4]   2> 	at sun.nio.ch.SocketChannelImpl.checkConnect(Native Method)
   [junit4]   2> 	at sun.nio.ch.SocketChannelImpl.finishConnect(SocketChannelImpl.java:599)
   [junit4]   2> 	at org.apache.zookeeper.ClientCnxn$SendThread.run(ClientCnxn.java:1146)
   [junit4]   2> 
   [junit4]   2> 58745 T896 oaz.ClientCnxn$SendThread.startConnect Opening socket connection
to server 127.0.0.1/127.0.0.1:50473
   [junit4]   2> 59532 T896 oaz.ClientCnxn$SendThread.run WARNING Session 0x137e53200f80010
for server null, unexpected error, closing socket connection and attempting reconnect java.net.ConnectException:
Connection refused: no further information
   [junit4]   2> 	at sun.nio.ch.SocketChannelImpl.checkConnect(Native Method)
   [junit4]   2> 	at sun.nio.ch.SocketChannelImpl.finishConnect(SocketChannelImpl.java:599)
   [junit4]   2> 	at org.apache.zookeeper.ClientCnxn$SendThread.run(ClientCnxn.java:1146)
   [junit4]   2> 
   [junit4]   2> 60679 T3187 oazs.PrepRequestProcessor.pRequest Processed session termination
for sessionid: 0x137e53c97d20008
   [junit4]   2> 60681 T3184 oazs.NIOServerCnxn.doIO WARNING EndOfStreamException: Unable
to read additional data from client sessionid 0x137e53c97d20008, likely client has closed
socket
   [junit4]   2> 60681 T3080 oaz.ZooKeeper.close Session: 0x137e53c97d20008 closed
   [junit4]   2> 60681 T3205 oaz.ClientCnxn$EventThread.run EventThread shut down
   [junit4]   2> 60682 T3184 oazs.NIOServerCnxn.closeSock Closed socket connection for
client /127.0.0.1:52383 which had sessionid 0x137e53c97d20008
   [junit4]   2> 60682 T3187 oazs.PrepRequestProcessor.run PrepRequestProcessor exited
loop!
   [junit4]   2> 60682 T3186 oazs.NIOServerCnxn.sendBuffer SEVERE Unexpected Exception:
 java.nio.channels.CancelledKeyException
   [junit4]   2> 	at sun.nio.ch.SelectionKeyImpl.ensureValid(SelectionKeyImpl.java:55)
   [junit4]   2> 	at sun.nio.ch.SelectionKeyImpl.interestOps(SelectionKeyImpl.java:64)
   [junit4]   2> 	at org.apache.zookeeper.server.NIOServerCnxn.sendBuffer(NIOServerCnxn.java:440)
   [junit4]   2> 	at org.apache.zookeeper.server.NIOServerCnxn.sendCloseSession(NIOServerCnxn.java:386)
   [junit4]   2> 	at org.apache.zookeeper.server.FinalRequestProcessor.processRequest(FinalRequestProcessor.java:369)
   [junit4]   2> 	at org.apache.zookeeper.server.SyncRequestProcessor.flush(SyncRequestProcessor.java:161)
   [junit4]   2> 	at org.apache.zookeeper.server.SyncRequestProcessor.run(SyncRequestProcessor.java:98)
   [junit4]   2> 
   [junit4]   2> 60682 T3186 oazs.SyncRequestProcessor.run SyncRequestProcessor exited!
   [junit4]   2> 60683 T3080 oazs.FinalRequestProcessor.shutdown shutdown of request processor
complete
   [junit4]   2> 61166 T3185 oazs.SessionTrackerImpl.run SessionTrackerImpl exited loop!
   [junit4]   2> 61425 T896 oaz.ClientCnxn$SendThread.startConnect Opening socket connection
to server 127.0.0.1/127.0.0.1:50473
   [junit4]   2> 62354 T896 oaz.ClientCnxn$SendThread.run WARNING Session 0x137e53200f80010
for server null, unexpected error, closing socket connection and attempting reconnect java.net.ConnectException:
Connection refused: no further information
   [junit4]   2> 	at sun.nio.ch.SocketChannelImpl.checkConnect(Native Method)
   [junit4]   2> 	at sun.nio.ch.SocketChannelImpl.finishConnect(SocketChannelImpl.java:599)
   [junit4]   2> 	at org.apache.zookeeper.ClientCnxn$SendThread.run(ClientCnxn.java:1146)
   [junit4]   2> 
   [junit4]   2> 62902 T3080 oazs.NIOServerCnxn.closeSock Closed socket connection for
client /127.0.0.1:52407 which had sessionid 0x137e53c97d2000e
   [junit4]   2> 62903 T3230 oaz.ClientCnxn$SendThread.run Unable to read additional data
from server sessionid 0x137e53c97d2000e, likely server has closed socket, closing socket connection
and attempting reconnect
   [junit4]   2> 62903 T3080 oazs.NIOServerCnxn.closeSock Closed socket connection for
client /127.0.0.1:52409 which had sessionid 0x137e53c97d2000f
   [junit4]   2> 62904 T3234 oaz.ClientCnxn$SendThread.run Unable to read additional data
from server sessionid 0x137e53c97d2000f, likely server has closed socket, closing socket connection
and attempting reconnect
   [junit4]   2> 62904 T3184 oazs.NIOServerCnxn$Factory.run WARNING Ignoring unexpected
runtime exception java.nio.channels.CancelledKeyException
   [junit4]   2> 	at sun.nio.ch.SelectionKeyImpl.ensureValid(SelectionKeyImpl.java:55)
   [junit4]   2> 	at sun.nio.ch.SelectionKeyImpl.readyOps(SelectionKeyImpl.java:69)
   [junit4]   2> 	at org.apache.zookeeper.server.NIOServerCnxn$Factory.run(NIOServerCnxn.java:241)
   [junit4]   2> 
   [junit4]   2> 62904 T3184 oazs.NIOServerCnxn$Factory.run NIOServerCnxn factory exited
run method
   [junit4]   2> 62907 T3080 oazs.FinalRequestProcessor.shutdown shutdown of request processor
complete
   [junit4]   2> 62907 T3080 oas.SolrTestCaseJ4.tearDown ###Ending testStressElection
   [junit4]   1> / (1)
   [junit4]   1>  /collections (1)
   [junit4]   1>   /collections/collection1 (2)
   [junit4]   1>    /collections/collection1/leader_elect (1)
   [junit4]   1>     /collections/collection1/leader_elect/shard1 (1)
   [junit4]   1>      /collections/collection1/leader_elect/shard1/election (2)
   [junit4]   1>       /collections/collection1/leader_elect/shard1/election/87790766164934670-5-n_0000000002
(0)
   [junit4]   1>       /collections/collection1/leader_elect/shard1/election/87790766164934671-6-n_0000000003
(0)
   [junit4]   1>    /collections/collection1/leaders (0)
   [junit4]   1> 
   [junit4]   2> NOTE: reproduce with: ant test  -Dtestcase=LeaderElectionTest -Dtests.method=testStressElection
-Dtests.seed=620F9E32BEC15560 -Dtests.locale=nl_BE -Dtests.timezone=Asia/Seoul -Dargs="-Dfile.encoding=Cp1252"
   [junit4]   1> 
   [junit4]   2>
   [junit4]    > (@AfterClass output)
   [junit4]   2> 62915 T3080 oas.SolrTestCaseJ4.deleteCore ###deleteCore
   [junit4]   2> 62920 T3080 oas.SolrTestCaseJ4.endTrackingZkClients SEVERE ERROR: SolrZkClient
opens=52 closes=50
   [junit4]   2> NOTE: test params are: codec=Lucene3x, sim=DefaultSimilarity, locale=nl_BE,
timezone=Asia/Seoul
   [junit4]   2> NOTE: Windows 7 6.1 amd64/Sun Microsystems Inc. 1.6.0_32 (64-bit)/cpus=2,threads=5,free=142489352,total=265945088
   [junit4]   2> NOTE: All tests run in this JVM: [FieldMutatingUpdateProcessorTest, TestStandardFactories,
TestRemoteStreaming, OutputWriterTest, TestSynonymMap, TestReversedWildcardFilterFactory,
RecoveryZkTest, TestCJKTokenizerFactory, SpellCheckCollatorTest, TestMultiCoreConfBootstrap,
NoCacheHeaderTest, CloudStateTest, TestLRUCache, TestGroupingSearch, TestFrenchLightStemFilterFactory,
TestCSVResponseWriter, TestPropInject, FieldAnalysisRequestHandlerTest, CacheHeaderTest, WordBreakSolrSpellCheckerTest,
TestGalicianMinimalStemFilterFactory, TestFoldingMultitermQuery, TestWordDelimiterFilterFactory,
SolrCmdDistributorTest, TestSuggestSpellingConverter, TestTrie, DirectUpdateHandlerOptimizeTest,
TestSolrCoreProperties, TestJapanesePartOfSpeechStopFilterFactory, UUIDFieldTest, TestSolrXMLSerializer,
RequestHandlersTest, ShowFileRequestHandlerTest, TestCzechStemFilterFactory, ResourceLoaderTest,
TestPseudoReturnFields, PeerSyncTest, TestFrenchMinimalStemFilterFactory, TestStemmerOverrideFilterFactory,
LeaderElectionIntegrationTest, QueryParsingTest, BadIndexSchemaTest, BasicFunctionalityTest,
TestPortugueseStemFilterFactory, PluginInfoTest, TestNGramFilters, TestQueryTypes, TestStopFilterFactory,
TestWriterPerf, TestLuceneMatchVersion, IndexSchemaTest, TestJapaneseKatakanaStemFilterFactory,
DistributedSpellCheckComponentTest, TestJoin, TestGermanStemFilterFactory, IndexBasedSpellCheckerTest,
TestTypeTokenFilterFactory, DistributedTermsComponentTest, TestValueSourceCache, PrimUtilsTest,
ConvertedLegacyTest, TestSpanishLightStemFilterFactory, TestThaiWordFilterFactory, SortByFunctionTest,
SolrInfoMBeanTest, TestXIncludeConfig, DoubleMetaphoneFilterFactoryTest, TestTrimFilterFactory,
DefaultValueUpdateProcessorTest, SuggesterTSTTest, JSONWriterTest, SnowballPorterFilterFactoryTest,
FullSolrCloudTest, BasicDistributedZkTest, DirectSolrSpellCheckerTest, NumericFieldsTest,
SpatialFilterTest, CurrencyFieldTest, TestCollationField, TestPHPSerializedResponseWriter,
TestMappingCharFilterFactory, FileUtilsTest, TestJapaneseBaseFormFilterFactory, TestArabicFilters,
TestCapitalizationFilterFactory, TestLMDirichletSimilarityFactory, TestKeepFilterFactory,
TestMultiWordSynonyms, TestFunctionQuery, DirectUpdateHandlerTest, TestPorterStemFilterFactory,
XsltUpdateRequestHandlerTest, SoftAutoCommitTest, TestReplicationHandler, BasicZkTest, TestBadConfig,
TestIndonesianStemFilterFactory, TestSolrQueryParser, TestLMJelinekMercerSimilarityFactory,
FastVectorHighlighterTest, TestGermanLightStemFilterFactory, SpellCheckComponentTest, TestQuerySenderNoQuery,
TestEnglishMinimalStemFilterFactory, TestBulgarianStemFilterFactory, TestSort, TestBinaryResponseWriter,
DOMUtilTest, TermsComponentTest, UniqFieldsUpdateProcessorFactoryTest, PingRequestHandlerTest,
TestJmxIntegration, LengthFilterTest, JsonLoaderTest, TestCollationKeyRangeQueries, AlternateDirectoryTest,
TestFiltering, HighlighterConfigTest, TestDelimitedPayloadTokenFilterFactory, SimpleFacetsTest,
TestItalianLightStemFilterFactory, TestIndexSearcher, FullSolrCloudDistribCmdsTest, TestCodecSupport,
RequiredFieldsTest, TestConfig, CSVRequestHandlerTest, TestLatvianStemFilterFactory, ZkNodePropsTest,
TestSlowSynonymFilter, TestDefaultSimilarityFactory, SolrCoreCheckLockOnStartupTest, HighlighterTest,
EchoParamsTest, TestFinnishLightStemFilterFactory, TestCoreContainer, DirectSolrConnectionTest,
TestKeywordMarkerFilterFactory, TestJapaneseTokenizerFactory, TestBM25SimilarityFactory, ZkControllerTest,
DocumentBuilderTest, DocumentAnalysisRequestHandlerTest, TestPatternReplaceCharFilterFactory,
TestGreekLowerCaseFilterFactory, CoreAdminHandlerTest, OpenExchangeRatesOrgProviderTest, MoreLikeThisHandlerTest,
TestOmitPositions, TestSurroundQueryParser, MinimalSchemaTest, TestPersianNormalizationFilterFactory,
TestElisionFilterFactory, TestSearchPerf, TestCSVLoader, TestPerFieldSimilarity, SearchHandlerTest,
SuggesterTest, TestJapaneseReadingFormFilterFactory, TestHyphenationCompoundWordTokenFilterFactory,
TimeZoneUtilsTest, TestDictionaryCompoundWordTokenFilterFactory, TestPropInjectDefaults, TestUpdate,
DateFieldTest, TestChineseTokenizerFactory, SampleTest, TestPatternTokenizerFactory, TestDocSet,
TestCJKWidthFilterFactory, TestGreekStemFilterFactory, SolrIndexConfigTest, TestQueryUtils,
TestUAX29URLEmailTokenizerFactory, TestRecovery, StandardRequestHandlerTest, TestMergePolicyConfig,
DistanceFunctionTest, TestHindiFilters, SystemInfoHandlerTest, XmlUpdateRequestHandlerTest,
SolrPluginUtilsTest, TestBeiderMorseFilterFactory, TestFastLRUCache, NotRequiredUniqueKeyTest,
MultiTermTest, TestPortugueseMinimalStemFilterFactory, AutoCommitTest, TestSynonymFilterFactory,
TestGermanNormalizationFilterFactory, TestFaceting, QueryElevationComponentTest, TestSolrDeletionPolicy2,
SuggesterFSTTest, ReturnFieldsTest, CloudStateUpdateTest, LegacyHTMLStripCharFilterTest, DistributedQueryElevationComponentTest,
TestRussianLightStemFilterFactory, BinaryUpdateRequestHandlerTest, TestDistributedSearch,
TestIBSimilarityFactory, CommonGramsQueryFilterFactoryTest, TestUtils, TestDistributedGrouping,
DateMathParserTest, CommonGramsFilterFactoryTest, TestWikipediaTokenizerFactory, TestNorwegianMinimalStemFilterFactory,
TestRealTimeGet, OverseerTest, LeaderElectionTest]
   [junit4]   2> NOTE: reproduce with: ant test  -Dtestcase=LeaderElectionTest -Dtests.seed=620F9E32BEC15560
-Dtests.locale=nl_BE -Dtests.timezone=Asia/Seoul -Dargs="-Dfile.encoding=Cp1252"
   [junit4]   2> 
   [junit4] ERROR   0.00s | LeaderElectionTest (suite)
   [junit4]    > Throwable #1: java.lang.AssertionError: ERROR: SolrZkClient opens=52 closes=50
   [junit4]    > 	at __randomizedtesting.SeedInfo.seed([620F9E32BEC15560]:0)
   [junit4]    > 	at org.junit.Assert.fail(Assert.java:93)
   [junit4]    > 	at org.apache.solr.SolrTestCaseJ4.endTrackingZkClients(SolrTestCaseJ4.java:204)
   [junit4]    > 	at org.apache.solr.SolrTestCaseJ4.afterClass(SolrTestCaseJ4.java:83)
   [junit4]    > 	at sun.reflect.GeneratedMethodAccessor15.invoke(Unknown Source)
   [junit4]    > 	at sun.reflect.DelegatingMethodAccessorImpl.invoke(DelegatingMethodAccessorImpl.java:25)
   [junit4]    > 	at java.lang.reflect.Method.invoke(Method.java:597)
   [junit4]    > 	at com.carrotsearch.randomizedtesting.RandomizedRunner.invoke(RandomizedRunner.java:1969)
   [junit4]    > 	at com.carrotsearch.randomizedtesting.RandomizedRunner.access$1100(RandomizedRunner.java:132)
   [junit4]    > 	at com.carrotsearch.randomizedtesting.RandomizedRunner$5.evaluate(RandomizedRunner.java:752)
   [junit4]    > 	at com.carrotsearch.randomizedtesting.rules.SystemPropertiesRestoreRule$1.evaluate(SystemPropertiesRestoreRule.java:53)
   [junit4]    > 	at org.apache.lucene.util.AbstractBeforeAfterRule$1.evaluate(AbstractBeforeAfterRule.java:45)
   [junit4]    > 	at org.apache.lucene.util.TestRuleReportUncaughtExceptions$1.evaluate(TestRuleReportUncaughtExceptions.java:68)
   [junit4]    > 	at org.apache.lucene.util.TestRuleStoreClassName$1.evaluate(TestRuleStoreClassName.java:38)
   [junit4]    > 	at org.apache.lucene.util.TestRuleIcuHack$1.evaluate(TestRuleIcuHack.java:51)
   [junit4]    > 	at com.carrotsearch.randomizedtesting.rules.SystemPropertiesInvariantRule$1.evaluate(SystemPropertiesInvariantRule.java:55)
   [junit4]    > 	at org.apache.lucene.util.TestRuleNoInstanceHooksOverrides$1.evaluate(TestRuleNoInstanceHooksOverrides.java:53)
   [junit4]    > 	at org.apache.lucene.util.TestRuleNoStaticHooksShadowing$1.evaluate(TestRuleNoStaticHooksShadowing.java:52)
   [junit4]    > 	at org.apache.lucene.util.TestRuleAssertionsRequired$1.evaluate(TestRuleAssertionsRequired.java:36)
   [junit4]    > 	at org.apache.lucene.util.TestRuleMarkFailure$1.evaluate(TestRuleMarkFailure.java:48)
   [junit4]    > 	at org.apache.lucene.util.TestRuleIgnoreTestSuites$1.evaluate(TestRuleIgnoreTestSuites.java:56)
   [junit4]    > 	at com.carrotsearch.randomizedtesting.RandomizedRunner.runSuite(RandomizedRunner.java:605)
   [junit4]    > 	at com.carrotsearch.randomizedtesting.RandomizedRunner.access$400(RandomizedRunner.java:132)
   [junit4]    > 	at com.carrotsearch.randomizedtesting.RandomizedRunner$2.run(RandomizedRunner.java:551)
   [junit4]    >
   [junit4] Completed in 62.94s, 4 tests, 1 failure, 1 error <<< FAILURES!
[...truncated 231 lines...]

[...truncated 10992 lines...]

[...truncated 10992 lines...]

[...truncated 10992 lines...]

[...truncated 10992 lines...]

[...truncated 10992 lines...]



Mime
View raw message