lucene-dev mailing list archives

Site index · List index
Message view « Date » · « Thread »
Top « Date » · « Thread »
From jenk...@sd-datasolutions.de
Subject [JENKINS] Lucene-Solr-trunk-Linux-Java7-64 - Build # 164 - Failure!
Date Mon, 04 Jun 2012 21:10:16 GMT
Build: http://jenkins.sd-datasolutions.de/job/Lucene-Solr-trunk-Linux-Java7-64/164/

3 tests failed.
REGRESSION:  org.apache.solr.handler.component.DistributedSpellCheckComponentTest.testDistribSearch

Error Message:
Server at http://localhost:40252/solr returned non ok status:500, message:Server Error

Stack Trace:
org.apache.solr.common.SolrException: Server at http://localhost:40252/solr returned non ok
status:500, message:Server Error
	at __randomizedtesting.SeedInfo.seed([64D0CA62692CABC7:E536447A1E73CBFB]:0)
	at org.apache.solr.client.solrj.impl.HttpSolrServer.request(HttpSolrServer.java:375)
	at org.apache.solr.client.solrj.impl.HttpSolrServer.request(HttpSolrServer.java:182)
	at org.apache.solr.client.solrj.request.QueryRequest.process(QueryRequest.java:90)
	at org.apache.solr.client.solrj.SolrServer.query(SolrServer.java:323)
	at org.apache.solr.BaseDistributedSearchTestCase.query(BaseDistributedSearchTestCase.java:385)
	at org.apache.solr.handler.component.DistributedSpellCheckComponentTest.doTest(DistributedSpellCheckComponentTest.java:152)
	at org.apache.solr.BaseDistributedSearchTestCase.testDistribSearch(BaseDistributedSearchTestCase.java:686)
	at sun.reflect.NativeMethodAccessorImpl.invoke0(Native Method)
	at sun.reflect.NativeMethodAccessorImpl.invoke(NativeMethodAccessorImpl.java:57)
	at sun.reflect.DelegatingMethodAccessorImpl.invoke(DelegatingMethodAccessorImpl.java:43)
	at java.lang.reflect.Method.invoke(Method.java:601)
	at com.carrotsearch.randomizedtesting.RandomizedRunner.invoke(RandomizedRunner.java:1969)
	at com.carrotsearch.randomizedtesting.RandomizedRunner.access$1100(RandomizedRunner.java:132)
	at com.carrotsearch.randomizedtesting.RandomizedRunner$6.evaluate(RandomizedRunner.java:814)
	at com.carrotsearch.randomizedtesting.RandomizedRunner$7.evaluate(RandomizedRunner.java:875)
	at com.carrotsearch.randomizedtesting.RandomizedRunner$8.evaluate(RandomizedRunner.java:889)
	at com.carrotsearch.randomizedtesting.rules.SystemPropertiesRestoreRule$1.evaluate(SystemPropertiesRestoreRule.java:53)
	at org.apache.lucene.util.TestRuleSetupTeardownChained$1.evaluate(TestRuleSetupTeardownChained.java:50)
	at org.apache.lucene.util.TestRuleFieldCacheSanity$1.evaluate(TestRuleFieldCacheSanity.java:32)
	at org.apache.lucene.util.AbstractBeforeAfterRule$1.evaluate(AbstractBeforeAfterRule.java:45)
	at com.carrotsearch.randomizedtesting.rules.SystemPropertiesInvariantRule$1.evaluate(SystemPropertiesInvariantRule.java:55)
	at org.apache.lucene.util.TestRuleReportUncaughtExceptions$1.evaluate(TestRuleReportUncaughtExceptions.java:68)
	at org.apache.lucene.util.TestRuleThreadAndTestName$1.evaluate(TestRuleThreadAndTestName.java:48)
	at org.apache.lucene.util.TestRuleMarkFailure$1.evaluate(TestRuleMarkFailure.java:48)
	at com.carrotsearch.randomizedtesting.RandomizedRunner.runSingleTest(RandomizedRunner.java:821)
	at com.carrotsearch.randomizedtesting.RandomizedRunner.access$700(RandomizedRunner.java:132)
	at com.carrotsearch.randomizedtesting.RandomizedRunner$3$1.run(RandomizedRunner.java:669)
	at com.carrotsearch.randomizedtesting.RandomizedRunner$3.evaluate(RandomizedRunner.java:695)
	at com.carrotsearch.randomizedtesting.RandomizedRunner$4.evaluate(RandomizedRunner.java:734)
	at com.carrotsearch.randomizedtesting.RandomizedRunner$5.evaluate(RandomizedRunner.java:745)
	at com.carrotsearch.randomizedtesting.rules.SystemPropertiesRestoreRule$1.evaluate(SystemPropertiesRestoreRule.java:53)
	at org.apache.lucene.util.AbstractBeforeAfterRule$1.evaluate(AbstractBeforeAfterRule.java:45)
	at org.apache.lucene.util.TestRuleReportUncaughtExceptions$1.evaluate(TestRuleReportUncaughtExceptions.java:68)
	at org.apache.lucene.util.TestRuleStoreClassName$1.evaluate(TestRuleStoreClassName.java:38)
	at org.apache.lucene.util.TestRuleIcuHack$1.evaluate(TestRuleIcuHack.java:51)
	at com.carrotsearch.randomizedtesting.rules.SystemPropertiesInvariantRule$1.evaluate(SystemPropertiesInvariantRule.java:55)
	at org.apache.lucene.util.TestRuleNoInstanceHooksOverrides$1.evaluate(TestRuleNoInstanceHooksOverrides.java:53)
	at org.apache.lucene.util.TestRuleNoStaticHooksShadowing$1.evaluate(TestRuleNoStaticHooksShadowing.java:52)
	at org.apache.lucene.util.TestRuleAssertionsRequired$1.evaluate(TestRuleAssertionsRequired.java:36)
	at org.apache.lucene.util.TestRuleMarkFailure$1.evaluate(TestRuleMarkFailure.java:48)
	at org.apache.lucene.util.TestRuleIgnoreTestSuites$1.evaluate(TestRuleIgnoreTestSuites.java:56)
	at com.carrotsearch.randomizedtesting.RandomizedRunner.runSuite(RandomizedRunner.java:605)
	at com.carrotsearch.randomizedtesting.RandomizedRunner.access$400(RandomizedRunner.java:132)
	at com.carrotsearch.randomizedtesting.RandomizedRunner$2.run(RandomizedRunner.java:551)


FAILED:  org.apache.solr.spelling.WordBreakSolrSpellCheckerTest.testInConjunction

Error Message:
Exception during query

Stack Trace:
java.lang.RuntimeException: Exception during query
	at __randomizedtesting.SeedInfo.seed([64D0CA62692CABC7:2164622931C3CDBB]:0)
	at org.apache.solr.SolrTestCaseJ4.assertQ(SolrTestCaseJ4.java:459)
	at org.apache.solr.SolrTestCaseJ4.assertQ(SolrTestCaseJ4.java:426)
	at org.apache.solr.spelling.WordBreakSolrSpellCheckerTest.testInConjunction(WordBreakSolrSpellCheckerTest.java:126)
	at sun.reflect.NativeMethodAccessorImpl.invoke0(Native Method)
	at sun.reflect.NativeMethodAccessorImpl.invoke(NativeMethodAccessorImpl.java:57)
	at sun.reflect.DelegatingMethodAccessorImpl.invoke(DelegatingMethodAccessorImpl.java:43)
	at java.lang.reflect.Method.invoke(Method.java:601)
	at com.carrotsearch.randomizedtesting.RandomizedRunner.invoke(RandomizedRunner.java:1969)
	at com.carrotsearch.randomizedtesting.RandomizedRunner.access$1100(RandomizedRunner.java:132)
	at com.carrotsearch.randomizedtesting.RandomizedRunner$6.evaluate(RandomizedRunner.java:814)
	at com.carrotsearch.randomizedtesting.RandomizedRunner$7.evaluate(RandomizedRunner.java:875)
	at com.carrotsearch.randomizedtesting.RandomizedRunner$8.evaluate(RandomizedRunner.java:889)
	at com.carrotsearch.randomizedtesting.rules.SystemPropertiesRestoreRule$1.evaluate(SystemPropertiesRestoreRule.java:53)
	at org.apache.lucene.util.TestRuleSetupTeardownChained$1.evaluate(TestRuleSetupTeardownChained.java:50)
	at org.apache.lucene.util.TestRuleFieldCacheSanity$1.evaluate(TestRuleFieldCacheSanity.java:32)
	at org.apache.lucene.util.AbstractBeforeAfterRule$1.evaluate(AbstractBeforeAfterRule.java:45)
	at com.carrotsearch.randomizedtesting.rules.SystemPropertiesInvariantRule$1.evaluate(SystemPropertiesInvariantRule.java:55)
	at org.apache.lucene.util.TestRuleReportUncaughtExceptions$1.evaluate(TestRuleReportUncaughtExceptions.java:68)
	at org.apache.lucene.util.TestRuleThreadAndTestName$1.evaluate(TestRuleThreadAndTestName.java:48)
	at org.apache.lucene.util.TestRuleMarkFailure$1.evaluate(TestRuleMarkFailure.java:48)
	at com.carrotsearch.randomizedtesting.RandomizedRunner.runSingleTest(RandomizedRunner.java:821)
	at com.carrotsearch.randomizedtesting.RandomizedRunner.access$700(RandomizedRunner.java:132)
	at com.carrotsearch.randomizedtesting.RandomizedRunner$3$1.run(RandomizedRunner.java:669)
	at com.carrotsearch.randomizedtesting.RandomizedRunner$3.evaluate(RandomizedRunner.java:695)
	at com.carrotsearch.randomizedtesting.RandomizedRunner$4.evaluate(RandomizedRunner.java:734)
	at com.carrotsearch.randomizedtesting.RandomizedRunner$5.evaluate(RandomizedRunner.java:745)
	at com.carrotsearch.randomizedtesting.rules.SystemPropertiesRestoreRule$1.evaluate(SystemPropertiesRestoreRule.java:53)
	at org.apache.lucene.util.AbstractBeforeAfterRule$1.evaluate(AbstractBeforeAfterRule.java:45)
	at org.apache.lucene.util.TestRuleReportUncaughtExceptions$1.evaluate(TestRuleReportUncaughtExceptions.java:68)
	at org.apache.lucene.util.TestRuleStoreClassName$1.evaluate(TestRuleStoreClassName.java:38)
	at org.apache.lucene.util.TestRuleIcuHack$1.evaluate(TestRuleIcuHack.java:51)
	at com.carrotsearch.randomizedtesting.rules.SystemPropertiesInvariantRule$1.evaluate(SystemPropertiesInvariantRule.java:55)
	at org.apache.lucene.util.TestRuleNoInstanceHooksOverrides$1.evaluate(TestRuleNoInstanceHooksOverrides.java:53)
	at org.apache.lucene.util.TestRuleNoStaticHooksShadowing$1.evaluate(TestRuleNoStaticHooksShadowing.java:52)
	at org.apache.lucene.util.TestRuleAssertionsRequired$1.evaluate(TestRuleAssertionsRequired.java:36)
	at org.apache.lucene.util.TestRuleMarkFailure$1.evaluate(TestRuleMarkFailure.java:48)
	at org.apache.lucene.util.TestRuleIgnoreTestSuites$1.evaluate(TestRuleIgnoreTestSuites.java:56)
	at com.carrotsearch.randomizedtesting.RandomizedRunner.runSuite(RandomizedRunner.java:605)
	at com.carrotsearch.randomizedtesting.RandomizedRunner.access$400(RandomizedRunner.java:132)
	at com.carrotsearch.randomizedtesting.RandomizedRunner$2.run(RandomizedRunner.java:551)
Caused by: java.lang.NullPointerException
	at org.apache.solr.handler.component.SpellCheckComponent.toNamedList(SpellCheckComponent.java:566)
	at org.apache.solr.handler.component.SpellCheckComponent.process(SpellCheckComponent.java:177)
	at org.apache.solr.handler.component.SearchHandler.handleRequestBody(SearchHandler.java:204)
	at org.apache.solr.handler.RequestHandlerBase.handleRequest(RequestHandlerBase.java:129)
	at org.apache.solr.core.SolrCore.execute(SolrCore.java:1555)
	at org.apache.solr.util.TestHarness.query(TestHarness.java:357)
	at org.apache.solr.util.TestHarness.query(TestHarness.java:340)
	at org.apache.solr.SolrTestCaseJ4.assertQ(SolrTestCaseJ4.java:433)
	... 39 more


FAILED:  org.apache.solr.spelling.WordBreakSolrSpellCheckerTest.testCollate

Error Message:
Exception during query

Stack Trace:
java.lang.RuntimeException: Exception during query
	at __randomizedtesting.SeedInfo.seed([64D0CA62692CABC7:AEF19356C3D496AC]:0)
	at org.apache.solr.SolrTestCaseJ4.assertQ(SolrTestCaseJ4.java:459)
	at org.apache.solr.SolrTestCaseJ4.assertQ(SolrTestCaseJ4.java:426)
	at org.apache.solr.spelling.WordBreakSolrSpellCheckerTest.testCollate(WordBreakSolrSpellCheckerTest.java:181)
	at sun.reflect.NativeMethodAccessorImpl.invoke0(Native Method)
	at sun.reflect.NativeMethodAccessorImpl.invoke(NativeMethodAccessorImpl.java:57)
	at sun.reflect.DelegatingMethodAccessorImpl.invoke(DelegatingMethodAccessorImpl.java:43)
	at java.lang.reflect.Method.invoke(Method.java:601)
	at com.carrotsearch.randomizedtesting.RandomizedRunner.invoke(RandomizedRunner.java:1969)
	at com.carrotsearch.randomizedtesting.RandomizedRunner.access$1100(RandomizedRunner.java:132)
	at com.carrotsearch.randomizedtesting.RandomizedRunner$6.evaluate(RandomizedRunner.java:814)
	at com.carrotsearch.randomizedtesting.RandomizedRunner$7.evaluate(RandomizedRunner.java:875)
	at com.carrotsearch.randomizedtesting.RandomizedRunner$8.evaluate(RandomizedRunner.java:889)
	at com.carrotsearch.randomizedtesting.rules.SystemPropertiesRestoreRule$1.evaluate(SystemPropertiesRestoreRule.java:53)
	at org.apache.lucene.util.TestRuleSetupTeardownChained$1.evaluate(TestRuleSetupTeardownChained.java:50)
	at org.apache.lucene.util.TestRuleFieldCacheSanity$1.evaluate(TestRuleFieldCacheSanity.java:32)
	at org.apache.lucene.util.AbstractBeforeAfterRule$1.evaluate(AbstractBeforeAfterRule.java:45)
	at com.carrotsearch.randomizedtesting.rules.SystemPropertiesInvariantRule$1.evaluate(SystemPropertiesInvariantRule.java:55)
	at org.apache.lucene.util.TestRuleReportUncaughtExceptions$1.evaluate(TestRuleReportUncaughtExceptions.java:68)
	at org.apache.lucene.util.TestRuleThreadAndTestName$1.evaluate(TestRuleThreadAndTestName.java:48)
	at org.apache.lucene.util.TestRuleMarkFailure$1.evaluate(TestRuleMarkFailure.java:48)
	at com.carrotsearch.randomizedtesting.RandomizedRunner.runSingleTest(RandomizedRunner.java:821)
	at com.carrotsearch.randomizedtesting.RandomizedRunner.access$700(RandomizedRunner.java:132)
	at com.carrotsearch.randomizedtesting.RandomizedRunner$3$1.run(RandomizedRunner.java:669)
	at com.carrotsearch.randomizedtesting.RandomizedRunner$3.evaluate(RandomizedRunner.java:695)
	at com.carrotsearch.randomizedtesting.RandomizedRunner$4.evaluate(RandomizedRunner.java:734)
	at com.carrotsearch.randomizedtesting.RandomizedRunner$5.evaluate(RandomizedRunner.java:745)
	at com.carrotsearch.randomizedtesting.rules.SystemPropertiesRestoreRule$1.evaluate(SystemPropertiesRestoreRule.java:53)
	at org.apache.lucene.util.AbstractBeforeAfterRule$1.evaluate(AbstractBeforeAfterRule.java:45)
	at org.apache.lucene.util.TestRuleReportUncaughtExceptions$1.evaluate(TestRuleReportUncaughtExceptions.java:68)
	at org.apache.lucene.util.TestRuleStoreClassName$1.evaluate(TestRuleStoreClassName.java:38)
	at org.apache.lucene.util.TestRuleIcuHack$1.evaluate(TestRuleIcuHack.java:51)
	at com.carrotsearch.randomizedtesting.rules.SystemPropertiesInvariantRule$1.evaluate(SystemPropertiesInvariantRule.java:55)
	at org.apache.lucene.util.TestRuleNoInstanceHooksOverrides$1.evaluate(TestRuleNoInstanceHooksOverrides.java:53)
	at org.apache.lucene.util.TestRuleNoStaticHooksShadowing$1.evaluate(TestRuleNoStaticHooksShadowing.java:52)
	at org.apache.lucene.util.TestRuleAssertionsRequired$1.evaluate(TestRuleAssertionsRequired.java:36)
	at org.apache.lucene.util.TestRuleMarkFailure$1.evaluate(TestRuleMarkFailure.java:48)
	at org.apache.lucene.util.TestRuleIgnoreTestSuites$1.evaluate(TestRuleIgnoreTestSuites.java:56)
	at com.carrotsearch.randomizedtesting.RandomizedRunner.runSuite(RandomizedRunner.java:605)
	at com.carrotsearch.randomizedtesting.RandomizedRunner.access$400(RandomizedRunner.java:132)
	at com.carrotsearch.randomizedtesting.RandomizedRunner$2.run(RandomizedRunner.java:551)
Caused by: java.lang.NullPointerException
	at org.apache.solr.handler.component.SpellCheckComponent.toNamedList(SpellCheckComponent.java:566)
	at org.apache.solr.handler.component.SpellCheckComponent.process(SpellCheckComponent.java:177)
	at org.apache.solr.handler.component.SearchHandler.handleRequestBody(SearchHandler.java:204)
	at org.apache.solr.handler.RequestHandlerBase.handleRequest(RequestHandlerBase.java:129)
	at org.apache.solr.core.SolrCore.execute(SolrCore.java:1555)
	at org.apache.solr.util.TestHarness.query(TestHarness.java:357)
	at org.apache.solr.util.TestHarness.query(TestHarness.java:340)
	at org.apache.solr.SolrTestCaseJ4.assertQ(SolrTestCaseJ4.java:433)
	... 39 more




Build Log:
[...truncated 10913 lines...]
   [junit4]   2> 		at sun.reflect.NativeMethodAccessorImpl.invoke(NativeMethodAccessorImpl.java:57)
   [junit4]   2> 		at sun.reflect.DelegatingMethodAccessorImpl.invoke(DelegatingMethodAccessorImpl.java:43)
   [junit4]   2> 		at java.lang.reflect.Method.invoke(Method.java:601)
   [junit4]   2> 		at com.carrotsearch.randomizedtesting.RandomizedRunner.invoke(RandomizedRunner.java:1969)
   [junit4]   2> 		at com.carrotsearch.randomizedtesting.RandomizedRunner.access$1100(RandomizedRunner.java:132)
   [junit4]   2> 		at com.carrotsearch.randomizedtesting.RandomizedRunner$6.evaluate(RandomizedRunner.java:814)
   [junit4]   2> 		at com.carrotsearch.randomizedtesting.RandomizedRunner$7.evaluate(RandomizedRunner.java:875)
   [junit4]   2> 		at com.carrotsearch.randomizedtesting.RandomizedRunner$8.evaluate(RandomizedRunner.java:889)
   [junit4]   2> 		at com.carrotsearch.randomizedtesting.rules.SystemPropertiesRestoreRule$1.evaluate(SystemPropertiesRestoreRule.java:53)
   [junit4]   2> 		at org.apache.lucene.util.TestRuleSetupTeardownChained$1.evaluate(TestRuleSetupTeardownChained.java:50)
   [junit4]   2> 		at org.apache.lucene.util.TestRuleFieldCacheSanity$1.evaluate(TestRuleFieldCacheSanity.java:32)
   [junit4]   2> 		at org.apache.lucene.util.AbstractBeforeAfterRule$1.evaluate(AbstractBeforeAfterRule.java:45)
   [junit4]   2> 		at com.carrotsearch.randomizedtesting.rules.SystemPropertiesInvariantRule$1.evaluate(SystemPropertiesInvariantRule.java:55)
   [junit4]   2> 		at org.apache.lucene.util.TestRuleReportUncaughtExceptions$1.evaluate(TestRuleReportUncaughtExceptions.java:68)
   [junit4]   2> 		at org.apache.lucene.util.TestRuleThreadAndTestName$1.evaluate(TestRuleThreadAndTestName.java:48)
   [junit4]   2> 		at org.apache.lucene.util.TestRuleMarkFailure$1.evaluate(TestRuleMarkFailure.java:48)
   [junit4]   2> 		at com.carrotsearch.randomizedtesting.RandomizedRunner.runSingleTest(RandomizedRunner.java:821)
   [junit4]   2> 		at com.carrotsearch.randomizedtesting.RandomizedRunner.access$700(RandomizedRunner.java:132)
   [junit4]   2> 		at com.carrotsearch.randomizedtesting.RandomizedRunner$3$1.run(RandomizedRunner.java:669)
   [junit4]   2> 		at com.carrotsearch.randomizedtesting.RandomizedRunner$3.evaluate(RandomizedRunner.java:695)
   [junit4]   2> 		at com.carrotsearch.randomizedtesting.RandomizedRunner$4.evaluate(RandomizedRunner.java:734)
   [junit4]   2> 		at com.carrotsearch.randomizedtesting.RandomizedRunner$5.evaluate(RandomizedRunner.java:745)
   [junit4]   2> 		at com.carrotsearch.randomizedtesting.rules.SystemPropertiesRestoreRule$1.evaluate(SystemPropertiesRestoreRule.java:53)
   [junit4]   2> 		at org.apache.lucene.util.AbstractBeforeAfterRule$1.evaluate(AbstractBeforeAfterRule.java:45)
   [junit4]   2> 		at org.apache.lucene.util.TestRuleReportUncaughtExceptions$1.evaluate(TestRuleReportUncaughtExceptions.java:68)
   [junit4]   2> 		at org.apache.lucene.util.TestRuleStoreClassName$1.evaluate(TestRuleStoreClassName.java:38)
   [junit4]   2> 		at org.apache.lucene.util.TestRuleIcuHack$1.evaluate(TestRuleIcuHack.java:51)
   [junit4]   2> 		at com.carrotsearch.randomizedtesting.rules.SystemPropertiesInvariantRule$1.evaluate(SystemPropertiesInvariantRule.java:55)
   [junit4]   2> 		at org.apache.lucene.util.TestRuleNoInstanceHooksOverrides$1.evaluate(TestRuleNoInstanceHooksOverrides.java:53)
   [junit4]   2> 		at org.apache.lucene.util.TestRuleNoStaticHooksShadowing$1.evaluate(TestRuleNoStaticHooksShadowing.java:52)
   [junit4]   2> 		at org.apache.lucene.util.TestRuleAssertionsRequired$1.evaluate(TestRuleAssertionsRequired.java:36)
   [junit4]   2> 		at org.apache.lucene.util.TestRuleMarkFailure$1.evaluate(TestRuleMarkFailure.java:48)
   [junit4]   2> 		at org.apache.lucene.util.TestRuleIgnoreTestSuites$1.evaluate(TestRuleIgnoreTestSuites.java:56)
   [junit4]   2> 		at com.carrotsearch.randomizedtesting.RandomizedRunner.runSuite(RandomizedRunner.java:605)
   [junit4]   2> 		at com.carrotsearch.randomizedtesting.RandomizedRunner.access$400(RandomizedRunner.java:132)
   [junit4]   2> 		at com.carrotsearch.randomizedtesting.RandomizedRunner$2.run(RandomizedRunner.java:551)
   [junit4]   2> 	
   [junit4]   2> 972 T427 C37 REQ [collection1] webapp=null path=null params={spellcheck=true&spellcheck.accuracy=.75&indent=true&spellcheck.collateExtendedResults=true&spellcheck.extendedResults=true&spellcheck.maxCollations=10&q=lowerfilt:(paintable+pine+apple+godness)&spellcheck.collate=true&qt=spellCheckWithWordbreak&spellcheck.build=true}
hits=0 status=500 QTime=37 
   [junit4]   2> 973 T427 oasc.SolrException.log SEVERE REQUEST FAILED: spellcheck=true&spellcheck.accuracy=.75&indent=true&spellcheck.collateExtendedResults=true&spellcheck.extendedResults=true&spellcheck.maxCollations=10&q=lowerfilt:(paintable+pine+apple+godness)&spellcheck.collate=true&qt=spellCheckWithWordbreak&spellcheck.build=true:java.lang.NullPointerException
   [junit4]   2> 		at org.apache.solr.handler.component.SpellCheckComponent.toNamedList(SpellCheckComponent.java:566)
   [junit4]   2> 		at org.apache.solr.handler.component.SpellCheckComponent.process(SpellCheckComponent.java:177)
   [junit4]   2> 		at org.apache.solr.handler.component.SearchHandler.handleRequestBody(SearchHandler.java:204)
   [junit4]   2> 		at org.apache.solr.handler.RequestHandlerBase.handleRequest(RequestHandlerBase.java:129)
   [junit4]   2> 		at org.apache.solr.core.SolrCore.execute(SolrCore.java:1555)
   [junit4]   2> 		at org.apache.solr.util.TestHarness.query(TestHarness.java:357)
   [junit4]   2> 		at org.apache.solr.util.TestHarness.query(TestHarness.java:340)
   [junit4]   2> 		at org.apache.solr.SolrTestCaseJ4.assertQ(SolrTestCaseJ4.java:433)
   [junit4]   2> 		at org.apache.solr.SolrTestCaseJ4.assertQ(SolrTestCaseJ4.java:426)
   [junit4]   2> 		at org.apache.solr.spelling.WordBreakSolrSpellCheckerTest.testCollate(WordBreakSolrSpellCheckerTest.java:181)
   [junit4]   2> 		at sun.reflect.NativeMethodAccessorImpl.invoke0(Native Method)
   [junit4]   2> 		at sun.reflect.NativeMethodAccessorImpl.invoke(NativeMethodAccessorImpl.java:57)
   [junit4]   2> 		at sun.reflect.DelegatingMethodAccessorImpl.invoke(DelegatingMethodAccessorImpl.java:43)
   [junit4]   2> 		at java.lang.reflect.Method.invoke(Method.java:601)
   [junit4]   2> 		at com.carrotsearch.randomizedtesting.RandomizedRunner.invoke(RandomizedRunner.java:1969)
   [junit4]   2> 		at com.carrotsearch.randomizedtesting.RandomizedRunner.access$1100(RandomizedRunner.java:132)
   [junit4]   2> 		at com.carrotsearch.randomizedtesting.RandomizedRunner$6.evaluate(RandomizedRunner.java:814)
   [junit4]   2> 		at com.carrotsearch.randomizedtesting.RandomizedRunner$7.evaluate(RandomizedRunner.java:875)
   [junit4]   2> 		at com.carrotsearch.randomizedtesting.RandomizedRunner$8.evaluate(RandomizedRunner.java:889)
   [junit4]   2> 		at com.carrotsearch.randomizedtesting.rules.SystemPropertiesRestoreRule$1.evaluate(SystemPropertiesRestoreRule.java:53)
   [junit4]   2> 		at org.apache.lucene.util.TestRuleSetupTeardownChained$1.evaluate(TestRuleSetupTeardownChained.java:50)
   [junit4]   2> 		at org.apache.lucene.util.TestRuleFieldCacheSanity$1.evaluate(TestRuleFieldCacheSanity.java:32)
   [junit4]   2> 		at org.apache.lucene.util.AbstractBeforeAfterRule$1.evaluate(AbstractBeforeAfterRule.java:45)
   [junit4]   2> 		at com.carrotsearch.randomizedtesting.rules.SystemPropertiesInvariantRule$1.evaluate(SystemPropertiesInvariantRule.java:55)
   [junit4]   2> 		at org.apache.lucene.util.TestRuleReportUncaughtExceptions$1.evaluate(TestRuleReportUncaughtExceptions.java:68)
   [junit4]   2> 		at org.apache.lucene.util.TestRuleThreadAndTestName$1.evaluate(TestRuleThreadAndTestName.java:48)
   [junit4]   2> 		at org.apache.lucene.util.TestRuleMarkFailure$1.evaluate(TestRuleMarkFailure.java:48)
   [junit4]   2> 		at com.carrotsearch.randomizedtesting.RandomizedRunner.runSingleTest(RandomizedRunner.java:821)
   [junit4]   2> 		at com.carrotsearch.randomizedtesting.RandomizedRunner.access$700(RandomizedRunner.java:132)
   [junit4]   2> 		at com.carrotsearch.randomizedtesting.RandomizedRunner$3$1.run(RandomizedRunner.java:669)
   [junit4]   2> 		at com.carrotsearch.randomizedtesting.RandomizedRunner$3.evaluate(RandomizedRunner.java:695)
   [junit4]   2> 		at com.carrotsearch.randomizedtesting.RandomizedRunner$4.evaluate(RandomizedRunner.java:734)
   [junit4]   2> 		at com.carrotsearch.randomizedtesting.RandomizedRunner$5.evaluate(RandomizedRunner.java:745)
   [junit4]   2> 		at com.carrotsearch.randomizedtesting.rules.SystemPropertiesRestoreRule$1.evaluate(SystemPropertiesRestoreRule.java:53)
   [junit4]   2> 		at org.apache.lucene.util.AbstractBeforeAfterRule$1.evaluate(AbstractBeforeAfterRule.java:45)
   [junit4]   2> 		at org.apache.lucene.util.TestRuleReportUncaughtExceptions$1.evaluate(TestRuleReportUncaughtExceptions.java:68)
   [junit4]   2> 		at org.apache.lucene.util.TestRuleStoreClassName$1.evaluate(TestRuleStoreClassName.java:38)
   [junit4]   2> 		at org.apache.lucene.util.TestRuleIcuHack$1.evaluate(TestRuleIcuHack.java:51)
   [junit4]   2> 		at com.carrotsearch.randomizedtesting.rules.SystemPropertiesInvariantRule$1.evaluate(SystemPropertiesInvariantRule.java:55)
   [junit4]   2> 		at org.apache.lucene.util.TestRuleNoInstanceHooksOverrides$1.evaluate(TestRuleNoInstanceHooksOverrides.java:53)
   [junit4]   2> 		at org.apache.lucene.util.TestRuleNoStaticHooksShadowing$1.evaluate(TestRuleNoStaticHooksShadowing.java:52)
   [junit4]   2> 		at org.apache.lucene.util.TestRuleAssertionsRequired$1.evaluate(TestRuleAssertionsRequired.java:36)
   [junit4]   2> 		at org.apache.lucene.util.TestRuleMarkFailure$1.evaluate(TestRuleMarkFailure.java:48)
   [junit4]   2> 		at org.apache.lucene.util.TestRuleIgnoreTestSuites$1.evaluate(TestRuleIgnoreTestSuites.java:56)
   [junit4]   2> 		at com.carrotsearch.randomizedtesting.RandomizedRunner.runSuite(RandomizedRunner.java:605)
   [junit4]   2> 		at com.carrotsearch.randomizedtesting.RandomizedRunner.access$400(RandomizedRunner.java:132)
   [junit4]   2> 		at com.carrotsearch.randomizedtesting.RandomizedRunner$2.run(RandomizedRunner.java:551)
   [junit4]   2> 	
   [junit4]   2> 973 T427 oas.SolrTestCaseJ4.tearDown ###Ending testCollate
   [junit4]   2> NOTE: reproduce with: ant test  -Dtestcase=WordBreakSolrSpellCheckerTest
-Dtests.method=testCollate -Dtests.seed=64D0CA62692CABC7 -Dtests.multiplier=3 -Dtests.locale=lv_LV
-Dtests.timezone=Asia/Dubai -Dargs="-Dfile.encoding=UTF-8"
   [junit4]   2>
   [junit4]    > (@AfterClass output)
   [junit4]   2> 989 T427 oas.SolrTestCaseJ4.deleteCore ###deleteCore
   [junit4]   2> 990 T427 oasc.CoreContainer.shutdown Shutting down CoreContainer instance=2006038643
   [junit4]   2> 990 T427 oasc.SolrCore.close [collection1]  CLOSING SolrCore org.apache.solr.core.SolrCore@11cfe170
   [junit4]   2> 997 T427 oasc.SolrCore.closeSearcher [collection1] Closing main searcher
on request.
   [junit4]   2> 997 T427 oasu.DirectUpdateHandler2.close closing DirectUpdateHandler2{commits=1,autocommits=0,soft
autocommits=0,optimizes=0,rollbacks=0,expungeDeletes=0,docsPending=0,adds=0,deletesById=0,deletesByQuery=0,errors=0,cumulative_adds=7,cumulative_deletesById=0,cumulative_deletesByQuery=0,cumulative_errors=0}
   [junit4]   2> NOTE: test params are: codec=Appending, sim=RandomSimilarityProvider(queryNorm=true,coord=true):
{}, locale=lv_LV, timezone=Asia/Dubai
   [junit4]   2> NOTE: Linux 2.6.32-41-server amd64/Oracle Corporation 1.7.0_04 (64-bit)/cpus=8,threads=1,free=301690928,total=339738624
   [junit4]   2> NOTE: All tests run in this JVM: [TestMergePolicyConfig, TestWriterPerf,
TestReverseStringFilterFactory, TestDelimitedPayloadTokenFilterFactory, DoubleMetaphoneFilterFactoryTest,
TestDFRSimilarityFactory, LengthFilterTest, DirectUpdateHandlerTest, MultiTermTest, TestLatvianStemFilterFactory,
PolyFieldTest, TestGreekStemFilterFactory, CSVRequestHandlerTest, MBeansHandlerTest, BasicZkTest,
SampleTest, TestBeiderMorseFilterFactory, TestNumberUtils, TestQuerySenderNoQuery, MinimalSchemaTest,
TestIndexSearcher, DistributedTermsComponentTest, StandardRequestHandlerTest, FullSolrCloudDistribCmdsTest,
TestTurkishLowerCaseFilterFactory, PrimitiveFieldTypeTest, TestShingleFilterFactory, TestJoin,
TestJmxMonitoredMap, TestCoreContainer, HighlighterTest, HighlighterConfigTest, TestPersianNormalizationFilterFactory,
TestKeywordMarkerFilterFactory, TestCJKWidthFilterFactory, TestPHPSerializedResponseWriter,
TestItalianLightStemFilterFactory, SuggesterWFSTTest, LoggingHandlerTest, TestIrishLowerCaseFilterFactory,
TestRemoteStreaming, IndexSchemaRuntimeFieldTest, TestRemoveDuplicatesTokenFilterFactory,
TestKStemFilterFactory, DisMaxRequestHandlerTest, TestHindiFilters, TestKeepFilterFactory,
LukeRequestHandlerTest, FieldAnalysisRequestHandlerTest, TestGermanNormalizationFilterFactory,
WordBreakSolrSpellCheckerTest]
   [junit4]   2> 
   [junit4] Completed on J0 in 1.02s, 3 tests, 2 errors <<< FAILURES!
[...truncated 709 lines...]
   [junit4]   2> 2008 T1244 C84 oashc.SpellCheckComponent.finishStage localhost:44378/solr|[::1]:33332/solr
{suggestions={quock={numFound=2,startOffset=12,endOffset=17,origFreq=0,suggestion=[{word=quick,freq=1},
{word=quote,freq=12}]},reb={numFound=1,startOffset=19,endOffset=22,origFreq=0,suggestion=[{word=red,freq=13}]},correctlySpelled=false,collation=lowerfilt:(+quick
+red),collationInternalRank=0,collation=lowerfilt:(+quote +red),collationInternalRank=1}}
   [junit4]   2> 2008 T1244 C84 REQ [collection1] webapp=/solr path=/select params={spellcheck=true&shards.qt=spellCheckCompRH_Direct&spellcheck.extendedResults=true&spellcheck.collateExtendedResults=false&spellcheck.maxCollationTries=10&spellcheck.maxCollations=10&spellcheck.collate=true&wt=javabin&version=2&fl=id,lowerfilt&shards=localhost:44378/solr|[::1]:33332/solr&q=lowerfilt:(%2Bquock+%2Breb)&spellcheck.count=10&qt=spellCheckCompRH_Direct}
status=0 QTime=13 
   [junit4]   2> 2015 T1234 C83 REQ [collection1] webapp=/solr path=/select params={spellcheck=true&shards.qt=spellCheckCompRH_Direct&spellcheck.extendedResults=true&spellcheck.collateExtendedResults=false&spellcheck.maxCollationTries=0&spellcheck.maxCollations=1&distrib=false&spellcheck.collate=true&wt=javabin&version=2&fl=id,lowerfilt&q=lowerfilt:(%2Bquock+%2Breb)&spellcheck.count=10&qt=spellCheckCompRH_Direct}
hits=0 status=0 QTime=4 
   [junit4]   2> 2025 T1245 C84 REQ [collection1] webapp=/solr path=/select params={spellcheck=true&shards.qt=spellCheckCompRH_Direct&spellcheck.maxCollationTries=0&distrib=false&version=2&fl=id,score&shard.url=localhost:44378/solr&NOW=1338844110330&spellcheck.count=10&qt=spellCheckCompRH_Direct&fsv=true&spellcheck.extendedResults=true&spellcheck.collateExtendedResults=false&spellcheck.maxCollations=1&spellcheck.collate=true&wt=javabin&spellcheck.onlyMorePopular=false&rows=10&start=0&q=lowerfilt:(%2Bquock+%2Breb)&spellcheck.dictionary=direct&isShard=true}
hits=0 status=0 QTime=6 
   [junit4]   2> 2026 T1244 C84 oashc.SpellCheckComponent.finishStage localhost:44378/solr
{suggestions={quock={numFound=2,startOffset=12,endOffset=17,origFreq=0,suggestion=[{word=quick,freq=1},
{word=quote,freq=12}]},reb={numFound=1,startOffset=19,endOffset=22,origFreq=0,suggestion=[{word=red,freq=13}]},correctlySpelled=false,collation=lowerfilt:(+quick
+red)}}
   [junit4]   2> 2027 T1244 C84 REQ [collection1] webapp=/solr path=/select params={spellcheck=true&shards.qt=spellCheckCompRH_Direct&spellcheck.extendedResults=true&spellcheck.collateExtendedResults=false&spellcheck.maxCollationTries=0&spellcheck.maxCollations=1&spellcheck.collate=true&wt=javabin&version=2&fl=id,lowerfilt&shards=localhost:44378/solr&q=lowerfilt:(%2Bquock+%2Breb)&spellcheck.count=10&qt=spellCheckCompRH_Direct}
status=0 QTime=10 
   [junit4]   2> 2030 T1234 C83 REQ [collection1] webapp=/solr path=/select params={spellcheck=true&spellcheck.maxResultsForSuggest=10&shards.qt=spellCheckCompRH&spellcheck.extendedResults=true&spellcheck.collateExtendedResults=true&spellcheck.maxCollationTries=10&spellcheck.maxCollations=1&distrib=false&spellcheck.collate=true&wt=javabin&version=2&fl=id,lowerfilt&q=lowerfilt:("quote+red+fox")&spellcheck.count=10&qt=spellCheckCompRH&spellcheck.alternativeTermCount=5}
hits=12 status=0 QTime=1 
   [junit4]   2> 2035 T1245 C84 REQ [collection1] webapp=/solr path=/select params={spellcheck=true&shards.qt=spellCheckCompRH&spellcheck.maxCollationTries=10&distrib=false&version=2&fl=id,score&shard.url=localhost:44378/solr&NOW=1338844110345&spellcheck.count=10&qt=spellCheckCompRH&fsv=true&spellcheck.alternativeTermCount=5&spellcheck.maxResultsForSuggest=10&spellcheck.extendedResults=true&spellcheck.collateExtendedResults=true&spellcheck.maxCollations=1&spellcheck.collate=true&wt=javabin&spellcheck.onlyMorePopular=false&rows=10&start=0&q=lowerfilt:("quote+red+fox")&isShard=true}
hits=12 status=0 QTime=1 
   [junit4]   2> 2039 T1245 C84 REQ [collection1] webapp=/solr path=/select params={spellcheck=false&spellcheck.maxResultsForSuggest=10&spellcheck.extendedResults=true&shards.qt=spellCheckCompRH&spellcheck.collateExtendedResults=true&spellcheck.maxCollationTries=10&spellcheck.maxCollations=1&ids=21,20,19,17,22,18,15,16,13,14&distrib=false&spellcheck.collate=true&wt=javabin&spellcheck.onlyMorePopular=false&version=2&fl=id,lowerfilt&shard.url=localhost:44378/solr&NOW=1338844110345&q=lowerfilt:("quote+red+fox")&spellcheck.count=10&qt=spellCheckCompRH&isShard=true&spellcheck.alternativeTermCount=5}
status=0 QTime=1 
   [junit4]   2> 2040 T1244 C84 REQ [collection1] webapp=/solr path=/select params={spellcheck=true&spellcheck.maxResultsForSuggest=10&shards.qt=spellCheckCompRH&spellcheck.extendedResults=true&spellcheck.collateExtendedResults=true&spellcheck.maxCollationTries=10&spellcheck.maxCollations=1&spellcheck.collate=true&wt=javabin&version=2&fl=id,lowerfilt&shards=localhost:44378/solr&q=lowerfilt:("quote+red+fox")&spellcheck.count=10&qt=spellCheckCompRH&spellcheck.alternativeTermCount=5}
status=0 QTime=8 
   [junit4]   2> 2054 T1234 C83 REQ [collection1] webapp=/solr path=/select params={spellcheck=true&spellcheck.maxResultsForSuggest=10&shards.qt=spellCheckCompRH&spellcheck.extendedResults=true&spellcheck.collateExtendedResults=true&spellcheck.maxCollationTries=10&spellcheck.maxCollations=1&distrib=false&spellcheck.collate=true&wt=javabin&version=2&fl=id,lowerfilt&q=lowerfilt:("rod+fix")&spellcheck.count=10&qt=spellCheckCompRH&spellcheck.alternativeTermCount=5}
hits=1 status=0 QTime=12 
   [junit4]   2> 2064 T1245 C84 REQ [collection1] webapp=/solr path=/select params={spellcheck=true&shards.qt=spellCheckCompRH&spellcheck.maxCollationTries=10&distrib=false&version=2&fl=id,score&shard.url=localhost:44378/solr&NOW=1338844110369&spellcheck.count=10&qt=spellCheckCompRH&fsv=true&spellcheck.alternativeTermCount=5&spellcheck.maxResultsForSuggest=10&spellcheck.extendedResults=true&spellcheck.collateExtendedResults=true&spellcheck.maxCollations=1&spellcheck.collate=true&wt=javabin&spellcheck.onlyMorePopular=false&rows=10&start=0&q=lowerfilt:("rod+fix")&isShard=true}
hits=1 status=0 QTime=6 
   [junit4]   2> 2067 T1245 C84 REQ [collection1] webapp=/solr path=/select params={spellcheck=false&spellcheck.maxResultsForSuggest=10&spellcheck.extendedResults=true&shards.qt=spellCheckCompRH&spellcheck.collateExtendedResults=true&spellcheck.maxCollationTries=10&spellcheck.maxCollations=1&ids=25&distrib=false&spellcheck.collate=true&wt=javabin&spellcheck.onlyMorePopular=false&version=2&fl=id,lowerfilt&shard.url=localhost:44378/solr&NOW=1338844110369&q=lowerfilt:("rod+fix")&spellcheck.count=10&qt=spellCheckCompRH&isShard=true&spellcheck.alternativeTermCount=5}
status=0 QTime=0 
   [junit4]   2> 2068 T1244 C84 oashc.SpellCheckComponent.finishStage localhost:44378/solr
{suggestions={rod={numFound=2,startOffset=12,endOffset=15,origFreq=1,suggestion=[{word=red,freq=13},
{word=ford,freq=1}]},fix={numFound=1,startOffset=16,endOffset=19,origFreq=1,suggestion=[{word=fox,freq=13}]},correctlySpelled=false,collation={collationQuery=lowerfilt:("red
fox"),hits=13,misspellingsAndCorrections={rod=red,fix=fox},collationInternalRank=2}}}
   [junit4]   2> 2068 T1244 C84 oashc.SpellCheckComponent.finishStage localhost:44378/solr
null
   [junit4]   2> 2069 T1244 C84 REQ [collection1] webapp=/solr path=/select params={spellcheck=true&spellcheck.maxResultsForSuggest=10&shards.qt=spellCheckCompRH&spellcheck.extendedResults=true&spellcheck.collateExtendedResults=true&spellcheck.maxCollationTries=10&spellcheck.maxCollations=1&spellcheck.collate=true&wt=javabin&version=2&fl=id,lowerfilt&shards=localhost:44378/solr&q=lowerfilt:("rod+fix")&spellcheck.count=10&qt=spellCheckCompRH&spellcheck.alternativeTermCount=5}
status=0 QTime=13 
   [junit4]   2> 2083 T1234 C83 oasc.SolrException.log SEVERE java.lang.NullPointerException
   [junit4]   2> 		at org.apache.solr.handler.component.SpellCheckComponent.toNamedList(SpellCheckComponent.java:566)
   [junit4]   2> 		at org.apache.solr.handler.component.SpellCheckComponent.process(SpellCheckComponent.java:177)
   [junit4]   2> 		at org.apache.solr.handler.component.SearchHandler.handleRequestBody(SearchHandler.java:204)
   [junit4]   2> 		at org.apache.solr.handler.RequestHandlerBase.handleRequest(RequestHandlerBase.java:129)
   [junit4]   2> 		at org.apache.solr.core.SolrCore.execute(SolrCore.java:1555)
   [junit4]   2> 		at org.apache.solr.servlet.SolrDispatchFilter.execute(SolrDispatchFilter.java:442)
   [junit4]   2> 		at org.apache.solr.servlet.SolrDispatchFilter.doFilter(SolrDispatchFilter.java:263)
   [junit4]   2> 		at org.eclipse.jetty.servlet.ServletHandler$CachedChain.doFilter(ServletHandler.java:1337)
   [junit4]   2> 		at org.eclipse.jetty.servlet.ServletHandler.doHandle(ServletHandler.java:484)
   [junit4]   2> 		at org.eclipse.jetty.server.session.SessionHandler.doHandle(SessionHandler.java:231)
   [junit4]   2> 		at org.eclipse.jetty.server.handler.ScopedHandler.handle(ScopedHandler.java:119)
   [junit4]   2> 		at org.eclipse.jetty.server.handler.GzipHandler.handle(GzipHandler.java:267)
   [junit4]   2> 		at org.eclipse.jetty.server.handler.ContextHandler.doHandle(ContextHandler.java:1067)
   [junit4]   2> 		at org.eclipse.jetty.servlet.ServletHandler.doScope(ServletHandler.java:413)
   [junit4]   2> 		at org.eclipse.jetty.server.session.SessionHandler.doScope(SessionHandler.java:192)
   [junit4]   2> 		at org.eclipse.jetty.server.handler.ContextHandler.doScope(ContextHandler.java:999)
   [junit4]   2> 		at org.eclipse.jetty.server.handler.ScopedHandler.handle(ScopedHandler.java:117)
   [junit4]   2> 		at org.eclipse.jetty.server.handler.HandlerWrapper.handle(HandlerWrapper.java:111)
   [junit4]   2> 		at org.eclipse.jetty.server.Server.handle(Server.java:351)
   [junit4]   2> 		at org.eclipse.jetty.server.AbstractHttpConnection.handleRequest(AbstractHttpConnection.java:454)
   [junit4]   2> 		at org.eclipse.jetty.server.BlockingHttpConnection.handleRequest(BlockingHttpConnection.java:47)
   [junit4]   2> 		at org.eclipse.jetty.server.AbstractHttpConnection.headerComplete(AbstractHttpConnection.java:890)
   [junit4]   2> 		at org.eclipse.jetty.server.AbstractHttpConnection$RequestHandler.headerComplete(AbstractHttpConnection.java:944)
   [junit4]   2> 		at org.eclipse.jetty.http.HttpParser.parseNext(HttpParser.java:634)
   [junit4]   2> 		at org.eclipse.jetty.http.HttpParser.parseAvailable(HttpParser.java:230)
   [junit4]   2> 		at org.eclipse.jetty.server.BlockingHttpConnection.handle(BlockingHttpConnection.java:66)
   [junit4]   2> 		at org.eclipse.jetty.server.bio.SocketConnector$ConnectorEndPoint.run(SocketConnector.java:254)
   [junit4]   2> 		at org.eclipse.jetty.util.thread.QueuedThreadPool.runJob(QueuedThreadPool.java:599)
   [junit4]   2> 		at org.eclipse.jetty.util.thread.QueuedThreadPool$3.run(QueuedThreadPool.java:534)
   [junit4]   2> 		at java.lang.Thread.run(Thread.java:722)
   [junit4]   2> 	
   [junit4]   2> 2084 T1234 C83 REQ [collection1] webapp=/solr path=/select params={spellcheck=true&shards.qt=spellCheckWithWordbreak_Direct&spellcheck.extendedResults=true&spellcheck.collateExtendedResults=true&spellcheck.maxCollationTries=0&spellcheck.maxCollations=1&distrib=false&spellcheck.collate=true&wt=javabin&version=2&fl=id,lowerfilt&q=lowerfilt:(%2Bquock+%2Bredfox+%2Bjum+%2Bped)&spellcheck.count=10&qt=spellCheckWithWordbreak_Direct}
hits=0 status=500 QTime=13 
   [junit4]   2> 2084 T1234 C83 oasc.SolrException.log SEVERE null:java.lang.NullPointerException
   [junit4]   2> 		at org.apache.solr.handler.component.SpellCheckComponent.toNamedList(SpellCheckComponent.java:566)
   [junit4]   2> 		at org.apache.solr.handler.component.SpellCheckComponent.process(SpellCheckComponent.java:177)
   [junit4]   2> 		at org.apache.solr.handler.component.SearchHandler.handleRequestBody(SearchHandler.java:204)
   [junit4]   2> 		at org.apache.solr.handler.RequestHandlerBase.handleRequest(RequestHandlerBase.java:129)
   [junit4]   2> 		at org.apache.solr.core.SolrCore.execute(SolrCore.java:1555)
   [junit4]   2> 		at org.apache.solr.servlet.SolrDispatchFilter.execute(SolrDispatchFilter.java:442)
   [junit4]   2> 		at org.apache.solr.servlet.SolrDispatchFilter.doFilter(SolrDispatchFilter.java:263)
   [junit4]   2> 		at org.eclipse.jetty.servlet.ServletHandler$CachedChain.doFilter(ServletHandler.java:1337)
   [junit4]   2> 		at org.eclipse.jetty.servlet.ServletHandler.doHandle(ServletHandler.java:484)
   [junit4]   2> 		at org.eclipse.jetty.server.session.SessionHandler.doHandle(SessionHandler.java:231)
   [junit4]   2> 		at org.eclipse.jetty.server.handler.ScopedHandler.handle(ScopedHandler.java:119)
   [junit4]   2> 		at org.eclipse.jetty.server.handler.GzipHandler.handle(GzipHandler.java:267)
   [junit4]   2> 		at org.eclipse.jetty.server.handler.ContextHandler.doHandle(ContextHandler.java:1067)
   [junit4]   2> 		at org.eclipse.jetty.servlet.ServletHandler.doScope(ServletHandler.java:413)
   [junit4]   2> 		at org.eclipse.jetty.server.session.SessionHandler.doScope(SessionHandler.java:192)
   [junit4]   2> 		at org.eclipse.jetty.server.handler.ContextHandler.doScope(ContextHandler.java:999)
   [junit4]   2> 		at org.eclipse.jetty.server.handler.ScopedHandler.handle(ScopedHandler.java:117)
   [junit4]   2> 		at org.eclipse.jetty.server.handler.HandlerWrapper.handle(HandlerWrapper.java:111)
   [junit4]   2> 		at org.eclipse.jetty.server.Server.handle(Server.java:351)
   [junit4]   2> 		at org.eclipse.jetty.server.AbstractHttpConnection.handleRequest(AbstractHttpConnection.java:454)
   [junit4]   2> 		at org.eclipse.jetty.server.BlockingHttpConnection.handleRequest(BlockingHttpConnection.java:47)
   [junit4]   2> 		at org.eclipse.jetty.server.AbstractHttpConnection.headerComplete(AbstractHttpConnection.java:890)
   [junit4]   2> 		at org.eclipse.jetty.server.AbstractHttpConnection$RequestHandler.headerComplete(AbstractHttpConnection.java:944)
   [junit4]   2> 		at org.eclipse.jetty.http.HttpParser.parseNext(HttpParser.java:634)
   [junit4]   2> 		at org.eclipse.jetty.http.HttpParser.parseAvailable(HttpParser.java:230)
   [junit4]   2> 		at org.eclipse.jetty.server.BlockingHttpConnection.handle(BlockingHttpConnection.java:66)
   [junit4]   2> 		at org.eclipse.jetty.server.bio.SocketConnector$ConnectorEndPoint.run(SocketConnector.java:254)
   [junit4]   2> 		at org.eclipse.jetty.util.thread.QueuedThreadPool.runJob(QueuedThreadPool.java:599)
   [junit4]   2> 		at org.eclipse.jetty.util.thread.QueuedThreadPool$3.run(QueuedThreadPool.java:534)
   [junit4]   2> 		at java.lang.Thread.run(Thread.java:722)
   [junit4]   2> 	
   [junit4]   2> 2103 T1231 oasc.CoreContainer.shutdown Shutting down CoreContainer instance=1634609210
   [junit4]   2> 2104 T1231 oasc.SolrCore.close [collection1]  CLOSING SolrCore org.apache.solr.core.SolrCore@42d10c12
   [junit4]   2> 2105 T1231 oasc.SolrCore.closeSearcher [collection1] Closing main searcher
on request.
   [junit4]   2> 2107 T1231 oasu.DirectUpdateHandler2.close closing DirectUpdateHandler2{commits=1,autocommits=0,soft
autocommits=0,optimizes=0,rollbacks=0,expungeDeletes=0,docsPending=0,adds=0,deletesById=0,deletesByQuery=0,errors=0,cumulative_adds=24,cumulative_deletesById=0,cumulative_deletesByQuery=1,cumulative_errors=0}
   [junit4]   2> 2109 T1231 oejsh.ContextHandler.doStop stopped o.e.j.s.ServletContextHandler{/solr,null}
   [junit4]   2> 2160 T1231 oasc.CoreContainer.shutdown Shutting down CoreContainer instance=460755908
   [junit4]   2> 2161 T1231 oasc.SolrCore.close [collection1]  CLOSING SolrCore org.apache.solr.core.SolrCore@7a581e09
   [junit4]   2> 2163 T1231 oasc.SolrCore.closeSearcher [collection1] Closing main searcher
on request.
   [junit4]   2> 2164 T1231 oasu.DirectUpdateHandler2.close closing DirectUpdateHandler2{commits=1,autocommits=0,soft
autocommits=0,optimizes=0,rollbacks=0,expungeDeletes=0,docsPending=0,adds=0,deletesById=0,deletesByQuery=0,errors=0,cumulative_adds=24,cumulative_deletesById=0,cumulative_deletesByQuery=1,cumulative_errors=0}
   [junit4]   2> 2165 T1231 oejsh.ContextHandler.doStop stopped o.e.j.s.ServletContextHandler{/solr,null}
   [junit4]   2> 2220 T1231 oas.SolrTestCaseJ4.tearDown ###Ending testDistribSearch
   [junit4]   2> NOTE: reproduce with: ant test  -Dtestcase=DistributedSpellCheckComponentTest
-Dtests.method=testDistribSearch -Dtests.seed=64D0CA62692CABC7 -Dtests.multiplier=3 -Dtests.locale=ko_KR
-Dtests.timezone=America/Hermosillo -Dargs="-Dfile.encoding=UTF-8"
   [junit4]   2>
   [junit4]    > (@AfterClass output)
   [junit4]   2> 2225 T1231 oas.SolrTestCaseJ4.deleteCore ###deleteCore
   [junit4]   2> NOTE: test params are: codec=Lucene40: {end4=MockFixedIntBlock(blockSize=1701),
end3=PostingsFormat(name=Memory doPackFST= false), end2=PostingsFormat(name=SimpleText), start1=Pulsing40(freqCutoff=3
minBlockSize=24 maxBlockSize=104), end1=MockVariableIntBlock(baseBlockSize=16), start4=PostingsFormat(name=Memory
doPackFST= false), start2=MockVariableIntBlock(baseBlockSize=16), start3=MockFixedIntBlock(blockSize=1701),
gram2=Pulsing40(freqCutoff=3 minBlockSize=24 maxBlockSize=104), word=MockVariableIntBlock(baseBlockSize=16),
gram1=MockVariableIntBlock(baseBlockSize=16), gram4=Pulsing40(freqCutoff=9 minBlockSize=24
maxBlockSize=104), gram3=PostingsFormat(name=NestedPulsing)}, sim=RandomSimilarityProvider(queryNorm=true,coord=true):
{}, locale=ko_KR, timezone=America/Hermosillo
   [junit4]   2> NOTE: Linux 2.6.32-41-server amd64/Oracle Corporation 1.7.0_04 (64-bit)/cpus=8,threads=1,free=223125480,total=339738624
   [junit4]   2> NOTE: All tests run in this JVM: [TestMergePolicyConfig, TestWriterPerf,
TestReverseStringFilterFactory, TestDelimitedPayloadTokenFilterFactory, DoubleMetaphoneFilterFactoryTest,
TestDFRSimilarityFactory, LengthFilterTest, DirectUpdateHandlerTest, MultiTermTest, TestLatvianStemFilterFactory,
PolyFieldTest, TestGreekStemFilterFactory, CSVRequestHandlerTest, MBeansHandlerTest, BasicZkTest,
SampleTest, TestBeiderMorseFilterFactory, TestNumberUtils, TestQuerySenderNoQuery, MinimalSchemaTest,
TestIndexSearcher, DistributedTermsComponentTest, StandardRequestHandlerTest, FullSolrCloudDistribCmdsTest,
TestTurkishLowerCaseFilterFactory, PrimitiveFieldTypeTest, TestShingleFilterFactory, TestJoin,
TestJmxMonitoredMap, TestCoreContainer, HighlighterTest, HighlighterConfigTest, TestPersianNormalizationFilterFactory,
TestKeywordMarkerFilterFactory, TestCJKWidthFilterFactory, TestPHPSerializedResponseWriter,
TestItalianLightStemFilterFactory, SuggesterWFSTTest, LoggingHandlerTest, TestIrishLowerCaseFilterFactory,
TestRemoteStreaming, IndexSchemaRuntimeFieldTest, TestRemoveDuplicatesTokenFilterFactory,
TestKStemFilterFactory, DisMaxRequestHandlerTest, TestHindiFilters, TestKeepFilterFactory,
LukeRequestHandlerTest, FieldAnalysisRequestHandlerTest, TestGermanNormalizationFilterFactory,
WordBreakSolrSpellCheckerTest, TestStopFilterFactory, TestQuerySenderListener, RequestHandlersTest,
PrimUtilsTest, TestCSVResponseWriter, TestSynonymFilterFactory, TestLMDirichletSimilarityFactory,
TestPropInjectDefaults, PeerSyncTest, TestCSVLoader, ShowFileRequestHandlerTest, DateFieldTest,
SpatialFilterTest, TestRandomFaceting, TestMultiCoreConfBootstrap, DirectSolrConnectionTest,
BinaryUpdateRequestHandlerTest, TestTrie, CloudStateUpdateTest, TimeZoneUtilsTest, TestOmitPositions,
DirectUpdateHandlerOptimizeTest, TestHunspellStemFilterFactory, FieldMutatingUpdateProcessorTest,
SolrCmdDistributorTest, TestSwedishLightStemFilterFactory, TestHyphenationCompoundWordTokenFilterFactory,
LeaderElectionTest, TestWordDelimiterFilterFactory, TestBrazilianStemFilterFactory, LeaderElectionIntegrationTest,
TestFastLRUCache, JsonLoaderTest, TestPropInject, TestJapanesePartOfSpeechStopFilterFactory,
SuggesterFSTTest, TestBinaryField, TestGermanStemFilterFactory, UpdateParamsTest, UniqFieldsUpdateProcessorFactoryTest,
BadIndexSchemaTest, TestArbitraryIndexDir, DocumentBuilderTest, TestNorwegianLightStemFilterFactory,
DateMathParserTest, TestPorterStemFilterFactory, TestReversedWildcardFilterFactory, TestDocSet,
BasicFunctionalityTest, SpellCheckComponentTest, TestFrenchMinimalStemFilterFactory, SolrCoreCheckLockOnStartupTest,
BasicDistributedZkTest, DistributedSpellCheckComponentTest]
   [junit4]   2> 
   [junit4] Completed on J0 in 2.24s, 1 test, 1 error <<< FAILURES!
[...truncated 212 lines...]

[...truncated 12036 lines...]

[...truncated 12036 lines...]

[...truncated 12036 lines...]


Mime
View raw message