lucene-dev mailing list archives

Site index · List index
Message view « Date » · « Thread »
Top « Date » · « Thread »
From jenk...@sd-datasolutions.de
Subject [JENKINS] Lucene-Solr-trunk-Linux-Java6-64 - Build # 742 - Failure!
Date Tue, 05 Jun 2012 17:38:03 GMT
Build: http://jenkins.sd-datasolutions.de/job/Lucene-Solr-trunk-Linux-Java6-64/742/

1 tests failed.
REGRESSION:  org.apache.lucene.search.TestSearcherManager.testSearcherManager

Error Message:
Thread threw an uncaught exception, thread: Thread[Thread-622,5,]

Stack Trace:
java.lang.RuntimeException: Thread threw an uncaught exception, thread: Thread[Thread-622,5,]
	at com.carrotsearch.randomizedtesting.RunnerThreadGroup.processUncaught(RunnerThreadGroup.java:96)
	at com.carrotsearch.randomizedtesting.RandomizedRunner.runSingleTest(RandomizedRunner.java:857)
	at com.carrotsearch.randomizedtesting.RandomizedRunner.access$700(RandomizedRunner.java:132)
	at com.carrotsearch.randomizedtesting.RandomizedRunner$3$1.run(RandomizedRunner.java:669)
	at com.carrotsearch.randomizedtesting.RandomizedRunner$3.evaluate(RandomizedRunner.java:695)
	at com.carrotsearch.randomizedtesting.RandomizedRunner$4.evaluate(RandomizedRunner.java:734)
	at com.carrotsearch.randomizedtesting.RandomizedRunner$5.evaluate(RandomizedRunner.java:745)
	at org.apache.lucene.util.AbstractBeforeAfterRule$1.evaluate(AbstractBeforeAfterRule.java:45)
	at org.apache.lucene.util.TestRuleReportUncaughtExceptions$1.evaluate(TestRuleReportUncaughtExceptions.java:68)
	at org.apache.lucene.util.TestRuleStoreClassName$1.evaluate(TestRuleStoreClassName.java:38)
	at org.apache.lucene.util.TestRuleIcuHack$1.evaluate(TestRuleIcuHack.java:51)
	at com.carrotsearch.randomizedtesting.rules.SystemPropertiesInvariantRule$1.evaluate(SystemPropertiesInvariantRule.java:55)
	at org.apache.lucene.util.TestRuleNoInstanceHooksOverrides$1.evaluate(TestRuleNoInstanceHooksOverrides.java:53)
	at org.apache.lucene.util.TestRuleNoStaticHooksShadowing$1.evaluate(TestRuleNoStaticHooksShadowing.java:52)
	at org.apache.lucene.util.TestRuleAssertionsRequired$1.evaluate(TestRuleAssertionsRequired.java:36)
	at org.apache.lucene.util.TestRuleMarkFailure$1.evaluate(TestRuleMarkFailure.java:48)
	at org.apache.lucene.util.TestRuleIgnoreTestSuites$1.evaluate(TestRuleIgnoreTestSuites.java:56)
	at com.carrotsearch.randomizedtesting.RandomizedRunner.runSuite(RandomizedRunner.java:605)
	at com.carrotsearch.randomizedtesting.RandomizedRunner.access$400(RandomizedRunner.java:132)
	at com.carrotsearch.randomizedtesting.RandomizedRunner$2.run(RandomizedRunner.java:551)
Caused by: java.lang.RuntimeException: java.lang.AssertionError: sub reader _6(5.0):c53/2
wasn't warmed
	at __randomizedtesting.SeedInfo.seed([CB2FD7C946A1425B]:0)
	at org.apache.lucene.index.ThreadedIndexingAndSearchingTestCase$2.run(ThreadedIndexingAndSearchingTestCase.java:397)
Caused by: java.lang.AssertionError: sub reader _6(5.0):c53/2 wasn't warmed
	at org.junit.Assert.fail(Assert.java:93)
	at org.junit.Assert.assertTrue(Assert.java:43)
	at org.apache.lucene.index.ThreadedIndexingAndSearchingTestCase$2.run(ThreadedIndexingAndSearchingTestCase.java:347)




Build Log:
[...truncated 1315 lines...]
   [junit4]    > 	at org.apache.lucene.util.AbstractBeforeAfterRule$1.evaluate(AbstractBeforeAfterRule.java:45)
   [junit4]    > 	at org.apache.lucene.util.TestRuleReportUncaughtExceptions$1.evaluate(TestRuleReportUncaughtExceptions.java:68)
   [junit4]    > 	at org.apache.lucene.util.TestRuleStoreClassName$1.evaluate(TestRuleStoreClassName.java:38)
   [junit4]    > 	at org.apache.lucene.util.TestRuleIcuHack$1.evaluate(TestRuleIcuHack.java:51)
   [junit4]    > 	at com.carrotsearch.randomizedtesting.rules.SystemPropertiesInvariantRule$1.evaluate(SystemPropertiesInvariantRule.java:55)
   [junit4]    > 	at org.apache.lucene.util.TestRuleNoInstanceHooksOverrides$1.evaluate(TestRuleNoInstanceHooksOverrides.java:53)
   [junit4]    > 	at org.apache.lucene.util.TestRuleNoStaticHooksShadowing$1.evaluate(TestRuleNoStaticHooksShadowing.java:52)
   [junit4]    > 	at org.apache.lucene.util.TestRuleAssertionsRequired$1.evaluate(TestRuleAssertionsRequired.java:36)
   [junit4]    > 	at org.apache.lucene.util.TestRuleMarkFailure$1.evaluate(TestRuleMarkFailure.java:48)
   [junit4]    > 	at org.apache.lucene.util.TestRuleIgnoreTestSuites$1.evaluate(TestRuleIgnoreTestSuites.java:56)
   [junit4]    > 	at com.carrotsearch.randomizedtesting.RandomizedRunner.runSuite(RandomizedRunner.java:605)
   [junit4]    > 	at com.carrotsearch.randomizedtesting.RandomizedRunner.access$400(RandomizedRunner.java:132)
   [junit4]    > 	at com.carrotsearch.randomizedtesting.RandomizedRunner$2.run(RandomizedRunner.java:551)
   [junit4]    > Caused by: java.lang.RuntimeException: java.lang.AssertionError: sub reader
_6(5.0):c53/2 wasn't warmed
   [junit4]    > 	at __randomizedtesting.SeedInfo.seed([CB2FD7C946A1425B]:0)
   [junit4]    > 	at org.apache.lucene.index.ThreadedIndexingAndSearchingTestCase$2.run(ThreadedIndexingAndSearchingTestCase.java:397)
   [junit4]    > Caused by: java.lang.AssertionError: sub reader _6(5.0):c53/2 wasn't warmed
   [junit4]    > 	at org.junit.Assert.fail(Assert.java:93)
   [junit4]    > 	at org.junit.Assert.assertTrue(Assert.java:43)
   [junit4]    > 	at org.apache.lucene.index.ThreadedIndexingAndSearchingTestCase$2.run(ThreadedIndexingAndSearchingTestCase.java:347)
   [junit4]    > Throwable #3: java.lang.RuntimeException: Thread threw an uncaught exception,
thread: Thread[Thread-621,5,]
   [junit4]    > 	at com.carrotsearch.randomizedtesting.RunnerThreadGroup.processUncaught(RunnerThreadGroup.java:96)
   [junit4]    > 	at com.carrotsearch.randomizedtesting.RandomizedRunner.runSingleTest(RandomizedRunner.java:857)
   [junit4]    > 	at com.carrotsearch.randomizedtesting.RandomizedRunner.access$700(RandomizedRunner.java:132)
   [junit4]    > 	at com.carrotsearch.randomizedtesting.RandomizedRunner$3$1.run(RandomizedRunner.java:669)
   [junit4]    > 	at com.carrotsearch.randomizedtesting.RandomizedRunner$3.evaluate(RandomizedRunner.java:695)
   [junit4]    > 	at com.carrotsearch.randomizedtesting.RandomizedRunner$4.evaluate(RandomizedRunner.java:734)
   [junit4]    > 	at com.carrotsearch.randomizedtesting.RandomizedRunner$5.evaluate(RandomizedRunner.java:745)
   [junit4]    > 	at org.apache.lucene.util.AbstractBeforeAfterRule$1.evaluate(AbstractBeforeAfterRule.java:45)
   [junit4]    > 	at org.apache.lucene.util.TestRuleReportUncaughtExceptions$1.evaluate(TestRuleReportUncaughtExceptions.java:68)
   [junit4]    > 	at org.apache.lucene.util.TestRuleStoreClassName$1.evaluate(TestRuleStoreClassName.java:38)
   [junit4]    > 	at org.apache.lucene.util.TestRuleIcuHack$1.evaluate(TestRuleIcuHack.java:51)
   [junit4]    > 	at com.carrotsearch.randomizedtesting.rules.SystemPropertiesInvariantRule$1.evaluate(SystemPropertiesInvariantRule.java:55)
   [junit4]    > 	at org.apache.lucene.util.TestRuleNoInstanceHooksOverrides$1.evaluate(TestRuleNoInstanceHooksOverrides.java:53)
   [junit4]    > 	at org.apache.lucene.util.TestRuleNoStaticHooksShadowing$1.evaluate(TestRuleNoStaticHooksShadowing.java:52)
   [junit4]    > 	at org.apache.lucene.util.TestRuleAssertionsRequired$1.evaluate(TestRuleAssertionsRequired.java:36)
   [junit4]    > 	at org.apache.lucene.util.TestRuleMarkFailure$1.evaluate(TestRuleMarkFailure.java:48)
   [junit4]    > 	at org.apache.lucene.util.TestRuleIgnoreTestSuites$1.evaluate(TestRuleIgnoreTestSuites.java:56)
   [junit4]    > 	at com.carrotsearch.randomizedtesting.RandomizedRunner.runSuite(RandomizedRunner.java:605)
   [junit4]    > 	at com.carrotsearch.randomizedtesting.RandomizedRunner.access$400(RandomizedRunner.java:132)
   [junit4]    > 	at com.carrotsearch.randomizedtesting.RandomizedRunner$2.run(RandomizedRunner.java:551)
   [junit4]    > Caused by: java.lang.RuntimeException: java.lang.AssertionError: sub reader
_6(5.0):c53/2 wasn't warmed
   [junit4]    > 	at __randomizedtesting.SeedInfo.seed([CB2FD7C946A1425B]:0)
   [junit4]    > 	at org.apache.lucene.index.ThreadedIndexingAndSearchingTestCase$2.run(ThreadedIndexingAndSearchingTestCase.java:397)
   [junit4]    > Caused by: java.lang.AssertionError: sub reader _6(5.0):c53/2 wasn't warmed
   [junit4]    > 	at org.junit.Assert.fail(Assert.java:93)
   [junit4]    > 	at org.junit.Assert.assertTrue(Assert.java:43)
   [junit4]    > 	at org.apache.lucene.index.ThreadedIndexingAndSearchingTestCase$2.run(ThreadedIndexingAndSearchingTestCase.java:347)
   [junit4]    > Throwable #4: java.lang.RuntimeException: Thread threw an uncaught exception,
thread: Thread[Thread-623,5,]
   [junit4]    > 	at com.carrotsearch.randomizedtesting.RunnerThreadGroup.processUncaught(RunnerThreadGroup.java:96)
   [junit4]    > 	at com.carrotsearch.randomizedtesting.RandomizedRunner.runSingleTest(RandomizedRunner.java:857)
   [junit4]    > 	at com.carrotsearch.randomizedtesting.RandomizedRunner.access$700(RandomizedRunner.java:132)
   [junit4]    > 	at com.carrotsearch.randomizedtesting.RandomizedRunner$3$1.run(RandomizedRunner.java:669)
   [junit4]    > 	at com.carrotsearch.randomizedtesting.RandomizedRunner$3.evaluate(RandomizedRunner.java:695)
   [junit4]    > 	at com.carrotsearch.randomizedtesting.RandomizedRunner$4.evaluate(RandomizedRunner.java:734)
   [junit4]    > 	at com.carrotsearch.randomizedtesting.RandomizedRunner$5.evaluate(RandomizedRunner.java:745)
   [junit4]    > 	at org.apache.lucene.util.AbstractBeforeAfterRule$1.evaluate(AbstractBeforeAfterRule.java:45)
   [junit4]    > 	at org.apache.lucene.util.TestRuleReportUncaughtExceptions$1.evaluate(TestRuleReportUncaughtExceptions.java:68)
   [junit4]    > 	at org.apache.lucene.util.TestRuleStoreClassName$1.evaluate(TestRuleStoreClassName.java:38)
   [junit4]    > 	at org.apache.lucene.util.TestRuleIcuHack$1.evaluate(TestRuleIcuHack.java:51)
   [junit4]    > 	at com.carrotsearch.randomizedtesting.rules.SystemPropertiesInvariantRule$1.evaluate(SystemPropertiesInvariantRule.java:55)
   [junit4]    > 	at org.apache.lucene.util.TestRuleNoInstanceHooksOverrides$1.evaluate(TestRuleNoInstanceHooksOverrides.java:53)
   [junit4]    > 	at org.apache.lucene.util.TestRuleNoStaticHooksShadowing$1.evaluate(TestRuleNoStaticHooksShadowing.java:52)
   [junit4]    > 	at org.apache.lucene.util.TestRuleAssertionsRequired$1.evaluate(TestRuleAssertionsRequired.java:36)
   [junit4]    > 	at org.apache.lucene.util.TestRuleMarkFailure$1.evaluate(TestRuleMarkFailure.java:48)
   [junit4]    > 	at org.apache.lucene.util.TestRuleIgnoreTestSuites$1.evaluate(TestRuleIgnoreTestSuites.java:56)
   [junit4]    > 	at com.carrotsearch.randomizedtesting.RandomizedRunner.runSuite(RandomizedRunner.java:605)
   [junit4]    > 	at com.carrotsearch.randomizedtesting.RandomizedRunner.access$400(RandomizedRunner.java:132)
   [junit4]    > 	at com.carrotsearch.randomizedtesting.RandomizedRunner$2.run(RandomizedRunner.java:551)
   [junit4]    > Caused by: java.lang.RuntimeException: java.lang.AssertionError: sub reader
_6(5.0):c53/2 wasn't warmed
   [junit4]    > 	at __randomizedtesting.SeedInfo.seed([CB2FD7C946A1425B]:0)
   [junit4]    > 	at org.apache.lucene.index.ThreadedIndexingAndSearchingTestCase$2.run(ThreadedIndexingAndSearchingTestCase.java:397)
   [junit4]    > Caused by: java.lang.AssertionError: sub reader _6(5.0):c53/2 wasn't warmed
   [junit4]    > 	at org.junit.Assert.fail(Assert.java:93)
   [junit4]    > 	at org.junit.Assert.assertTrue(Assert.java:43)
   [junit4]    > 	at org.apache.lucene.index.ThreadedIndexingAndSearchingTestCase$2.run(ThreadedIndexingAndSearchingTestCase.java:347)
   [junit4]    > 
   [junit4]   1> Thread-622: hit exc
   [junit4]   1> java.lang.AssertionError: sub reader _6(5.0):c53/2 wasn't warmed
   [junit4]   1> 	at org.junit.Assert.fail(Assert.java:93)
   [junit4]   1> 	at org.junit.Assert.assertTrue(Assert.java:43)
   [junit4]   1> 	at org.apache.lucene.index.ThreadedIndexingAndSearchingTestCase$2.run(ThreadedIndexingAndSearchingTestCase.java:347)
   [junit4]   1> Thread-623: hit exc
   [junit4]   1> java.lang.AssertionError: sub reader _6(5.0):c53/2 wasn't warmed
   [junit4]   1> 	at org.junit.Assert.fail(Assert.java:93)
   [junit4]   1> 	at org.junit.Assert.assertTrue(Assert.java:43)
   [junit4]   1> 	at org.apache.lucene.index.ThreadedIndexingAndSearchingTestCase$2.run(ThreadedIndexingAndSearchingTestCase.java:347)
   [junit4]   1> Thread-621: hit exc
   [junit4]   1> java.lang.AssertionError: sub reader _6(5.0):c53/2 wasn't warmed
   [junit4]   1> 	at org.junit.Assert.fail(Assert.java:93)
   [junit4]   1> 	at org.junit.Assert.assertTrue(Assert.java:43)
   [junit4]   1> 	at org.apache.lucene.index.ThreadedIndexingAndSearchingTestCase$2.run(ThreadedIndexingAndSearchingTestCase.java:347)
   [junit4]   2> NOTE: reproduce with: ant test  -Dtestcase=TestSearcherManager -Dtests.method=testSearcherManager
-Dtests.seed=CB2FD7C946A1425B -Dtests.multiplier=3 -Dtests.locale=ro -Dtests.timezone=Asia/Ashkhabad
-Dargs="-Dfile.encoding=UTF-8"
   [junit4]   1> 
   [junit4]   2>
   [junit4]    > (@AfterClass output)
   [junit4]   2> NOTE: test params are: codec=Appending, sim=DefaultSimilarity, locale=ro,
timezone=Asia/Ashkhabad
   [junit4]   2> NOTE: Linux 2.6.32-41-server amd64/Sun Microsystems Inc. 1.6.0_32 (64-bit)/cpus=8,threads=1,free=261216432,total=286654464
   [junit4]   2> NOTE: All tests run in this JVM: [TestCheckIndex, TestNorms, TestIndexWriterLockRelease,
TestNRTReaderWithThreads, TestNoMergeScheduler, TestSimilarityBase, TestSpecialOperations,
TestBytesRefHash, NestedSetupChain, NestedTeardownChain, TestVersion, TestIndexInput, TestMockCharFilter,
TestParallelAtomicReader, Nested, Nested, TestMultiTermQueryRewrites, TestSimpleExplanations,
TestParallelCompositeReader, TestIndexWriterNRTIsCurrent, TestRamUsageEstimator, TestDocValues,
TestSpansAdvanced, TestBinaryDocument, TestPrefixRandom, TestRegexpRandom, TestRandomStoredFields,
TestFSTs, TestSubScorerFreqs, TestMatchAllDocsQuery, TestSpanFirstQuery, TestSearch, TestArrayUtil,
TestDeterminizeLexicon, TestSimilarity, TestTermRangeFilter, TestParallelTermEnum, TestTerm,
TestNumericUtils, TestIndexWriterConfig, TestFieldCacheRewriteMethod, TestAutomatonQueryUnicode,
TestFieldCacheSanityChecker, TestByteBlockPool, TestSortedVIntList, TestCrashCausesCorruptIndex,
TestDocsAndPositions, TestMultiThreadTermVectors, TestFlex, TestDocumentsWriterDeleteQueue,
TestLookaheadTokenFilter, MultiCollectorTest, TestNeverDelete, TestSimpleExplanationsOfNonMatches,
TestPhrasePrefixQuery, TestScoreCachingWrappingScorer, TestIntBlockCodec, TestMultiMMap, TestSegmentReader,
TestDocumentsWriterStallControl, TestRAMDirectory, TestDocCount, TestTopDocsMerge, InBeforeClass,
InAfterClass, InTestMethod, NonStringProperties, TestNRTThreads, TestDisjunctionMaxQuery,
TestTermVectors, TestBooleanOr, TestCharsRef, TestMergeSchedulerExternal, TestParallelReaderEmptyIndex,
TestRollback, TestCompiledAutomaton, TestNearSpansOrdered, TestAppendingCodec, TestIndexFileDeleter,
TestTermsEnum, TestMultiFields, TestTimeLimitingCollector, TestLockFactory, TestWindowsMMap,
TestNumericRangeQuery32, TestTwoPhaseCommitTool, TestComplexExplanationsOfNonMatches, TestLock,
TestFieldMaskingSpanQuery, TestPositionIncrement, TestTransactions, TestIndexWriterUnicode,
TestIdentityHashSet, TestFileSwitchDirectory, TestIndexableField, TestOmitPositions, TestByteArrayDataInput,
TestCustomSearcherSort, TestOpenBitSet, TestCompoundFile, TestAtomicUpdate, TestSimilarity2,
TestFieldsReader, TestTypePromotion, TestMinimize, TestPayloadProcessorProvider, Before3,
Before3, TestSimpleAttributeImpl, TestTermsEnum2, TestMultiLevelSkipList, TestSearcherManager]
   [junit4]   2> 
   [junit4] Completed on J0 in 3.15s, 6 tests, 1 error <<< FAILURES!
[...truncated 244 lines...]

[...truncated 1660 lines...]

[...truncated 1660 lines...]

[...truncated 1660 lines...]

[...truncated 1660 lines...]

[...truncated 1660 lines...]



Mime
View raw message