lucene-dev mailing list archives

Site index · List index
Message view « Date » · « Thread »
Top « Date » · « Thread »
From jenk...@sd-datasolutions.de
Subject [JENKINS] Lucene-Solr-trunk-Windows-Java7-64 - Build # 286 - Failure!
Date Sun, 10 Jun 2012 14:57:59 GMT
Build: http://jenkins.sd-datasolutions.de/job/Lucene-Solr-trunk-Windows-Java7-64/286/

1 tests failed.
REGRESSION:  org.apache.solr.handler.TestReplicationHandler.test

Error Message:
expected:<498> but was:<0>

Stack Trace:
java.lang.AssertionError: expected:<498> but was:<0>
	at __randomizedtesting.SeedInfo.seed([2B5AACA0E54FAFF3:A30E937A4BB3C20B]:0)
	at org.junit.Assert.fail(Assert.java:93)
	at org.junit.Assert.failNotEquals(Assert.java:647)
	at org.junit.Assert.assertEquals(Assert.java:128)
	at org.junit.Assert.assertEquals(Assert.java:472)
	at org.junit.Assert.assertEquals(Assert.java:456)
	at org.apache.solr.handler.TestReplicationHandler.doTestIndexAndConfigReplication(TestReplicationHandler.java:391)
	at org.apache.solr.handler.TestReplicationHandler.test(TestReplicationHandler.java:250)
	at sun.reflect.NativeMethodAccessorImpl.invoke0(Native Method)
	at sun.reflect.NativeMethodAccessorImpl.invoke(NativeMethodAccessorImpl.java:57)
	at sun.reflect.DelegatingMethodAccessorImpl.invoke(DelegatingMethodAccessorImpl.java:43)
	at java.lang.reflect.Method.invoke(Method.java:601)
	at com.carrotsearch.randomizedtesting.RandomizedRunner.invoke(RandomizedRunner.java:1969)
	at com.carrotsearch.randomizedtesting.RandomizedRunner.access$1100(RandomizedRunner.java:132)
	at com.carrotsearch.randomizedtesting.RandomizedRunner$6.evaluate(RandomizedRunner.java:814)
	at com.carrotsearch.randomizedtesting.RandomizedRunner$7.evaluate(RandomizedRunner.java:875)
	at com.carrotsearch.randomizedtesting.RandomizedRunner$8.evaluate(RandomizedRunner.java:889)
	at com.carrotsearch.randomizedtesting.rules.SystemPropertiesRestoreRule$1.evaluate(SystemPropertiesRestoreRule.java:53)
	at org.apache.lucene.util.TestRuleSetupTeardownChained$1.evaluate(TestRuleSetupTeardownChained.java:50)
	at org.apache.lucene.util.TestRuleFieldCacheSanity$1.evaluate(TestRuleFieldCacheSanity.java:32)
	at org.apache.lucene.util.AbstractBeforeAfterRule$1.evaluate(AbstractBeforeAfterRule.java:45)
	at com.carrotsearch.randomizedtesting.rules.SystemPropertiesInvariantRule$1.evaluate(SystemPropertiesInvariantRule.java:55)
	at org.apache.lucene.util.TestRuleReportUncaughtExceptions$1.evaluate(TestRuleReportUncaughtExceptions.java:68)
	at org.apache.lucene.util.TestRuleThreadAndTestName$1.evaluate(TestRuleThreadAndTestName.java:48)
	at org.apache.lucene.util.TestRuleMarkFailure$1.evaluate(TestRuleMarkFailure.java:48)
	at com.carrotsearch.randomizedtesting.RandomizedRunner.runSingleTest(RandomizedRunner.java:821)
	at com.carrotsearch.randomizedtesting.RandomizedRunner.access$700(RandomizedRunner.java:132)
	at com.carrotsearch.randomizedtesting.RandomizedRunner$3$1.run(RandomizedRunner.java:669)
	at com.carrotsearch.randomizedtesting.RandomizedRunner$3.evaluate(RandomizedRunner.java:695)
	at com.carrotsearch.randomizedtesting.RandomizedRunner$4.evaluate(RandomizedRunner.java:734)
	at com.carrotsearch.randomizedtesting.RandomizedRunner$5.evaluate(RandomizedRunner.java:745)
	at com.carrotsearch.randomizedtesting.rules.SystemPropertiesRestoreRule$1.evaluate(SystemPropertiesRestoreRule.java:53)
	at org.apache.lucene.util.AbstractBeforeAfterRule$1.evaluate(AbstractBeforeAfterRule.java:45)
	at org.apache.lucene.util.TestRuleReportUncaughtExceptions$1.evaluate(TestRuleReportUncaughtExceptions.java:68)
	at org.apache.lucene.util.TestRuleStoreClassName$1.evaluate(TestRuleStoreClassName.java:38)
	at org.apache.lucene.util.TestRuleIcuHack$1.evaluate(TestRuleIcuHack.java:51)
	at com.carrotsearch.randomizedtesting.rules.SystemPropertiesInvariantRule$1.evaluate(SystemPropertiesInvariantRule.java:55)
	at org.apache.lucene.util.TestRuleNoInstanceHooksOverrides$1.evaluate(TestRuleNoInstanceHooksOverrides.java:53)
	at org.apache.lucene.util.TestRuleNoStaticHooksShadowing$1.evaluate(TestRuleNoStaticHooksShadowing.java:52)
	at org.apache.lucene.util.TestRuleAssertionsRequired$1.evaluate(TestRuleAssertionsRequired.java:36)
	at org.apache.lucene.util.TestRuleMarkFailure$1.evaluate(TestRuleMarkFailure.java:48)
	at org.apache.lucene.util.TestRuleIgnoreTestSuites$1.evaluate(TestRuleIgnoreTestSuites.java:56)
	at com.carrotsearch.randomizedtesting.RandomizedRunner.runSuite(RandomizedRunner.java:605)
	at com.carrotsearch.randomizedtesting.RandomizedRunner.access$400(RandomizedRunner.java:132)
	at com.carrotsearch.randomizedtesting.RandomizedRunner$2.run(RandomizedRunner.java:551)




Build Log:
[...truncated 13992 lines...]
   [junit4]   2> 45900 T1445 C84 REQ [collection1] webapp=/solr path=/replication params={command=filecontent&checksum=true&generation=7&wt=filestream&file=_3_nrm.cfe}
status=0 QTime=0 
   [junit4]   2> 45911 T1445 C84 REQ [collection1] webapp=/solr path=/replication params={command=filecontent&checksum=true&generation=7&wt=filestream&file=_3.fdx}
status=0 QTime=0 
   [junit4]   2> 45920 T1445 C84 REQ [collection1] webapp=/solr path=/replication params={command=filecontent&checksum=true&generation=7&wt=filestream&file=_3_nrm.cfs}
status=0 QTime=0 
   [junit4]   2> 45924 T1445 C84 REQ [collection1] webapp=/solr path=/replication params={command=filecontent&checksum=true&generation=7&wt=filestream&file=_3_Lucene40_0.tip}
status=0 QTime=0 
   [junit4]   2> 45931 T1445 C84 REQ [collection1] webapp=/solr path=/replication params={command=filecontent&checksum=true&generation=7&wt=filestream&file=segments_7}
status=0 QTime=0 
   [junit4]   2> 45935 T1445 C84 REQ [collection1] webapp=/solr path=/replication params={command=filecontent&checksum=true&generation=7&wt=filestream&file=_3_Lucene40_0.tim}
status=0 QTime=0 
   [junit4]   2> 45944 T1445 C84 REQ [collection1] webapp=/solr path=/replication params={command=filecontent&checksum=true&generation=7&wt=filestream&file=_3_Lucene40_0.frq}
status=0 QTime=0 
   [junit4]   2> 45948 T1445 C84 REQ [collection1] webapp=/solr path=/replication params={command=filecontent&checksum=true&generation=7&wt=filestream&file=_3.si}
status=0 QTime=0 
   [junit4]   2> 45952 T1445 C84 REQ [collection1] webapp=/solr path=/replication params={command=filecontent&checksum=true&generation=7&wt=filestream&file=_3.fnm}
status=0 QTime=0 
   [junit4]   2> 45957 T1445 C84 REQ [collection1] webapp=/solr path=/replication params={command=filecontent&checksum=true&generation=7&wt=filestream&file=_3.fdt}
status=0 QTime=0 
   [junit4]   2> 45959 T1461 oash.SnapPuller.fetchLatestIndex Total time taken for download
: 0 secs
   [junit4]   2> 45962 T1461 oash.SnapPuller.copyAFile SEVERE Unable to move index file
from: .\org.apache.solr.handler.TestReplicationHandler$SolrInstance-1339339470801\slave\data\index.20120610064516\_3_nrm.cfe
to: C:\Jenkins\workspace\Lucene-Solr-trunk-Windows-Java7-64\solr\build\solr-core\test\J0\org.apache.solr.handler.TestReplicationHandler$SolrInstance-1339339470801\slave\data\index.20120610064438\_3_nrm.cfe
Trying to do a copy
   [junit4]   2> 45962 T1461 oash.SnapPuller.copyAFile SEVERE The index directory does
not exist: C:\Jenkins\workspace\Lucene-Solr-trunk-Windows-Java7-64\solr\build\solr-core\test\J0\org.apache.solr.handler.TestReplicationHandler$SolrInstance-1339339470801\slave\data\index.20120610064438
dirs found: [index.20120610064516, index.properties, replication.properties]
   [junit4]   2> 45962 T1461 oash.SnapPuller.copyAFile SEVERE Unable to copy index file
from: .\org.apache.solr.handler.TestReplicationHandler$SolrInstance-1339339470801\slave\data\index.20120610064516\_3_nrm.cfe
to: C:\Jenkins\workspace\Lucene-Solr-trunk-Windows-Java7-64\solr\build\solr-core\test\J0\org.apache.solr.handler.TestReplicationHandler$SolrInstance-1339339470801\slave\data\index.20120610064438\_3_nrm.cfe
java.io.FileNotFoundException: C:\Jenkins\workspace\Lucene-Solr-trunk-Windows-Java7-64\solr\build\solr-core\test\J0\org.apache.solr.handler.TestReplicationHandler$SolrInstance-1339339470801\slave\data\index.20120610064438\_3_nrm.cfe
(The system cannot find the path specified)
   [junit4]   2> 	at java.io.FileOutputStream.open(Native Method)
   [junit4]   2> 	at java.io.FileOutputStream.<init>(FileOutputStream.java:212)
   [junit4]   2> 	at java.io.FileOutputStream.<init>(FileOutputStream.java:165)
   [junit4]   2> 	at org.apache.solr.util.FileUtils.copyFile(FileUtils.java:48)
   [junit4]   2> 	at org.apache.solr.handler.SnapPuller.copyAFile(SnapPuller.java:654)
   [junit4]   2> 	at org.apache.solr.handler.SnapPuller.copyIndexFiles(SnapPuller.java:703)
   [junit4]   2> 	at org.apache.solr.handler.SnapPuller.fetchLatestIndex(SnapPuller.java:371)
   [junit4]   2> 	at org.apache.solr.handler.ReplicationHandler.doFetch(ReplicationHandler.java:298)
   [junit4]   2> 	at org.apache.solr.handler.SnapPuller$1.run(SnapPuller.java:169)
   [junit4]   2> 	at java.util.concurrent.Executors$RunnableAdapter.call(Executors.java:471)
   [junit4]   2> 	at java.util.concurrent.FutureTask$Sync.innerRunAndReset(FutureTask.java:351)
   [junit4]   2> 	at java.util.concurrent.FutureTask.runAndReset(FutureTask.java:178)
   [junit4]   2> 	at java.util.concurrent.ScheduledThreadPoolExecutor$ScheduledFutureTask.access$301(ScheduledThreadPoolExecutor.java:178)
   [junit4]   2> 	at java.util.concurrent.ScheduledThreadPoolExecutor$ScheduledFutureTask.run(ScheduledThreadPoolExecutor.java:293)
   [junit4]   2> 	at java.util.concurrent.ThreadPoolExecutor.runWorker(ThreadPoolExecutor.java:1110)
   [junit4]   2> 	at java.util.concurrent.ThreadPoolExecutor$Worker.run(ThreadPoolExecutor.java:603)
   [junit4]   2> 	at java.lang.Thread.run(Thread.java:722)
   [junit4]   2> 
   [junit4]   2> 46003 T1453 C85 REQ [collection1] webapp=/solr path=/select params={wt=javabin&q=*:*&version=2}
hits=0 status=0 QTime=0 
   [junit4]   2> 46149 T1453 C85 REQ [collection1] webapp=/solr path=/select params={wt=javabin&q=*:*&version=2}
hits=0 status=0 QTime=0 
   [junit4]   2> 46295 T1453 C85 REQ [collection1] webapp=/solr path=/select params={wt=javabin&q=*:*&version=2}
hits=0 status=0 QTime=0 
   [junit4]   2> 46442 T1453 C85 REQ [collection1] webapp=/solr path=/select params={wt=javabin&q=*:*&version=2}
hits=0 status=0 QTime=0 
   [junit4]   2> 46588 T1453 C85 REQ [collection1] webapp=/solr path=/select params={wt=javabin&q=*:*&version=2}
hits=0 status=0 QTime=0 
   [junit4]   2> 46735 T1453 C85 REQ [collection1] webapp=/solr path=/select params={wt=javabin&q=*:*&version=2}
hits=0 status=0 QTime=0 
   [junit4]   2> 46881 T1453 C85 REQ [collection1] webapp=/solr path=/select params={wt=javabin&q=*:*&version=2}
hits=0 status=0 QTime=0 
   [junit4]   2> 46956 T1445 C84 REQ [collection1] webapp=/solr path=/replication params={command=indexversion&wt=javabin}
status=0 QTime=0 
   [junit4]   2> 46957 T1461 oash.SnapPuller.fetchLatestIndex Master's generation: 7
   [junit4]   2> 46957 T1461 oash.SnapPuller.fetchLatestIndex Slave's generation: 6
   [junit4]   2> 46957 T1461 oash.SnapPuller.fetchLatestIndex Starting replication process
   [junit4]   2> 46964 T1445 C84 REQ [collection1] webapp=/solr path=/replication params={command=filelist&wt=javabin&generation=7}
status=0 QTime=3 
   [junit4]   2> 46966 T1461 oash.SnapPuller.fetchLatestIndex Number of files in latest
index in master: 10
   [junit4]   2> 46970 T1445 C84 REQ [collection1] webapp=/solr path=/replication params={command=filecontent&checksum=true&generation=7&wt=filestream&file=_3_nrm.cfe}
status=0 QTime=0 
   [junit4]   2> 46977 T1445 C84 REQ [collection1] webapp=/solr path=/replication params={command=filecontent&checksum=true&generation=7&wt=filestream&file=_3.fdx}
status=0 QTime=0 
   [junit4]   2> 46982 T1445 C84 REQ [collection1] webapp=/solr path=/replication params={command=filecontent&checksum=true&generation=7&wt=filestream&file=_3_nrm.cfs}
status=0 QTime=0 
   [junit4]   2> 46989 T1445 C84 REQ [collection1] webapp=/solr path=/replication params={command=filecontent&checksum=true&generation=7&wt=filestream&file=_3_Lucene40_0.tip}
status=0 QTime=0 
   [junit4]   2> 46995 T1445 C84 REQ [collection1] webapp=/solr path=/replication params={command=filecontent&checksum=true&generation=7&wt=filestream&file=segments_7}
status=0 QTime=0 
   [junit4]   2> 47000 T1445 C84 REQ [collection1] webapp=/solr path=/replication params={command=filecontent&checksum=true&generation=7&wt=filestream&file=_3_Lucene40_0.tim}
status=0 QTime=0 
   [junit4]   2> 47006 T1445 C84 REQ [collection1] webapp=/solr path=/replication params={command=filecontent&checksum=true&generation=7&wt=filestream&file=_3_Lucene40_0.frq}
status=0 QTime=0 
   [junit4]   2> 47011 T1445 C84 REQ [collection1] webapp=/solr path=/replication params={command=filecontent&checksum=true&generation=7&wt=filestream&file=_3.si}
status=0 QTime=0 
   [junit4]   2> 47017 T1445 C84 REQ [collection1] webapp=/solr path=/replication params={command=filecontent&checksum=true&generation=7&wt=filestream&file=_3.fnm}
status=0 QTime=0 
   [junit4]   2> 47021 T1445 C84 REQ [collection1] webapp=/solr path=/replication params={command=filecontent&checksum=true&generation=7&wt=filestream&file=_3.fdt}
status=0 QTime=0 
   [junit4]   2> 47024 T1461 oash.SnapPuller.fetchLatestIndex Total time taken for download
: 0 secs
   [junit4]   2> 47025 T1461 oash.SnapPuller.copyAFile SEVERE Unable to move index file
from: .\org.apache.solr.handler.TestReplicationHandler$SolrInstance-1339339470801\slave\data\index.20120610064517\_3_nrm.cfe
to: C:\Jenkins\workspace\Lucene-Solr-trunk-Windows-Java7-64\solr\build\solr-core\test\J0\org.apache.solr.handler.TestReplicationHandler$SolrInstance-1339339470801\slave\data\index.20120610064438\_3_nrm.cfe
Trying to do a copy
   [junit4]   2> 47026 T1461 oash.SnapPuller.copyAFile SEVERE The index directory does
not exist: C:\Jenkins\workspace\Lucene-Solr-trunk-Windows-Java7-64\solr\build\solr-core\test\J0\org.apache.solr.handler.TestReplicationHandler$SolrInstance-1339339470801\slave\data\index.20120610064438
dirs found: [index.20120610064517, index.properties, replication.properties]
   [junit4]   2> 47026 T1461 oash.SnapPuller.copyAFile SEVERE Unable to copy index file
from: .\org.apache.solr.handler.TestReplicationHandler$SolrInstance-1339339470801\slave\data\index.20120610064517\_3_nrm.cfe
to: C:\Jenkins\workspace\Lucene-Solr-trunk-Windows-Java7-64\solr\build\solr-core\test\J0\org.apache.solr.handler.TestReplicationHandler$SolrInstance-1339339470801\slave\data\index.20120610064438\_3_nrm.cfe
java.io.FileNotFoundException: C:\Jenkins\workspace\Lucene-Solr-trunk-Windows-Java7-64\solr\build\solr-core\test\J0\org.apache.solr.handler.TestReplicationHandler$SolrInstance-1339339470801\slave\data\index.20120610064438\_3_nrm.cfe
(The system cannot find the path specified)
   [junit4]   2> 	at java.io.FileOutputStream.open(Native Method)
   [junit4]   2> 	at java.io.FileOutputStream.<init>(FileOutputStream.java:212)
   [junit4]   2> 	at java.io.FileOutputStream.<init>(FileOutputStream.java:165)
   [junit4]   2> 	at org.apache.solr.util.FileUtils.copyFile(FileUtils.java:48)
   [junit4]   2> 	at org.apache.solr.handler.SnapPuller.copyAFile(SnapPuller.java:654)
   [junit4]   2> 	at org.apache.solr.handler.SnapPuller.copyIndexFiles(SnapPuller.java:703)
   [junit4]   2> 	at org.apache.solr.handler.SnapPuller.fetchLatestIndex(SnapPuller.java:371)
   [junit4]   2> 	at org.apache.solr.handler.ReplicationHandler.doFetch(ReplicationHandler.java:298)
   [junit4]   2> 	at org.apache.solr.handler.SnapPuller$1.run(SnapPuller.java:169)
   [junit4]   2> 	at java.util.concurrent.Executors$RunnableAdapter.call(Executors.java:471)
   [junit4]   2> 	at java.util.concurrent.FutureTask$Sync.innerRunAndReset(FutureTask.java:351)
   [junit4]   2> 	at java.util.concurrent.FutureTask.runAndReset(FutureTask.java:178)
   [junit4]   2> 	at java.util.concurrent.ScheduledThreadPoolExecutor$ScheduledFutureTask.access$301(ScheduledThreadPoolExecutor.java:178)
   [junit4]   2> 	at java.util.concurrent.ScheduledThreadPoolExecutor$ScheduledFutureTask.run(ScheduledThreadPoolExecutor.java:293)
   [junit4]   2> 	at java.util.concurrent.ThreadPoolExecutor.runWorker(ThreadPoolExecutor.java:1110)
   [junit4]   2> 	at java.util.concurrent.ThreadPoolExecutor$Worker.run(ThreadPoolExecutor.java:603)
   [junit4]   2> 	at java.lang.Thread.run(Thread.java:722)
   [junit4]   2> 
   [junit4]   2> 47028 T1453 C85 REQ [collection1] webapp=/solr path=/select params={wt=javabin&q=*:*&version=2}
hits=0 status=0 QTime=0 
   [junit4]   2> 47185 T1453 C85 REQ [collection1] webapp=/solr path=/select params={wt=javabin&q=*:*&version=2}
hits=0 status=0 QTime=1 
   [junit4]   2> 47331 T1453 C85 REQ [collection1] webapp=/solr path=/select params={wt=javabin&q=*:*&version=2}
hits=0 status=0 QTime=1 
   [junit4]   2> 47479 T1453 C85 REQ [collection1] webapp=/solr path=/select params={wt=javabin&q=*:*&version=2}
hits=0 status=0 QTime=0 
   [junit4]   2> 47623 T1395 oas.SolrTestCaseJ4.tearDown ###Ending test
   [junit4]   2> NOTE: reproduce with: ant test  -Dtestcase=TestReplicationHandler -Dtests.method=test
-Dtests.seed=2B5AACA0E54FAFF3 -Dtests.locale=is_IS -Dtests.timezone=America/Yakutat -Dargs="-Dfile.encoding=Cp1252"
   [junit4]   2>
   [junit4]    > (@AfterClass output)
   [junit4]   2> 47665 T1395 oasc.CoreContainer.shutdown Shutting down CoreContainer instance=761224206
   [junit4]   2> 47665 T1395 oasc.SolrCore.close [collection1]  CLOSING SolrCore org.apache.solr.core.SolrCore@ec564dc
   [junit4]   2> 47668 T1395 oasc.SolrCore.closeSearcher [collection1] Closing main searcher
on request.
   [junit4]   2> 47669 T1395 oasu.DirectUpdateHandler2.close closing DirectUpdateHandler2{commits=4,autocommits=0,soft
autocommits=0,optimizes=0,rollbacks=0,expungeDeletes=0,docsPending=0,adds=0,deletesById=0,deletesByQuery=0,errors=0,cumulative_adds=997,cumulative_deletesById=0,cumulative_deletesByQuery=2,cumulative_errors=0}
   [junit4]   2> 47677 T1395 oejsh.ContextHandler.doStop stopped o.e.j.s.ServletContextHandler{/solr,null}
   [junit4]   2> 47731 T1395 oasc.CoreContainer.shutdown Shutting down CoreContainer instance=1322890502
   [junit4]   2> 47731 T1395 oasc.SolrCore.close [collection1]  CLOSING SolrCore org.apache.solr.core.SolrCore@3dc2a853
   [junit4]   2> 47732 T1395 oasc.SolrCore.closeSearcher [collection1] Closing main searcher
on request.
   [junit4]   2> 47734 T1395 oasu.DirectUpdateHandler2.close closing DirectUpdateHandler2{commits=8,autocommits=0,soft
autocommits=0,optimizes=0,rollbacks=0,expungeDeletes=0,docsPending=0,adds=0,deletesById=0,deletesByQuery=0,errors=0,cumulative_adds=5,cumulative_deletesById=0,cumulative_deletesByQuery=0,cumulative_errors=0}
   [junit4]   2> 47737 T1395 oejsh.ContextHandler.doStop stopped o.e.j.s.ServletContextHandler{/solr,null}
   [junit4]   2> 47819 T1395 oas.SolrTestCaseJ4.deleteCore ###deleteCore
   [junit4]   2> NOTE: test params are: codec=Lucene40: {}, sim=DefaultSimilarity, locale=is_IS,
timezone=America/Yakutat
   [junit4]   2> NOTE: Windows 7 6.1 amd64/Oracle Corporation 1.7.0_04 (64-bit)/cpus=2,threads=1,free=54195024,total=243466240
   [junit4]   2> NOTE: All tests run in this JVM: [RequestHandlersTest, TestNorwegianLightStemFilterFactory,
TestQueryUtils, OverseerTest, TestBeiderMorseFilterFactory, TestElisionFilterFactory, TestSolrQueryParser,
TestArbitraryIndexDir, TestQuerySenderNoQuery, TestShingleFilterFactory, TestJapaneseBaseFormFilterFactory,
SpellCheckComponentTest, TestJapaneseTokenizerFactory, MinimalSchemaTest, TestKeepFilterFactory,
SearchHandlerTest, SimpleFacetsTest, TestNorwegianMinimalStemFilterFactory, TestCapitalizationFilterFactory,
TestPHPSerializedResponseWriter, TestSpanishLightStemFilterFactory, TestItalianLightStemFilterFactory,
IndexSchemaTest, TestRecovery, DisMaxRequestHandlerTest, TestSolrDeletionPolicy1, TestOmitPositions,
FieldMutatingUpdateProcessorTest, DistributedTermsComponentTest, TestDistributedSearch, SystemInfoHandlerTest,
BasicZkTest, PingRequestHandlerTest, PrimUtilsTest, TermsComponentTest, QueryParsingTest,
TestLRUCache, OutputWriterTest, StandardRequestHandlerTest, TestQueryTypes, TestHTMLStripCharFilterFactory,
TestBM25SimilarityFactory, AutoCommitTest, TestBinaryField, BinaryUpdateRequestHandlerTest,
TestJmxMonitoredMap, DirectSolrSpellCheckerTest, FastVectorHighlighterTest, TestPluginEnable,
TestHashPartitioner, JSONWriterTest, ZkSolrClientTest, TestPatternReplaceFilterFactory, CurrencyFieldTest,
CommonGramsFilterFactoryTest, FileUtilsTest, TestBinaryResponseWriter, URLClassifyProcessorTest,
AlternateDirectoryTest, TestCzechStemFilterFactory, BadComponentTest, SpatialFilterTest, TestLMJelinekMercerSimilarityFactory,
DefaultValueUpdateProcessorTest, SuggesterWFSTTest, NotRequiredUniqueKeyTest, TestJapaneseKatakanaStemFilterFactory,
TestIBSimilarityFactory, TestPropInject, TestCSVLoader, TestRemoveDuplicatesTokenFilterFactory,
DirectSolrConnectionTest, TestGermanLightStemFilterFactory, TestEnglishMinimalStemFilterFactory,
TestSolrXMLSerializer, TestJapaneseReadingFormFilterFactory, TestReverseStringFilterFactory,
TestKStemFilterFactory, IndexBasedSpellCheckerTest, TestRussianLightStemFilterFactory, SolrCoreCheckLockOnStartupTest,
TestFrenchLightStemFilterFactory, TermVectorComponentTest, TestHindiFilters, TestConfig, TestCJKBigramFilterFactory,
MultiTermTest, TestPorterStemFilterFactory, MoreLikeThisHandlerTest, CloudStateUpdateTest,
TestIndexingPerformance, StatsComponentTest, DocumentBuilderTest, RequiredFieldsTest, TestPatternTokenizerFactory,
TestUpdate, TestSwedishLightStemFilterFactory, SampleTest, TestCoreContainer, SolrPluginUtilsTest,
TestUtils, SortByFunctionTest, LegacyHTMLStripCharFilterTest, TestReplicationHandler]
   [junit4]   2> 
   [junit4] Completed in 47.83s, 1 test, 1 failure <<< FAILURES!
[...truncated 802 lines...]

[...truncated 14895 lines...]

[...truncated 14895 lines...]

[...truncated 14895 lines...]

[...truncated 14895 lines...]

[...truncated 14895 lines...]



Mime
View raw message