lucene-dev mailing list archives

Site index · List index
Message view « Date » · « Thread »
Top « Date » · « Thread »
From jenk...@sd-datasolutions.de
Subject [JENKINS] Lucene-Solr-trunk-Windows-Java6-64 - Build # 438 - Failure!
Date Tue, 05 Jun 2012 19:35:05 GMT
Build: http://jenkins.sd-datasolutions.de/job/Lucene-Solr-trunk-Windows-Java6-64/438/

1 tests failed.
REGRESSION:  org.apache.solr.handler.TestReplicationHandler.test

Error Message:
expected:<498> but was:<0>

Stack Trace:
java.lang.AssertionError: expected:<498> but was:<0>
	at __randomizedtesting.SeedInfo.seed([CCCCEA703F9BF690:4498D5AA91679B68]:0)
	at org.junit.Assert.fail(Assert.java:93)
	at org.junit.Assert.failNotEquals(Assert.java:647)
	at org.junit.Assert.assertEquals(Assert.java:128)
	at org.junit.Assert.assertEquals(Assert.java:472)
	at org.junit.Assert.assertEquals(Assert.java:456)
	at org.apache.solr.handler.TestReplicationHandler.doTestIndexAndConfigReplication(TestReplicationHandler.java:391)
	at org.apache.solr.handler.TestReplicationHandler.test(TestReplicationHandler.java:250)
	at sun.reflect.NativeMethodAccessorImpl.invoke0(Native Method)
	at sun.reflect.NativeMethodAccessorImpl.invoke(NativeMethodAccessorImpl.java:39)
	at sun.reflect.DelegatingMethodAccessorImpl.invoke(DelegatingMethodAccessorImpl.java:25)
	at java.lang.reflect.Method.invoke(Method.java:597)
	at com.carrotsearch.randomizedtesting.RandomizedRunner.invoke(RandomizedRunner.java:1969)
	at com.carrotsearch.randomizedtesting.RandomizedRunner.access$1100(RandomizedRunner.java:132)
	at com.carrotsearch.randomizedtesting.RandomizedRunner$6.evaluate(RandomizedRunner.java:814)
	at com.carrotsearch.randomizedtesting.RandomizedRunner$7.evaluate(RandomizedRunner.java:875)
	at com.carrotsearch.randomizedtesting.RandomizedRunner$8.evaluate(RandomizedRunner.java:889)
	at com.carrotsearch.randomizedtesting.rules.SystemPropertiesRestoreRule$1.evaluate(SystemPropertiesRestoreRule.java:53)
	at org.apache.lucene.util.TestRuleSetupTeardownChained$1.evaluate(TestRuleSetupTeardownChained.java:50)
	at org.apache.lucene.util.TestRuleFieldCacheSanity$1.evaluate(TestRuleFieldCacheSanity.java:32)
	at org.apache.lucene.util.AbstractBeforeAfterRule$1.evaluate(AbstractBeforeAfterRule.java:45)
	at com.carrotsearch.randomizedtesting.rules.SystemPropertiesInvariantRule$1.evaluate(SystemPropertiesInvariantRule.java:55)
	at org.apache.lucene.util.TestRuleReportUncaughtExceptions$1.evaluate(TestRuleReportUncaughtExceptions.java:68)
	at org.apache.lucene.util.TestRuleThreadAndTestName$1.evaluate(TestRuleThreadAndTestName.java:48)
	at org.apache.lucene.util.TestRuleMarkFailure$1.evaluate(TestRuleMarkFailure.java:48)
	at com.carrotsearch.randomizedtesting.RandomizedRunner.runSingleTest(RandomizedRunner.java:821)
	at com.carrotsearch.randomizedtesting.RandomizedRunner.access$700(RandomizedRunner.java:132)
	at com.carrotsearch.randomizedtesting.RandomizedRunner$3$1.run(RandomizedRunner.java:669)
	at com.carrotsearch.randomizedtesting.RandomizedRunner$3.evaluate(RandomizedRunner.java:695)
	at com.carrotsearch.randomizedtesting.RandomizedRunner$4.evaluate(RandomizedRunner.java:734)
	at com.carrotsearch.randomizedtesting.RandomizedRunner$5.evaluate(RandomizedRunner.java:745)
	at com.carrotsearch.randomizedtesting.rules.SystemPropertiesRestoreRule$1.evaluate(SystemPropertiesRestoreRule.java:53)
	at org.apache.lucene.util.AbstractBeforeAfterRule$1.evaluate(AbstractBeforeAfterRule.java:45)
	at org.apache.lucene.util.TestRuleReportUncaughtExceptions$1.evaluate(TestRuleReportUncaughtExceptions.java:68)
	at org.apache.lucene.util.TestRuleStoreClassName$1.evaluate(TestRuleStoreClassName.java:38)
	at org.apache.lucene.util.TestRuleIcuHack$1.evaluate(TestRuleIcuHack.java:51)
	at com.carrotsearch.randomizedtesting.rules.SystemPropertiesInvariantRule$1.evaluate(SystemPropertiesInvariantRule.java:55)
	at org.apache.lucene.util.TestRuleNoInstanceHooksOverrides$1.evaluate(TestRuleNoInstanceHooksOverrides.java:53)
	at org.apache.lucene.util.TestRuleNoStaticHooksShadowing$1.evaluate(TestRuleNoStaticHooksShadowing.java:52)
	at org.apache.lucene.util.TestRuleAssertionsRequired$1.evaluate(TestRuleAssertionsRequired.java:36)
	at org.apache.lucene.util.TestRuleMarkFailure$1.evaluate(TestRuleMarkFailure.java:48)
	at org.apache.lucene.util.TestRuleIgnoreTestSuites$1.evaluate(TestRuleIgnoreTestSuites.java:56)
	at com.carrotsearch.randomizedtesting.RandomizedRunner.runSuite(RandomizedRunner.java:605)
	at com.carrotsearch.randomizedtesting.RandomizedRunner.access$400(RandomizedRunner.java:132)
	at com.carrotsearch.randomizedtesting.RandomizedRunner$2.run(RandomizedRunner.java:551)




Build Log:
[...truncated 13567 lines...]
   [junit4]   2> 28370 T3104 C158 REQ [collection1] webapp=/solr path=/replication params={command=filecontent&checksum=true&generation=7&wt=filestream&file=_3.fdt}
status=0 QTime=0 
   [junit4]   2> 28372 T3121 oash.SnapPuller.fetchLatestIndex Total time taken for download
: 0 secs
   [junit4]   2> 28373 T3121 oash.SnapPuller.copyAFile SEVERE Unable to move index file
from: .\org.apache.solr.handler.TestReplicationHandler$SolrInstance-1338924646646\slave\data\index.20120605203114\_3_nrm.cfe
to: C:\Jenkins\workspace\Lucene-Solr-trunk-Windows-Java6-64\solr\build\solr-core\test\J0\org.apache.solr.handler.TestReplicationHandler$SolrInstance-1338924646646\slave\data\index.20120605203052\_3_nrm.cfe
Trying to do a copy
   [junit4]   2> 28373 T3121 oash.SnapPuller.copyAFile SEVERE Unable to copy index file
from: .\org.apache.solr.handler.TestReplicationHandler$SolrInstance-1338924646646\slave\data\index.20120605203114\_3_nrm.cfe
to: C:\Jenkins\workspace\Lucene-Solr-trunk-Windows-Java6-64\solr\build\solr-core\test\J0\org.apache.solr.handler.TestReplicationHandler$SolrInstance-1338924646646\slave\data\index.20120605203052\_3_nrm.cfe
java.io.FileNotFoundException: C:\Jenkins\workspace\Lucene-Solr-trunk-Windows-Java6-64\solr\build\solr-core\test\J0\org.apache.solr.handler.TestReplicationHandler$SolrInstance-1338924646646\slave\data\index.20120605203052\_3_nrm.cfe
(The system cannot find the path specified)
   [junit4]   2> 	at java.io.FileOutputStream.open(Native Method)
   [junit4]   2> 	at java.io.FileOutputStream.<init>(FileOutputStream.java:194)
   [junit4]   2> 	at java.io.FileOutputStream.<init>(FileOutputStream.java:145)
   [junit4]   2> 	at org.apache.solr.util.FileUtils.copyFile(FileUtils.java:48)
   [junit4]   2> 	at org.apache.solr.handler.SnapPuller.copyAFile(SnapPuller.java:654)
   [junit4]   2> 	at org.apache.solr.handler.SnapPuller.copyIndexFiles(SnapPuller.java:691)
   [junit4]   2> 	at org.apache.solr.handler.SnapPuller.fetchLatestIndex(SnapPuller.java:371)
   [junit4]   2> 	at org.apache.solr.handler.ReplicationHandler.doFetch(ReplicationHandler.java:298)
   [junit4]   2> 	at org.apache.solr.handler.SnapPuller$1.run(SnapPuller.java:169)
   [junit4]   2> 	at java.util.concurrent.Executors$RunnableAdapter.call(Executors.java:441)
   [junit4]   2> 	at java.util.concurrent.FutureTask$Sync.innerRunAndReset(FutureTask.java:317)
   [junit4]   2> 	at java.util.concurrent.FutureTask.runAndReset(FutureTask.java:150)
   [junit4]   2> 	at java.util.concurrent.ScheduledThreadPoolExecutor$ScheduledFutureTask.access$101(ScheduledThreadPoolExecutor.java:98)
   [junit4]   2> 	at java.util.concurrent.ScheduledThreadPoolExecutor$ScheduledFutureTask.runPeriodic(ScheduledThreadPoolExecutor.java:180)
   [junit4]   2> 	at java.util.concurrent.ScheduledThreadPoolExecutor$ScheduledFutureTask.run(ScheduledThreadPoolExecutor.java:204)
   [junit4]   2> 	at java.util.concurrent.ThreadPoolExecutor$Worker.runTask(ThreadPoolExecutor.java:886)
   [junit4]   2> 	at java.util.concurrent.ThreadPoolExecutor$Worker.run(ThreadPoolExecutor.java:908)
   [junit4]   2> 	at java.lang.Thread.run(Thread.java:662)
   [junit4]   2> 
   [junit4]   2> 28410 T3113 C159 REQ [collection1] webapp=/solr path=/select params={wt=javabin&q=*:*&version=2}
hits=0 status=0 QTime=0 
   [junit4]   2> 28492 T3113 C159 REQ [collection1] webapp=/solr path=/select params={wt=javabin&q=*:*&version=2}
hits=0 status=0 QTime=1 
   [junit4]   2> 28572 T3113 C159 REQ [collection1] webapp=/solr path=/select params={wt=javabin&q=*:*&version=2}
hits=0 status=0 QTime=0 
   [junit4]   2> 28655 T3113 C159 REQ [collection1] webapp=/solr path=/select params={wt=javabin&q=*:*&version=2}
hits=0 status=0 QTime=0 
   [junit4]   2> 28706 T2869 oaz.ClientCnxn$SendThread.startConnect Opening socket connection
to server 127.0.0.1/127.0.0.1:53493
   [junit4]   2> 28736 T3113 C159 REQ [collection1] webapp=/solr path=/select params={wt=javabin&q=*:*&version=2}
hits=0 status=0 QTime=0 
   [junit4]   2> 28816 T3113 C159 REQ [collection1] webapp=/solr path=/select params={wt=javabin&q=*:*&version=2}
hits=0 status=0 QTime=0 
   [junit4]   2> 28897 T3113 C159 REQ [collection1] webapp=/solr path=/select params={wt=javabin&q=*:*&version=2}
hits=0 status=0 QTime=0 
   [junit4]   2> 28980 T3113 C159 REQ [collection1] webapp=/solr path=/select params={wt=javabin&q=*:*&version=2}
hits=0 status=0 QTime=0 
   [junit4]   2> 29061 T3113 C159 REQ [collection1] webapp=/solr path=/select params={wt=javabin&q=*:*&version=2}
hits=0 status=0 QTime=0 
   [junit4]   2> 29103 T3104 C158 REQ [collection1] webapp=/solr path=/replication params={command=indexversion&wt=javabin}
status=0 QTime=0 
   [junit4]   2> 29104 T3121 oash.SnapPuller.fetchLatestIndex Master's generation: 7
   [junit4]   2> 29104 T3121 oash.SnapPuller.fetchLatestIndex Slave's generation: 6
   [junit4]   2> 29104 T3121 oash.SnapPuller.fetchLatestIndex Starting replication process
   [junit4]   2> 29106 T3104 C158 REQ [collection1] webapp=/solr path=/replication params={command=filelist&wt=javabin&generation=7}
status=0 QTime=0 
   [junit4]   2> 29107 T3121 oash.SnapPuller.fetchLatestIndex Number of files in latest
index in master: 10
   [junit4]   2> 29111 T3104 C158 REQ [collection1] webapp=/solr path=/replication params={command=filecontent&checksum=true&generation=7&wt=filestream&file=_3_nrm.cfe}
status=0 QTime=0 
   [junit4]   2> 29115 T3104 C158 REQ [collection1] webapp=/solr path=/replication params={command=filecontent&checksum=true&generation=7&wt=filestream&file=_3.fdx}
status=0 QTime=0 
   [junit4]   2> 29119 T3104 C158 REQ [collection1] webapp=/solr path=/replication params={command=filecontent&checksum=true&generation=7&wt=filestream&file=_3_nrm.cfs}
status=0 QTime=0 
   [junit4]   2> 29122 T3104 C158 REQ [collection1] webapp=/solr path=/replication params={command=filecontent&checksum=true&generation=7&wt=filestream&file=_3_Lucene40_0.tip}
status=0 QTime=0 
   [junit4]   2> 29127 T3104 C158 REQ [collection1] webapp=/solr path=/replication params={command=filecontent&checksum=true&generation=7&wt=filestream&file=segments_7}
status=0 QTime=0 
   [junit4]   2> 29131 T3104 C158 REQ [collection1] webapp=/solr path=/replication params={command=filecontent&checksum=true&generation=7&wt=filestream&file=_3_Lucene40_0.tim}
status=0 QTime=0 
   [junit4]   2> 29134 T3104 C158 REQ [collection1] webapp=/solr path=/replication params={command=filecontent&checksum=true&generation=7&wt=filestream&file=_3_Lucene40_0.frq}
status=0 QTime=0 
   [junit4]   2> 29137 T3104 C158 REQ [collection1] webapp=/solr path=/replication params={command=filecontent&checksum=true&generation=7&wt=filestream&file=_3.si}
status=0 QTime=0 
   [junit4]   2> 29141 T3104 C158 REQ [collection1] webapp=/solr path=/replication params={command=filecontent&checksum=true&generation=7&wt=filestream&file=_3.fnm}
status=0 QTime=0 
   [junit4]   2> 29142 T3113 C159 REQ [collection1] webapp=/solr path=/select params={wt=javabin&q=*:*&version=2}
hits=0 status=0 QTime=0 
   [junit4]   2> 29144 T3104 C158 REQ [collection1] webapp=/solr path=/replication params={command=filecontent&checksum=true&generation=7&wt=filestream&file=_3.fdt}
status=0 QTime=0 
   [junit4]   2> 29146 T3121 oash.SnapPuller.fetchLatestIndex Total time taken for download
: 0 secs
   [junit4]   2> 29148 T3121 oash.SnapPuller.copyAFile SEVERE Unable to move index file
from: .\org.apache.solr.handler.TestReplicationHandler$SolrInstance-1338924646646\slave\data\index.20120605203115\_3_nrm.cfe
to: C:\Jenkins\workspace\Lucene-Solr-trunk-Windows-Java6-64\solr\build\solr-core\test\J0\org.apache.solr.handler.TestReplicationHandler$SolrInstance-1338924646646\slave\data\index.20120605203052\_3_nrm.cfe
Trying to do a copy
   [junit4]   2> 29148 T3121 oash.SnapPuller.copyAFile SEVERE Unable to copy index file
from: .\org.apache.solr.handler.TestReplicationHandler$SolrInstance-1338924646646\slave\data\index.20120605203115\_3_nrm.cfe
to: C:\Jenkins\workspace\Lucene-Solr-trunk-Windows-Java6-64\solr\build\solr-core\test\J0\org.apache.solr.handler.TestReplicationHandler$SolrInstance-1338924646646\slave\data\index.20120605203052\_3_nrm.cfe
java.io.FileNotFoundException: C:\Jenkins\workspace\Lucene-Solr-trunk-Windows-Java6-64\solr\build\solr-core\test\J0\org.apache.solr.handler.TestReplicationHandler$SolrInstance-1338924646646\slave\data\index.20120605203052\_3_nrm.cfe
(The system cannot find the path specified)
   [junit4]   2> 	at java.io.FileOutputStream.open(Native Method)
   [junit4]   2> 	at java.io.FileOutputStream.<init>(FileOutputStream.java:194)
   [junit4]   2> 	at java.io.FileOutputStream.<init>(FileOutputStream.java:145)
   [junit4]   2> 	at org.apache.solr.util.FileUtils.copyFile(FileUtils.java:48)
   [junit4]   2> 	at org.apache.solr.handler.SnapPuller.copyAFile(SnapPuller.java:654)
   [junit4]   2> 	at org.apache.solr.handler.SnapPuller.copyIndexFiles(SnapPuller.java:691)
   [junit4]   2> 	at org.apache.solr.handler.SnapPuller.fetchLatestIndex(SnapPuller.java:371)
   [junit4]   2> 	at org.apache.solr.handler.ReplicationHandler.doFetch(ReplicationHandler.java:298)
   [junit4]   2> 	at org.apache.solr.handler.SnapPuller$1.run(SnapPuller.java:169)
   [junit4]   2> 	at java.util.concurrent.Executors$RunnableAdapter.call(Executors.java:441)
   [junit4]   2> 	at java.util.concurrent.FutureTask$Sync.innerRunAndReset(FutureTask.java:317)
   [junit4]   2> 	at java.util.concurrent.FutureTask.runAndReset(FutureTask.java:150)
   [junit4]   2> 	at java.util.concurrent.ScheduledThreadPoolExecutor$ScheduledFutureTask.access$101(ScheduledThreadPoolExecutor.java:98)
   [junit4]   2> 	at java.util.concurrent.ScheduledThreadPoolExecutor$ScheduledFutureTask.runPeriodic(ScheduledThreadPoolExecutor.java:180)
   [junit4]   2> 	at java.util.concurrent.ScheduledThreadPoolExecutor$ScheduledFutureTask.run(ScheduledThreadPoolExecutor.java:204)
   [junit4]   2> 	at java.util.concurrent.ThreadPoolExecutor$Worker.runTask(ThreadPoolExecutor.java:886)
   [junit4]   2> 	at java.util.concurrent.ThreadPoolExecutor$Worker.run(ThreadPoolExecutor.java:908)
   [junit4]   2> 	at java.lang.Thread.run(Thread.java:662)
   [junit4]   2> 
   [junit4]   2> 29223 T3113 C159 REQ [collection1] webapp=/solr path=/select params={wt=javabin&q=*:*&version=2}
hits=0 status=0 QTime=0 
   [junit4]   2> 29305 T3113 C159 REQ [collection1] webapp=/solr path=/select params={wt=javabin&q=*:*&version=2}
hits=0 status=0 QTime=0 
   [junit4]   2> 29386 T3113 C159 REQ [collection1] webapp=/solr path=/select params={wt=javabin&q=*:*&version=2}
hits=0 status=0 QTime=0 
   [junit4]   2> 29446 T2869 oaz.ClientCnxn$SendThread.run WARNING Session 0x137be1e55250010
for server null, unexpected error, closing socket connection and attempting reconnect java.net.ConnectException:
Connection refused: no further information
   [junit4]   2> 	at sun.nio.ch.SocketChannelImpl.checkConnect(Native Method)
   [junit4]   2> 	at sun.nio.ch.SocketChannelImpl.finishConnect(SocketChannelImpl.java:599)
   [junit4]   2> 	at org.apache.zookeeper.ClientCnxn$SendThread.run(ClientCnxn.java:1146)
   [junit4]   2> 
   [junit4]   2> 29466 T3113 C159 REQ [collection1] webapp=/solr path=/select params={wt=javabin&q=*:*&version=2}
hits=0 status=0 QTime=0 
   [junit4]   2> 29546 T3055 oas.SolrTestCaseJ4.tearDown ###Ending test
   [junit4]   2> NOTE: reproduce with: ant test  -Dtestcase=TestReplicationHandler -Dtests.method=test
-Dtests.seed=CCCCEA703F9BF690 -Dtests.locale=fr_CA -Dtests.timezone=Africa/Porto-Novo -Dargs="-Dfile.encoding=Cp1252"
   [junit4]   2>
   [junit4]    > (@AfterClass output)
   [junit4]   2> 29557 T3055 oasc.CoreContainer.shutdown Shutting down CoreContainer instance=157757407
   [junit4]   2> 29557 T3055 oasc.SolrCore.close [collection1]  CLOSING SolrCore org.apache.solr.core.SolrCore@64a9c06b
   [junit4]   2> 29557 T3055 oasc.SolrCore.closeSearcher [collection1] Closing main searcher
on request.
   [junit4]   2> 29558 T3055 oasu.DirectUpdateHandler2.close closing DirectUpdateHandler2{commits=4,autocommits=0,soft
autocommits=0,optimizes=0,rollbacks=0,expungeDeletes=0,docsPending=0,adds=0,deletesById=0,deletesByQuery=0,errors=0,cumulative_adds=997,cumulative_deletesById=0,cumulative_deletesByQuery=2,cumulative_errors=0}
   [junit4]   2> 29560 T3055 oejsh.ContextHandler.doStop stopped o.e.j.s.ServletContextHandler{/solr,null}
   [junit4]   2> 29612 T3055 oasc.CoreContainer.shutdown Shutting down CoreContainer instance=2073301035
   [junit4]   2> 29613 T3055 oasc.SolrCore.close [collection1]  CLOSING SolrCore org.apache.solr.core.SolrCore@187cd530
   [junit4]   2> 29613 T3055 oasc.SolrCore.closeSearcher [collection1] Closing main searcher
on request.
   [junit4]   2> 29614 T3055 oasu.DirectUpdateHandler2.close closing DirectUpdateHandler2{commits=8,autocommits=0,soft
autocommits=0,optimizes=0,rollbacks=0,expungeDeletes=0,docsPending=0,adds=0,deletesById=0,deletesByQuery=0,errors=0,cumulative_adds=5,cumulative_deletesById=0,cumulative_deletesByQuery=0,cumulative_errors=0}
   [junit4]   2> 29617 T3055 oejsh.ContextHandler.doStop stopped o.e.j.s.ServletContextHandler{/solr,null}
   [junit4]   2> 29682 T3055 oas.SolrTestCaseJ4.deleteCore ###deleteCore
   [junit4]   2> NOTE: test params are: codec=Lucene40: {}, sim=RandomSimilarityProvider(queryNorm=true,coord=true):
{}, locale=fr_CA, timezone=Africa/Porto-Novo
   [junit4]   2> NOTE: Windows 7 6.1 amd64/Sun Microsystems Inc. 1.6.0_32 (64-bit)/cpus=2,threads=1,free=119972984,total=259194880
   [junit4]   2> NOTE: All tests run in this JVM: [SortByFunctionTest, AlternateDirectoryTest,
TestWikipediaTokenizerFactory, TestPhraseSuggestions, StatsComponentTest, TestPortugueseLightStemFilterFactory,
TestPortugueseStemFilterFactory, OverseerTest, TestDefaultSimilarityFactory, HighlighterConfigTest,
UniqFieldsUpdateProcessorFactoryTest, TestFrenchMinimalStemFilterFactory, TestTurkishLowerCaseFilterFactory,
TestBM25SimilarityFactory, TestCollationField, LukeRequestHandlerTest, SuggesterTSTTest, SystemInfoHandlerTest,
UpdateRequestProcessorFactoryTest, TestQueryUtils, TestIrishLowerCaseFilterFactory, TestPHPSerializedResponseWriter,
TestTrie, TestBulgarianStemFilterFactory, IndexSchemaRuntimeFieldTest, SOLR749Test, SolrInfoMBeanTest,
TestArabicFilters, TestGreekStemFilterFactory, TestBadConfig, DirectUpdateHandlerTest, TestFoldingMultitermQuery,
TestLatvianStemFilterFactory, BasicDistributedZkTest, JSONWriterTest, TestGermanLightStemFilterFactory,
TestJapaneseTokenizerFactory, TestGermanNormalizationFilterFactory, TestQuerySenderNoQuery,
DocumentBuilderTest, TestCodecSupport, NumericFieldsTest, TestIndexingPerformance, SpatialFilterTest,
TestGreekLowerCaseFilterFactory, TestPropInjectDefaults, TestCapitalizationFilterFactory,
TestHashPartitioner, TestPhoneticFilterFactory, SampleTest, TestThaiWordFilterFactory, TestWriterPerf,
TestCJKBigramFilterFactory, TestTypeTokenFilterFactory, TestJoin, ReturnFieldsTest, TestJapaneseBaseFormFilterFactory,
ZkNodePropsTest, TestMultiCoreConfBootstrap, TestTrimFilterFactory, TestHungarianLightStemFilterFactory,
TestGalicianStemFilterFactory, TestPatternReplaceFilterFactory, TestDistributedGrouping, CopyFieldTest,
TestPluginEnable, TestXIncludeConfig, CloudStateTest, TestDFRSimilarityFactory, TestPropInject,
TestPatternReplaceCharFilterFactory, SpellCheckCollatorTest, CSVRequestHandlerTest, SpellingQueryConverterTest,
TestSolrXMLSerializer, SearchHandlerTest, DirectSolrSpellCheckerTest, DateFieldTest, XsltUpdateRequestHandlerTest,
IndexSchemaTest, DistributedSpellCheckComponentTest, TestDistributedSearch, DoubleMetaphoneFilterFactoryTest,
ResourceLoaderTest, SolrCoreCheckLockOnStartupTest, PolyFieldTest, TestSurroundQueryParser,
SpellCheckComponentTest, TestUtils, TestNumberUtils, TestReverseStringFilterFactory, TestGermanMinimalStemFilterFactory,
TestNorwegianLightStemFilterFactory, MoreLikeThisHandlerTest, TestBinaryField, SolrIndexConfigTest,
PrimitiveFieldTypeTest, DirectSolrConnectionTest, TestBrazilianStemFilterFactory, TestSpanishLightStemFilterFactory,
CommonGramsQueryFilterFactoryTest, AutoCommitTest, TestFiltering, DirectUpdateHandlerOptimizeTest,
TestQueryTypes, PeerSyncTest, TestSearchPerf, RAMDirectoryFactoryTest, TestGalicianMinimalStemFilterFactory,
XmlUpdateRequestHandlerTest, PrimUtilsTest, DefaultValueUpdateProcessorTest, TestRemoveDuplicatesTokenFilterFactory,
TestPseudoReturnFields, TestPorterStemFilterFactory, TestRealTimeGet, LegacyHTMLStripCharFilterTest,
HighlighterTest, TestIndexSearcher, JsonLoaderTest, DistributedQueryElevationComponentTest,
TestFunctionQuery, TestUAX29URLEmailTokenizerFactory, FileBasedSpellCheckerTest, CoreAdminHandlerTest,
TestMappingCharFilterFactory, SignatureUpdateProcessorFactoryTest, TestElisionFilterFactory,
BasicZkTest, TestReversedWildcardFilterFactory, MinimalSchemaTest, TestSwedishLightStemFilterFactory,
TestDelimitedPayloadTokenFilterFactory, TestHyphenationCompoundWordTokenFilterFactory, TestRussianLightStemFilterFactory,
UpdateParamsTest, TestLFUCache, TestKeepFilterFactory, TestQuerySenderListener, LoggingHandlerTest,
TestPersianNormalizationFilterFactory, LeaderElectionTest, SolrCoreTest, ZkControllerTest,
SolrCmdDistributorTest, TestFinnishLightStemFilterFactory, TestKeywordMarkerFilterFactory,
SuggesterTest, WordBreakSolrSpellCheckerTest, TestSystemIdResolver, TestSolrDeletionPolicy2,
TestArbitraryIndexDir, TermVectorComponentTest, SoftAutoCommitTest, RecoveryZkTest, TestSuggestSpellingConverter,
ShowFileRequestHandlerTest, TestJmxIntegration, TestGermanStemFilterFactory, SolrPluginUtilsTest,
SnowballPorterFilterFactoryTest, TestDocSet, TestExtendedDismaxParser, TestItalianLightStemFilterFactory,
NotRequiredUniqueKeyTest, DateMathParserTest, TestJapanesePartOfSpeechStopFilterFactory, StandardRequestHandlerTest,
UUIDFieldTest, DebugComponentTest, TestConfig, TestFastLRUCache, TestEnglishMinimalStemFilterFactory,
FieldAnalysisRequestHandlerTest, NodeStateWatcherTest, DocumentAnalysisRequestHandlerTest,
TestMultiWordSynonyms, TestValueSourceCache, FileUtilsTest, URLClassifyProcessorTest, IndexReaderFactoryTest,
PingRequestHandlerTest, TestLMDirichletSimilarityFactory, DOMUtilTest, TestRemoteStreaming,
TestMergePolicyConfig, SolrRequestParserTest, TestHTMLStripCharFilterFactory, TestPerFieldSimilarity,
DistanceFunctionTest, TestPatternTokenizerFactory, TestFrenchLightStemFilterFactory, BadComponentTest,
TestIndonesianStemFilterFactory, FastVectorHighlighterTest, LengthFilterTest, FullSolrCloudTest,
TestLRUCache, TestCoreContainer, FullSolrCloudDistribCmdsTest, LeaderElectionIntegrationTest,
TestReplicationHandler]
   [junit4]   2> 
   [junit4] Completed in 29.69s, 1 test, 1 failure <<< FAILURES!
[...truncated 229 lines...]

[...truncated 13897 lines...]

[...truncated 13897 lines...]

[...truncated 13897 lines...]

[...truncated 13897 lines...]

[...truncated 13897 lines...]



Mime
View raw message