lucene-dev mailing list archives

Site index · List index
Message view « Date » · « Thread »
Top « Date » · « Thread »
From jenk...@sd-datasolutions.de
Subject [JENKINS] Lucene-Solr-4.x-Windows-Java7-64 - Build # 41 - Failure!
Date Mon, 11 Jun 2012 12:50:54 GMT
Build: http://jenkins.sd-datasolutions.de/job/Lucene-Solr-4.x-Windows-Java7-64/41/

1 tests failed.
REGRESSION:  org.apache.solr.handler.TestReplicationHandler.test

Error Message:
expected:<494> but was:<0>

Stack Trace:
java.lang.AssertionError: expected:<494> but was:<0>
	at __randomizedtesting.SeedInfo.seed([5CB24A4021D11B91:D4E6759A8F2D7669]:0)
	at org.junit.Assert.fail(Assert.java:93)
	at org.junit.Assert.failNotEquals(Assert.java:647)
	at org.junit.Assert.assertEquals(Assert.java:128)
	at org.junit.Assert.assertEquals(Assert.java:472)
	at org.junit.Assert.assertEquals(Assert.java:456)
	at org.apache.solr.handler.TestReplicationHandler.doTestIndexAndConfigAliasReplication(TestReplicationHandler.java:716)
	at org.apache.solr.handler.TestReplicationHandler.test(TestReplicationHandler.java:254)
	at sun.reflect.NativeMethodAccessorImpl.invoke0(Native Method)
	at sun.reflect.NativeMethodAccessorImpl.invoke(NativeMethodAccessorImpl.java:57)
	at sun.reflect.DelegatingMethodAccessorImpl.invoke(DelegatingMethodAccessorImpl.java:43)
	at java.lang.reflect.Method.invoke(Method.java:601)
	at com.carrotsearch.randomizedtesting.RandomizedRunner.invoke(RandomizedRunner.java:1969)
	at com.carrotsearch.randomizedtesting.RandomizedRunner.access$1100(RandomizedRunner.java:132)
	at com.carrotsearch.randomizedtesting.RandomizedRunner$6.evaluate(RandomizedRunner.java:814)
	at com.carrotsearch.randomizedtesting.RandomizedRunner$7.evaluate(RandomizedRunner.java:875)
	at com.carrotsearch.randomizedtesting.RandomizedRunner$8.evaluate(RandomizedRunner.java:889)
	at com.carrotsearch.randomizedtesting.rules.SystemPropertiesRestoreRule$1.evaluate(SystemPropertiesRestoreRule.java:53)
	at org.apache.lucene.util.TestRuleSetupTeardownChained$1.evaluate(TestRuleSetupTeardownChained.java:50)
	at org.apache.lucene.util.TestRuleFieldCacheSanity$1.evaluate(TestRuleFieldCacheSanity.java:32)
	at org.apache.lucene.util.AbstractBeforeAfterRule$1.evaluate(AbstractBeforeAfterRule.java:45)
	at com.carrotsearch.randomizedtesting.rules.SystemPropertiesInvariantRule$1.evaluate(SystemPropertiesInvariantRule.java:55)
	at org.apache.lucene.util.TestRuleReportUncaughtExceptions$1.evaluate(TestRuleReportUncaughtExceptions.java:68)
	at org.apache.lucene.util.TestRuleThreadAndTestName$1.evaluate(TestRuleThreadAndTestName.java:48)
	at org.apache.lucene.util.TestRuleMarkFailure$1.evaluate(TestRuleMarkFailure.java:48)
	at com.carrotsearch.randomizedtesting.RandomizedRunner.runSingleTest(RandomizedRunner.java:821)
	at com.carrotsearch.randomizedtesting.RandomizedRunner.access$700(RandomizedRunner.java:132)
	at com.carrotsearch.randomizedtesting.RandomizedRunner$3$1.run(RandomizedRunner.java:669)
	at com.carrotsearch.randomizedtesting.RandomizedRunner$3.evaluate(RandomizedRunner.java:695)
	at com.carrotsearch.randomizedtesting.RandomizedRunner$4.evaluate(RandomizedRunner.java:734)
	at com.carrotsearch.randomizedtesting.RandomizedRunner$5.evaluate(RandomizedRunner.java:745)
	at com.carrotsearch.randomizedtesting.rules.SystemPropertiesRestoreRule$1.evaluate(SystemPropertiesRestoreRule.java:53)
	at org.apache.lucene.util.AbstractBeforeAfterRule$1.evaluate(AbstractBeforeAfterRule.java:45)
	at org.apache.lucene.util.TestRuleReportUncaughtExceptions$1.evaluate(TestRuleReportUncaughtExceptions.java:68)
	at org.apache.lucene.util.TestRuleStoreClassName$1.evaluate(TestRuleStoreClassName.java:38)
	at org.apache.lucene.util.TestRuleIcuHack$1.evaluate(TestRuleIcuHack.java:51)
	at com.carrotsearch.randomizedtesting.rules.SystemPropertiesInvariantRule$1.evaluate(SystemPropertiesInvariantRule.java:55)
	at org.apache.lucene.util.TestRuleNoInstanceHooksOverrides$1.evaluate(TestRuleNoInstanceHooksOverrides.java:53)
	at org.apache.lucene.util.TestRuleNoStaticHooksShadowing$1.evaluate(TestRuleNoStaticHooksShadowing.java:52)
	at org.apache.lucene.util.TestRuleAssertionsRequired$1.evaluate(TestRuleAssertionsRequired.java:36)
	at org.apache.lucene.util.TestRuleMarkFailure$1.evaluate(TestRuleMarkFailure.java:48)
	at org.apache.lucene.util.TestRuleIgnoreTestSuites$1.evaluate(TestRuleIgnoreTestSuites.java:56)
	at com.carrotsearch.randomizedtesting.RandomizedRunner.runSuite(RandomizedRunner.java:605)
	at com.carrotsearch.randomizedtesting.RandomizedRunner.access$400(RandomizedRunner.java:132)
	at com.carrotsearch.randomizedtesting.RandomizedRunner$2.run(RandomizedRunner.java:551)




Build Log:
[...truncated 17470 lines...]
   [junit4]   2> 63741 T2697 C164 REQ [collection1] webapp=/solr path=/replication params={command=filecontent&checksum=true&generation=16&wt=filestream&file=_9_Lucene40_0.tim}
status=0 QTime=0 
   [junit4]   2> 63746 T2697 C164 REQ [collection1] webapp=/solr path=/replication params={command=filecontent&checksum=true&generation=16&wt=filestream&file=_9_nrm.cfe}
status=0 QTime=0 
   [junit4]   2> 63753 T2697 C164 REQ [collection1] webapp=/solr path=/replication params={command=filecontent&checksum=true&generation=16&wt=filestream&file=_9.fnm}
status=0 QTime=0 
   [junit4]   2> 63756 T2697 C164 REQ [collection1] webapp=/solr path=/replication params={command=filecontent&checksum=true&generation=16&wt=filestream&file=_9_nrm.cfs}
status=0 QTime=0 
   [junit4]   2> 63764 T2697 C164 REQ [collection1] webapp=/solr path=/replication params={command=filecontent&checksum=true&generation=16&wt=filestream&file=_9.fdt}
status=0 QTime=0 
   [junit4]   2> 63769 T2697 C164 REQ [collection1] webapp=/solr path=/replication params={command=filecontent&checksum=true&generation=16&wt=filestream&file=_9_Lucene40_0.tip}
status=0 QTime=0 
   [junit4]   2> 63775 T2697 C164 REQ [collection1] webapp=/solr path=/replication params={command=filecontent&checksum=true&generation=16&wt=filestream&file=_9.si}
status=0 QTime=0 
   [junit4]   2> 63782 T2697 C164 REQ [collection1] webapp=/solr path=/replication params={command=filecontent&checksum=true&generation=16&wt=filestream&file=_9.fdx}
status=0 QTime=0 
   [junit4]   2> 63787 T2697 C164 REQ [collection1] webapp=/solr path=/replication params={command=filecontent&checksum=true&generation=16&wt=filestream&file=segments_g}
status=0 QTime=0 
   [junit4]   2> 63792 T2697 C164 REQ [collection1] webapp=/solr path=/replication params={command=filecontent&checksum=true&generation=16&wt=filestream&file=_9_Lucene40_0.frq}
status=0 QTime=0 
   [junit4]   2> 63793 T2715 oash.SnapPuller.fetchLatestIndex Total time taken for download
: 0 secs
   [junit4]   2> 63796 T2715 oash.SnapPuller.copyAFile SEVERE Unable to move index file
from: .\org.apache.solr.handler.TestReplicationHandler$SolrInstance-1339418735801\slave\data\index.20120611084639\_9_Lucene40_0.tim
to: C:\Jenkins\workspace\Lucene-Solr-4.x-Windows-Java7-64\solr\build\solr-core\test\J0\org.apache.solr.handler.TestReplicationHandler$SolrInstance-1339418735801\slave\data\index.20120611084603\_9_Lucene40_0.tim
Trying to do a copy
   [junit4]   2> 63796 T2715 oash.SnapPuller.copyAFile SEVERE Unable to copy index file
from: .\org.apache.solr.handler.TestReplicationHandler$SolrInstance-1339418735801\slave\data\index.20120611084639\_9_Lucene40_0.tim
to: C:\Jenkins\workspace\Lucene-Solr-4.x-Windows-Java7-64\solr\build\solr-core\test\J0\org.apache.solr.handler.TestReplicationHandler$SolrInstance-1339418735801\slave\data\index.20120611084603\_9_Lucene40_0.tim
java.io.FileNotFoundException: C:\Jenkins\workspace\Lucene-Solr-4.x-Windows-Java7-64\solr\build\solr-core\test\J0\org.apache.solr.handler.TestReplicationHandler$SolrInstance-1339418735801\slave\data\index.20120611084603\_9_Lucene40_0.tim
(The system cannot find the path specified)
   [junit4]   2> 	at java.io.FileOutputStream.open(Native Method)
   [junit4]   2> 	at java.io.FileOutputStream.<init>(FileOutputStream.java:212)
   [junit4]   2> 	at java.io.FileOutputStream.<init>(FileOutputStream.java:165)
   [junit4]   2> 	at org.apache.solr.util.FileUtils.copyFile(FileUtils.java:48)
   [junit4]   2> 	at org.apache.solr.handler.SnapPuller.copyAFile(SnapPuller.java:654)
   [junit4]   2> 	at org.apache.solr.handler.SnapPuller.copyIndexFiles(SnapPuller.java:691)
   [junit4]   2> 	at org.apache.solr.handler.SnapPuller.fetchLatestIndex(SnapPuller.java:371)
   [junit4]   2> 	at org.apache.solr.handler.ReplicationHandler.doFetch(ReplicationHandler.java:298)
   [junit4]   2> 	at org.apache.solr.handler.SnapPuller$1.run(SnapPuller.java:169)
   [junit4]   2> 	at java.util.concurrent.Executors$RunnableAdapter.call(Executors.java:471)
   [junit4]   2> 	at java.util.concurrent.FutureTask$Sync.innerRunAndReset(FutureTask.java:351)
   [junit4]   2> 	at java.util.concurrent.FutureTask.runAndReset(FutureTask.java:178)
   [junit4]   2> 	at java.util.concurrent.ScheduledThreadPoolExecutor$ScheduledFutureTask.access$301(ScheduledThreadPoolExecutor.java:178)
   [junit4]   2> 	at java.util.concurrent.ScheduledThreadPoolExecutor$ScheduledFutureTask.run(ScheduledThreadPoolExecutor.java:293)
   [junit4]   2> 	at java.util.concurrent.ThreadPoolExecutor.runWorker(ThreadPoolExecutor.java:1110)
   [junit4]   2> 	at java.util.concurrent.ThreadPoolExecutor$Worker.run(ThreadPoolExecutor.java:603)
   [junit4]   2> 	at java.lang.Thread.run(Thread.java:722)
   [junit4]   2> 
   [junit4]   2> 63818 T2707 C165 REQ [collection1] webapp=/solr path=/select params={wt=javabin&q=*:*&version=2}
hits=0 status=0 QTime=0 
   [junit4]   2> 63952 T2707 C165 REQ [collection1] webapp=/solr path=/select params={wt=javabin&q=*:*&version=2}
hits=0 status=0 QTime=0 
   [junit4]   2> 64088 T2707 C165 REQ [collection1] webapp=/solr path=/select params={wt=javabin&q=*:*&version=2}
hits=0 status=0 QTime=0 
   [junit4]   2> 64227 T2707 C165 REQ [collection1] webapp=/solr path=/select params={wt=javabin&q=*:*&version=2}
hits=0 status=0 QTime=0 
   [junit4]   2> 64361 T2707 C165 REQ [collection1] webapp=/solr path=/select params={wt=javabin&q=*:*&version=2}
hits=0 status=0 QTime=0 
   [junit4]   2> 64494 T2707 C165 REQ [collection1] webapp=/solr path=/select params={wt=javabin&q=*:*&version=2}
hits=0 status=0 QTime=0 
   [junit4]   2> 64628 T2707 C165 REQ [collection1] webapp=/solr path=/select params={wt=javabin&q=*:*&version=2}
hits=0 status=0 QTime=0 
   [junit4]   2> 64762 T2707 C165 REQ [collection1] webapp=/solr path=/select params={wt=javabin&q=*:*&version=2}
hits=0 status=0 QTime=0 
   [junit4]   2> 64847 T2697 C164 REQ [collection1] webapp=/solr path=/replication params={command=indexversion&wt=javabin}
status=0 QTime=0 
   [junit4]   2> 64849 T2715 oash.SnapPuller.fetchLatestIndex Master's generation: 16
   [junit4]   2> 64849 T2715 oash.SnapPuller.fetchLatestIndex Slave's generation: 15
   [junit4]   2> 64849 T2715 oash.SnapPuller.fetchLatestIndex Starting replication process
   [junit4]   2> 64852 T2697 C164 REQ [collection1] webapp=/solr path=/replication params={command=filelist&wt=javabin&generation=16}
status=0 QTime=1 
   [junit4]   2> 64854 T2715 oash.SnapPuller.fetchLatestIndex Number of files in latest
index in master: 10
   [junit4]   2> 64858 T2697 C164 REQ [collection1] webapp=/solr path=/replication params={command=filecontent&checksum=true&generation=16&wt=filestream&file=_9_Lucene40_0.tim}
status=0 QTime=0 
   [junit4]   2> 64863 T2697 C164 REQ [collection1] webapp=/solr path=/replication params={command=filecontent&checksum=true&generation=16&wt=filestream&file=_9_nrm.cfe}
status=0 QTime=0 
   [junit4]   2> 64868 T2697 C164 REQ [collection1] webapp=/solr path=/replication params={command=filecontent&checksum=true&generation=16&wt=filestream&file=_9.fnm}
status=0 QTime=0 
   [junit4]   2> 64874 T2697 C164 REQ [collection1] webapp=/solr path=/replication params={command=filecontent&checksum=true&generation=16&wt=filestream&file=_9_nrm.cfs}
status=0 QTime=0 
   [junit4]   2> 64880 T2697 C164 REQ [collection1] webapp=/solr path=/replication params={command=filecontent&checksum=true&generation=16&wt=filestream&file=_9.fdt}
status=0 QTime=0 
   [junit4]   2> 64885 T2697 C164 REQ [collection1] webapp=/solr path=/replication params={command=filecontent&checksum=true&generation=16&wt=filestream&file=_9_Lucene40_0.tip}
status=0 QTime=0 
   [junit4]   2> 64890 T2697 C164 REQ [collection1] webapp=/solr path=/replication params={command=filecontent&checksum=true&generation=16&wt=filestream&file=_9.si}
status=0 QTime=0 
   [junit4]   2> 64897 T2697 C164 REQ [collection1] webapp=/solr path=/replication params={command=filecontent&checksum=true&generation=16&wt=filestream&file=_9.fdx}
status=0 QTime=0 
   [junit4]   2> 64897 T2707 C165 REQ [collection1] webapp=/solr path=/select params={wt=javabin&q=*:*&version=2}
hits=0 status=0 QTime=0 
   [junit4]   2> 64902 T2697 C164 REQ [collection1] webapp=/solr path=/replication params={command=filecontent&checksum=true&generation=16&wt=filestream&file=segments_g}
status=0 QTime=0 
   [junit4]   2> 64919 T2697 C164 REQ [collection1] webapp=/solr path=/replication params={command=filecontent&checksum=true&generation=16&wt=filestream&file=_9_Lucene40_0.frq}
status=0 QTime=0 
   [junit4]   2> 64921 T2715 oash.SnapPuller.fetchLatestIndex Total time taken for download
: 0 secs
   [junit4]   2> 64923 T2715 oash.SnapPuller.copyAFile SEVERE Unable to move index file
from: .\org.apache.solr.handler.TestReplicationHandler$SolrInstance-1339418735801\slave\data\index.20120611084640\_9_Lucene40_0.tim
to: C:\Jenkins\workspace\Lucene-Solr-4.x-Windows-Java7-64\solr\build\solr-core\test\J0\org.apache.solr.handler.TestReplicationHandler$SolrInstance-1339418735801\slave\data\index.20120611084603\_9_Lucene40_0.tim
Trying to do a copy
   [junit4]   2> 64923 T2715 oash.SnapPuller.copyAFile SEVERE Unable to copy index file
from: .\org.apache.solr.handler.TestReplicationHandler$SolrInstance-1339418735801\slave\data\index.20120611084640\_9_Lucene40_0.tim
to: C:\Jenkins\workspace\Lucene-Solr-4.x-Windows-Java7-64\solr\build\solr-core\test\J0\org.apache.solr.handler.TestReplicationHandler$SolrInstance-1339418735801\slave\data\index.20120611084603\_9_Lucene40_0.tim
java.io.FileNotFoundException: C:\Jenkins\workspace\Lucene-Solr-4.x-Windows-Java7-64\solr\build\solr-core\test\J0\org.apache.solr.handler.TestReplicationHandler$SolrInstance-1339418735801\slave\data\index.20120611084603\_9_Lucene40_0.tim
(The system cannot find the path specified)
   [junit4]   2> 	at java.io.FileOutputStream.open(Native Method)
   [junit4]   2> 	at java.io.FileOutputStream.<init>(FileOutputStream.java:212)
   [junit4]   2> 	at java.io.FileOutputStream.<init>(FileOutputStream.java:165)
   [junit4]   2> 	at org.apache.solr.util.FileUtils.copyFile(FileUtils.java:48)
   [junit4]   2> 	at org.apache.solr.handler.SnapPuller.copyAFile(SnapPuller.java:654)
   [junit4]   2> 	at org.apache.solr.handler.SnapPuller.copyIndexFiles(SnapPuller.java:691)
   [junit4]   2> 	at org.apache.solr.handler.SnapPuller.fetchLatestIndex(SnapPuller.java:371)
   [junit4]   2> 	at org.apache.solr.handler.ReplicationHandler.doFetch(ReplicationHandler.java:298)
   [junit4]   2> 	at org.apache.solr.handler.SnapPuller$1.run(SnapPuller.java:169)
   [junit4]   2> 	at java.util.concurrent.Executors$RunnableAdapter.call(Executors.java:471)
   [junit4]   2> 	at java.util.concurrent.FutureTask$Sync.innerRunAndReset(FutureTask.java:351)
   [junit4]   2> 	at java.util.concurrent.FutureTask.runAndReset(FutureTask.java:178)
   [junit4]   2> 	at java.util.concurrent.ScheduledThreadPoolExecutor$ScheduledFutureTask.access$301(ScheduledThreadPoolExecutor.java:178)
   [junit4]   2> 	at java.util.concurrent.ScheduledThreadPoolExecutor$ScheduledFutureTask.run(ScheduledThreadPoolExecutor.java:293)
   [junit4]   2> 	at java.util.concurrent.ThreadPoolExecutor.runWorker(ThreadPoolExecutor.java:1110)
   [junit4]   2> 	at java.util.concurrent.ThreadPoolExecutor$Worker.run(ThreadPoolExecutor.java:603)
   [junit4]   2> 	at java.lang.Thread.run(Thread.java:722)
   [junit4]   2> 
   [junit4]   2> 65029 T2707 C165 REQ [collection1] webapp=/solr path=/select params={wt=javabin&q=*:*&version=2}
hits=0 status=0 QTime=0 
   [junit4]   2> 65161 T2707 C165 REQ [collection1] webapp=/solr path=/select params={wt=javabin&q=*:*&version=2}
hits=0 status=0 QTime=0 
   [junit4]   2> 65291 T2538 oas.SolrTestCaseJ4.tearDown ###Ending test
   [junit4]   1> replicate slave to master
   [junit4]   2> NOTE: reproduce with: ant test  -Dtestcase=TestReplicationHandler -Dtests.method=test
-Dtests.seed=5CB24A4021D11B91 -Dtests.locale=sr_ME_#Latn -Dtests.timezone=America/Port_of_Spain
-Dargs="-Dfile.encoding=Cp1252"
   [junit4]   1> 
   [junit4]   2>
   [junit4]    > (@AfterClass output)
   [junit4]   2> 65313 T2538 oasc.CoreContainer.shutdown Shutting down CoreContainer instance=748326739
   [junit4]   2> 65314 T2538 oasc.SolrCore.close [collection1]  CLOSING SolrCore org.apache.solr.core.SolrCore@687d00fc
   [junit4]   2> 65314 T2538 oasc.SolrCore.closeSearcher [collection1] Closing main searcher
on request.
   [junit4]   2> 65315 T2538 oasu.DirectUpdateHandler2.close closing DirectUpdateHandler2{commits=2,autocommits=0,soft
autocommits=0,optimizes=0,rollbacks=0,expungeDeletes=0,docsPending=0,adds=0,deletesById=0,deletesByQuery=0,errors=0,cumulative_adds=494,cumulative_deletesById=0,cumulative_deletesByQuery=1,cumulative_errors=0}
   [junit4]   2> 65320 T2538 oejsh.ContextHandler.doStop stopped o.e.j.s.ServletContextHandler{/solr,null}
   [junit4]   2> 65375 T2538 oasc.CoreContainer.shutdown Shutting down CoreContainer instance=1766664976
   [junit4]   2> 65377 T2538 oasc.SolrCore.close [collection1]  CLOSING SolrCore org.apache.solr.core.SolrCore@64c17aa5
   [junit4]   2> 65381 T2538 oasc.SolrCore.closeSearcher [collection1] Closing main searcher
on request.
   [junit4]   2> 65381 T2538 oasu.DirectUpdateHandler2.close closing DirectUpdateHandler2{commits=1,autocommits=0,soft
autocommits=0,optimizes=0,rollbacks=0,expungeDeletes=0,docsPending=0,adds=0,deletesById=0,deletesByQuery=0,errors=0,cumulative_adds=0,cumulative_deletesById=0,cumulative_deletesByQuery=0,cumulative_errors=0}
   [junit4]   2> 65385 T2538 oejsh.ContextHandler.doStop stopped o.e.j.s.ServletContextHandler{/solr,null}
   [junit4]   2> 65457 T2538 oas.SolrTestCaseJ4.deleteCore ###deleteCore
   [junit4]   2> NOTE: test params are: codec=Lucene40: {}, sim=RandomSimilarityProvider(queryNorm=false,coord=false):
{}, locale=sr_ME_#Latn, timezone=America/Port_of_Spain
   [junit4]   2> NOTE: Windows 7 6.1 amd64/Oracle Corporation 1.7.0_04 (64-bit)/cpus=2,threads=1,free=196426272,total=288030720
   [junit4]   2> NOTE: All tests run in this JVM: [TestJmxMonitoredMap, TestSynonymMap,
RequestHandlersTest, SolrCoreTest, BasicZkTest, TestGermanStemFilterFactory, TestSwedishLightStemFilterFactory,
JSONWriterTest, OutputWriterTest, TestHindiFilters, CommonGramsQueryFilterFactoryTest, TestRussianLightStemFilterFactory,
TestThaiWordFilterFactory, TestCodecSupport, TestSynonymFilterFactory, DefaultValueUpdateProcessorTest,
TestPortugueseLightStemFilterFactory, CoreAdminHandlerTest, TestTrimFilterFactory, QueryElevationComponentTest,
TestIndonesianStemFilterFactory, TestTurkishLowerCaseFilterFactory, TestSort, SuggesterTest,
TestItalianLightStemFilterFactory, SignatureUpdateProcessorFactoryTest, ResourceLoaderTest,
TestJapaneseBaseFormFilterFactory, TestHashPartitioner, TestIndexingPerformance, TestDFRSimilarityFactory,
TestHTMLStripCharFilterFactory, TestSlowSynonymFilter, TestWikipediaTokenizerFactory, SolrCoreCheckLockOnStartupTest,
TestChineseFilterFactory, DistributedSpellCheckComponentTest, TestExtendedDismaxParser, TestFoldingMultitermQuery,
TestSpanishLightStemFilterFactory, BasicFunctionalityTest, TestCJKWidthFilterFactory, TestPhoneticFilterFactory,
BadComponentTest, TestRealTimeGet, TestRussianFilters, TestFrenchLightStemFilterFactory, SolrPluginUtilsTest,
FullSolrCloudDistribCmdsTest, DateMathParserTest, TestSearchPerf, AutoCommitTest, PrimUtilsTest,
TestPortugueseMinimalStemFilterFactory, TestPorterStemFilterFactory, TestTypeTokenFilterFactory,
TestNGramFilters, LeaderElectionIntegrationTest, TestShingleFilterFactory, NoCacheHeaderTest,
CloudStateTest, TestReversedWildcardFilterFactory, TestPatternReplaceCharFilterFactory, DocumentAnalysisRequestHandlerTest,
TestBrazilianStemFilterFactory, DocumentBuilderTest, LoggingHandlerTest, TestRandomFaceting,
TestSuggestSpellingConverter, SpellingQueryConverterTest, RecoveryZkTest, OpenExchangeRatesOrgProviderTest,
TestQueryUtils, CloudStateUpdateTest, TestMultiCoreConfBootstrap, TestLRUCache, NodeStateWatcherTest,
TestGermanMinimalStemFilterFactory, LukeRequestHandlerTest, TestMergePolicyConfig, FieldAnalysisRequestHandlerTest,
TestGermanLightStemFilterFactory, XmlUpdateRequestHandlerTest, TestJmxIntegration, TimeZoneUtilsTest,
TestCollationField, TestGalicianMinimalStemFilterFactory, LegacyHTMLStripCharFilterTest, PolyFieldTest,
TestDictionaryCompoundWordTokenFilterFactory, PluginInfoTest, TestLatvianStemFilterFactory,
TestPropInject, HighlighterConfigTest, TestStopFilterFactory, SOLR749Test, SolrInfoMBeanTest,
TestBM25SimilarityFactory, RequiredFieldsTest, StatsComponentTest, SpellCheckComponentTest,
BasicDistributedZkTest, SolrCmdDistributorTest, SystemInfoHandlerTest, MBeansHandlerTest,
SampleTest, TestPluginEnable, TestConfig, DirectUpdateHandlerTest, FileBasedSpellCheckerTest,
TestCzechStemFilterFactory, TestIrishLowerCaseFilterFactory, TestPHPSerializedResponseWriter,
TestDelimitedPayloadTokenFilterFactory, TestKStemFilterFactory, TestSurroundQueryParser, JsonLoaderTest,
TestDistributedSearch, SolrIndexConfigTest, TestSolrDeletionPolicy1, SpatialFilterTest, TestNorwegianMinimalStemFilterFactory,
OverseerTest, RAMDirectoryFactoryTest, TestDistributedGrouping, ShowFileRequestHandlerTest,
TestSolrXMLSerializer, TestQuerySenderNoQuery, TestReverseStringFilterFactory, TestPropInjectDefaults,
TestStemmerOverrideFilterFactory, TestJapaneseKatakanaStemFilterFactory, TestLFUCache, TestMultiWordSynonyms,
URLClassifyProcessorTest, QueryParsingTest, TestUtils, TestArabicFilters, DebugComponentTest,
TestSolrCoreProperties, DisMaxRequestHandlerTest, TermsComponentTest, TestNumberUtils, FieldMutatingUpdateProcessorTest,
TestOmitPositions, MultiTermTest, DateFieldTest, TestSolrQueryParser, TestBadConfig, ReturnFieldsTest,
TestKeywordMarkerFilterFactory, UniqFieldsUpdateProcessorFactoryTest, TestDocSet, TestLMJelinekMercerSimilarityFactory,
TestPatternReplaceFilterFactory, TestGreekStemFilterFactory, HighlighterTest, TestCJKBigramFilterFactory,
TestJapanesePartOfSpeechStopFilterFactory, DistanceFunctionTest, DistributedQueryElevationComponentTest,
TestXIncludeConfig, TestDefaultSimilarityFactory, IndexSchemaRuntimeFieldTest, TestGermanNormalizationFilterFactory,
UUIDFieldTest, PrimitiveFieldTypeTest, SortByFunctionTest, EchoParamsTest, CSVRequestHandlerTest,
CurrencyFieldTest, XsltUpdateRequestHandlerTest, BadIndexSchemaTest, DirectSolrSpellCheckerTest,
SoftAutoCommitTest, SearchHandlerTest, TestFiltering, ZkNodePropsTest, TestPerFieldSimilarity,
IndexReaderFactoryTest, TestEnglishMinimalStemFilterFactory, BinaryUpdateRequestHandlerTest,
AlternateDirectoryTest, MinimalSchemaTest, DOMUtilTest, TestJapaneseReadingFormFilterFactory,
StandardRequestHandlerTest, TestIBSimilarityFactory, TestPhraseSuggestions, TestGalicianStemFilterFactory,
TestQuerySenderListener, CopyFieldTest, NumericFieldsTest, TestGroupingSearch, TestPatternTokenizerFactory,
CommonGramsFilterFactoryTest, UpdateParamsTest, LeaderElectionTest, TestRemoteStreaming, TestChineseTokenizerFactory,
TestBinaryResponseWriter, TestRangeQuery, TestBinaryField, TestReplicationHandler]
   [junit4]   2> 
   [junit4] Completed in 65.47s, 1 test, 1 failure <<< FAILURES!
[...truncated 245 lines...]

[...truncated 17816 lines...]

[...truncated 17816 lines...]

[...truncated 17816 lines...]

[...truncated 17816 lines...]

[...truncated 17816 lines...]



Mime
View raw message