lucene-dev mailing list archives

Site index · List index
Message view « Date » · « Thread »
Top « Date » · « Thread »
From jenk...@sd-datasolutions.de
Subject [JENKINS] Lucene-Solr-trunk-Linux-Java6-64 - Build # 762 - Failure!
Date Wed, 06 Jun 2012 03:38:17 GMT
Build: http://jenkins.sd-datasolutions.de/job/Lucene-Solr-trunk-Linux-Java6-64/762/

1 tests failed.
REGRESSION:  org.apache.solr.client.solrj.embedded.MultiCoreExampleJettyTest.testDistributed

Error Message:
Server at http://localhost:41493/example/core0 returned non ok status:500, message:Server
Error

Stack Trace:
org.apache.solr.common.SolrException: Server at http://localhost:41493/example/core0 returned
non ok status:500, message:Server Error
	at __randomizedtesting.SeedInfo.seed([A9F024AB7D0E0400:C6C293430CB65A6F]:0)
	at org.apache.solr.client.solrj.impl.HttpSolrServer.request(HttpSolrServer.java:375)
	at org.apache.solr.client.solrj.impl.HttpSolrServer.request(HttpSolrServer.java:182)
	at org.apache.solr.client.solrj.request.AbstractUpdateRequest.process(AbstractUpdateRequest.java:117)
	at org.apache.solr.client.solrj.embedded.MultiCoreExampleJettyTest.testDistributed(MultiCoreExampleJettyTest.java:117)
	at sun.reflect.NativeMethodAccessorImpl.invoke0(Native Method)
	at sun.reflect.NativeMethodAccessorImpl.invoke(NativeMethodAccessorImpl.java:39)
	at sun.reflect.DelegatingMethodAccessorImpl.invoke(DelegatingMethodAccessorImpl.java:25)
	at java.lang.reflect.Method.invoke(Method.java:597)
	at com.carrotsearch.randomizedtesting.RandomizedRunner.invoke(RandomizedRunner.java:1969)
	at com.carrotsearch.randomizedtesting.RandomizedRunner.access$1100(RandomizedRunner.java:132)
	at com.carrotsearch.randomizedtesting.RandomizedRunner$6.evaluate(RandomizedRunner.java:814)
	at com.carrotsearch.randomizedtesting.RandomizedRunner$7.evaluate(RandomizedRunner.java:875)
	at com.carrotsearch.randomizedtesting.RandomizedRunner$8.evaluate(RandomizedRunner.java:889)
	at com.carrotsearch.randomizedtesting.rules.SystemPropertiesRestoreRule$1.evaluate(SystemPropertiesRestoreRule.java:53)
	at org.apache.lucene.util.TestRuleSetupTeardownChained$1.evaluate(TestRuleSetupTeardownChained.java:50)
	at org.apache.lucene.util.TestRuleFieldCacheSanity$1.evaluate(TestRuleFieldCacheSanity.java:32)
	at org.apache.lucene.util.AbstractBeforeAfterRule$1.evaluate(AbstractBeforeAfterRule.java:45)
	at com.carrotsearch.randomizedtesting.rules.SystemPropertiesInvariantRule$1.evaluate(SystemPropertiesInvariantRule.java:55)
	at org.apache.lucene.util.TestRuleReportUncaughtExceptions$1.evaluate(TestRuleReportUncaughtExceptions.java:68)
	at org.apache.lucene.util.TestRuleThreadAndTestName$1.evaluate(TestRuleThreadAndTestName.java:48)
	at org.apache.lucene.util.TestRuleMarkFailure$1.evaluate(TestRuleMarkFailure.java:48)
	at com.carrotsearch.randomizedtesting.RandomizedRunner.runSingleTest(RandomizedRunner.java:821)
	at com.carrotsearch.randomizedtesting.RandomizedRunner.access$700(RandomizedRunner.java:132)
	at com.carrotsearch.randomizedtesting.RandomizedRunner$3$1.run(RandomizedRunner.java:669)
	at com.carrotsearch.randomizedtesting.RandomizedRunner$3.evaluate(RandomizedRunner.java:695)
	at com.carrotsearch.randomizedtesting.RandomizedRunner$4.evaluate(RandomizedRunner.java:734)
	at com.carrotsearch.randomizedtesting.RandomizedRunner$5.evaluate(RandomizedRunner.java:745)
	at com.carrotsearch.randomizedtesting.rules.SystemPropertiesRestoreRule$1.evaluate(SystemPropertiesRestoreRule.java:53)
	at org.apache.lucene.util.AbstractBeforeAfterRule$1.evaluate(AbstractBeforeAfterRule.java:45)
	at org.apache.lucene.util.TestRuleReportUncaughtExceptions$1.evaluate(TestRuleReportUncaughtExceptions.java:68)
	at org.apache.lucene.util.TestRuleStoreClassName$1.evaluate(TestRuleStoreClassName.java:38)
	at org.apache.lucene.util.TestRuleIcuHack$1.evaluate(TestRuleIcuHack.java:51)
	at com.carrotsearch.randomizedtesting.rules.SystemPropertiesInvariantRule$1.evaluate(SystemPropertiesInvariantRule.java:55)
	at org.apache.lucene.util.TestRuleNoInstanceHooksOverrides$1.evaluate(TestRuleNoInstanceHooksOverrides.java:53)
	at org.apache.lucene.util.TestRuleNoStaticHooksShadowing$1.evaluate(TestRuleNoStaticHooksShadowing.java:52)
	at org.apache.lucene.util.TestRuleAssertionsRequired$1.evaluate(TestRuleAssertionsRequired.java:36)
	at org.apache.lucene.util.TestRuleMarkFailure$1.evaluate(TestRuleMarkFailure.java:48)
	at org.apache.lucene.util.TestRuleIgnoreTestSuites$1.evaluate(TestRuleIgnoreTestSuites.java:56)
	at com.carrotsearch.randomizedtesting.RandomizedRunner.runSuite(RandomizedRunner.java:605)
	at com.carrotsearch.randomizedtesting.RandomizedRunner.access$400(RandomizedRunner.java:132)
	at com.carrotsearch.randomizedtesting.RandomizedRunner$2.run(RandomizedRunner.java:551)




Build Log:
[...truncated 10861 lines...]
   [junit4]   2> 2046 T259 oasc.SolrDeletionPolicy.updateCommits newest commit = 1
   [junit4]   2> 2047 T259 oasc.RequestHandlers.initHandlersFromConfig created /get: solr.RealTimeGetHandler
   [junit4]   2> 2048 T259 oasc.RequestHandlers.initHandlersFromConfig adding lazy requestHandler:
solr.ReplicationHandler
   [junit4]   2> 2048 T259 oasc.RequestHandlers.initHandlersFromConfig created /replication:
solr.ReplicationHandler
   [junit4]   2> 2048 T259 oasc.RequestHandlers.initHandlersFromConfig created standard:
solr.StandardRequestHandler
   [junit4]   2> 2049 T259 oasc.RequestHandlers.initHandlersFromConfig adding lazy requestHandler:
solr.FieldAnalysisRequestHandler
   [junit4]   2> 2049 T259 oasc.RequestHandlers.initHandlersFromConfig created /analysis/field:
solr.FieldAnalysisRequestHandler
   [junit4]   2> 2049 T259 oasc.RequestHandlers.initHandlersFromConfig created /update:
solr.UpdateRequestHandler
   [junit4]   2> 2050 T259 oasc.RequestHandlers.initHandlersFromConfig created /admin/:
org.apache.solr.handler.admin.AdminHandlers
   [junit4]   2> 2050 T259 oasc.RequestHandlers.initHandlersFromConfig created /admin/ping:
solr.PingRequestHandler
   [junit4]   2> 2051 T259 oashl.XMLLoader.init xsltCacheLifetimeSeconds=60
   [junit4]   2> 2055 T259 oass.SolrIndexSearcher.<init> Opening Searcher@7a98f6c7
main
   [junit4]   2> 2055 T259 oass.SolrIndexSearcher.<init> WARNING WARNING: Directory
impl does not support setting indexDir: org.apache.lucene.store.RAMDirectory
   [junit4]   2> 2056 T259 oasu.CommitTracker.<init> Hard AutoCommit: disabled
   [junit4]   2> 2056 T259 oasu.CommitTracker.<init> Soft AutoCommit: disabled
   [junit4]   2> 2058 T271 oasc.SolrCore.registerSearcher [core1] Registered new searcher
Searcher@7a98f6c7 main{StandardDirectoryReader(segments_1:1)}
   [junit4]   2> 2058 T259 oasc.CoreContainer.register registering core: core1
   [junit4]   2> 2058 T259 oass.SolrDispatchFilter.init user.dir=/mnt/ssd/jenkins/workspace/Lucene-Solr-trunk-Linux-Java6-64/checkout/solr/build/solr-solrj/test/J1
   [junit4]   2> 2058 T259 oass.SolrDispatchFilter.init SolrDispatchFilter.init() done
   [junit4]   2> 2059 T259 oascsi.HttpClientUtil.createClient Creating new http client,
config:maxConnections=128&maxConnectionsPerHost=32&followRedirects=false
   [junit4]   2> ASYNC  NEW_CORE C19 name=core0 org.apache.solr.core.SolrCore@7ca9bd
   [junit4]   2> 2069 T263 C19 oasu.DirectUpdateHandler2.deleteAll [core0] REMOVING ALL
DOCUMENTS FROM INDEX
   [junit4]   2> 2073 T263 C19 oasc.SolrDeletionPolicy.onInit SolrDeletionPolicy.onInit:
commits:num=1
   [junit4]   2> 		commit{dir=org.apache.lucene.store.RAMDirectory@20713a72 lockFactory=org.apache.lucene.store.NativeFSLockFactory@31664cde,segFN=segments_1,generation=1,filenames=[segments_1]
   [junit4]   2> 2074 T263 C19 oasc.SolrDeletionPolicy.updateCommits newest commit = 1
   [junit4]   2> 2075 T263 C19 oasu.TransactionLog.<init> SEVERE New transaction
log already exists:/mnt/ssd/jenkins/workspace/Lucene-Solr-trunk-Linux-Java6-64/checkout/solr/example/multicore/core0/data/tlog/tlog.0000000000000000001
size=131
   [junit4]   2> 2075 T263 C19 UPDATE [core0] webapp=/example path=/update params={waitSearcher=true&commit=true&wt=javabin&version=2&softCommit=false}
{} 0 6
   [junit4]   2> 2077 T263 C19 oasc.SolrException.log SEVERE null:java.lang.RuntimeException:
java.lang.AssertionError
   [junit4]   2> 		at org.apache.solr.servlet.SolrDispatchFilter.sendError(SolrDispatchFilter.java:456)
   [junit4]   2> 		at org.apache.solr.servlet.SolrDispatchFilter.doFilter(SolrDispatchFilter.java:284)
   [junit4]   2> 		at org.eclipse.jetty.servlet.ServletHandler$CachedChain.doFilter(ServletHandler.java:1337)
   [junit4]   2> 		at org.eclipse.jetty.servlet.ServletHandler.doHandle(ServletHandler.java:484)
   [junit4]   2> 		at org.eclipse.jetty.server.session.SessionHandler.doHandle(SessionHandler.java:231)
   [junit4]   2> 		at org.eclipse.jetty.server.handler.ScopedHandler.handle(ScopedHandler.java:119)
   [junit4]   2> 		at org.eclipse.jetty.server.handler.GzipHandler.handle(GzipHandler.java:267)
   [junit4]   2> 		at org.eclipse.jetty.server.handler.ContextHandler.doHandle(ContextHandler.java:1067)
   [junit4]   2> 		at org.eclipse.jetty.servlet.ServletHandler.doScope(ServletHandler.java:413)
   [junit4]   2> 		at org.eclipse.jetty.server.session.SessionHandler.doScope(SessionHandler.java:192)
   [junit4]   2> 		at org.eclipse.jetty.server.handler.ContextHandler.doScope(ContextHandler.java:999)
   [junit4]   2> 		at org.eclipse.jetty.server.handler.ScopedHandler.handle(ScopedHandler.java:117)
   [junit4]   2> 		at org.eclipse.jetty.server.handler.HandlerWrapper.handle(HandlerWrapper.java:111)
   [junit4]   2> 		at org.eclipse.jetty.server.Server.handle(Server.java:351)
   [junit4]   2> 		at org.eclipse.jetty.server.AbstractHttpConnection.handleRequest(AbstractHttpConnection.java:454)
   [junit4]   2> 		at org.eclipse.jetty.server.BlockingHttpConnection.handleRequest(BlockingHttpConnection.java:47)
   [junit4]   2> 		at org.eclipse.jetty.server.AbstractHttpConnection.content(AbstractHttpConnection.java:900)
   [junit4]   2> 		at org.eclipse.jetty.server.AbstractHttpConnection$RequestHandler.content(AbstractHttpConnection.java:954)
   [junit4]   2> 		at org.eclipse.jetty.http.HttpParser.parseNext(HttpParser.java:952)
   [junit4]   2> 		at org.eclipse.jetty.http.HttpParser.parseAvailable(HttpParser.java:235)
   [junit4]   2> 		at org.eclipse.jetty.server.BlockingHttpConnection.handle(BlockingHttpConnection.java:66)
   [junit4]   2> 		at org.eclipse.jetty.server.bio.SocketConnector$ConnectorEndPoint.run(SocketConnector.java:254)
   [junit4]   2> 		at org.eclipse.jetty.util.thread.QueuedThreadPool.runJob(QueuedThreadPool.java:599)
   [junit4]   2> 		at org.eclipse.jetty.util.thread.QueuedThreadPool$3.run(QueuedThreadPool.java:534)
   [junit4]   2> 		at java.lang.Thread.run(Thread.java:662)
   [junit4]   2> 	Caused by: java.lang.AssertionError
   [junit4]   2> 		at org.apache.solr.update.TransactionLog.<init>(TransactionLog.java:163)
   [junit4]   2> 		at org.apache.solr.update.TransactionLog.<init>(TransactionLog.java:133)
   [junit4]   2> 		at org.apache.solr.update.UpdateLog.ensureLog(UpdateLog.java:636)
   [junit4]   2> 		at org.apache.solr.update.UpdateLog.deleteByQuery(UpdateLog.java:345)
   [junit4]   2> 		at org.apache.solr.update.DirectUpdateHandler2.deleteByQuery(DirectUpdateHandler2.java:297)
   [junit4]   2> 		at org.apache.solr.update.processor.RunUpdateProcessor.processDelete(RunUpdateProcessorFactory.java:67)
   [junit4]   2> 		at org.apache.solr.update.processor.UpdateRequestProcessor.processDelete(UpdateRequestProcessor.java:55)
   [junit4]   2> 		at org.apache.solr.update.processor.DistributedUpdateProcessor.doLocalDelete(DistributedUpdateProcessor.java:391)
   [junit4]   2> 		at org.apache.solr.update.processor.DistributedUpdateProcessor.doDeleteByQuery(DistributedUpdateProcessor.java:750)
   [junit4]   2> 		at org.apache.solr.update.processor.DistributedUpdateProcessor.processDelete(DistributedUpdateProcessor.java:592)
   [junit4]   2> 		at org.apache.solr.update.processor.LogUpdateProcessor.processDelete(LogUpdateProcessorFactory.java:118)
   [junit4]   2> 		at org.apache.solr.handler.loader.XMLLoader.processDelete(XMLLoader.java:333)
   [junit4]   2> 		at org.apache.solr.handler.loader.XMLLoader.processUpdate(XMLLoader.java:264)
   [junit4]   2> 		at org.apache.solr.handler.loader.XMLLoader.load(XMLLoader.java:158)
   [junit4]   2> 		at org.apache.solr.handler.UpdateRequestHandler$1.load(UpdateRequestHandler.java:92)
   [junit4]   2> 		at org.apache.solr.handler.ContentStreamHandlerBase.handleRequestBody(ContentStreamHandlerBase.java:74)
   [junit4]   2> 		at org.apache.solr.handler.RequestHandlerBase.handleRequest(RequestHandlerBase.java:129)
   [junit4]   2> 		at org.apache.solr.core.SolrCore.execute(SolrCore.java:1555)
   [junit4]   2> 		at org.apache.solr.servlet.SolrDispatchFilter.execute(SolrDispatchFilter.java:442)
   [junit4]   2> 		at org.apache.solr.servlet.SolrDispatchFilter.doFilter(SolrDispatchFilter.java:263)
   [junit4]   2> 		... 23 more
   [junit4]   2> 	
   [junit4]   2> 2078 T259 oasu.AbstractSolrTestCase.tearDown ####TEARDOWN_START testDistributed
   [junit4]   2> 2078 T259 oasc.CoreContainer.shutdown Shutting down CoreContainer instance=1664628148
   [junit4]   2> 2079 T259 oasc.SolrCore.close [collection1]  CLOSING SolrCore org.apache.solr.core.SolrCore@7b238fa5
   [junit4]   2> 2079 T259 oasc.SolrCore.closeSearcher [collection1] Closing main searcher
on request.
   [junit4]   2> 2079 T259 oasu.DirectUpdateHandler2.close closing DirectUpdateHandler2{commits=0,autocommits=0,soft
autocommits=0,optimizes=0,rollbacks=0,expungeDeletes=0,docsPending=0,adds=0,deletesById=0,deletesByQuery=0,errors=0,cumulative_adds=0,cumulative_deletesById=0,cumulative_deletesByQuery=0,cumulative_errors=0}
   [junit4]   2> 2081 T259 oasc.CoreContainer.shutdown Shutting down CoreContainer instance=379160079
   [junit4]   2> 2081 T259 oasc.SolrCore.close [core0]  CLOSING SolrCore org.apache.solr.core.SolrCore@7ca9bd
   [junit4]   2> 2082 T259 oasc.SolrCore.closeSearcher [core0] Closing main searcher on
request.
   [junit4]   2> 2082 T259 oasu.DirectUpdateHandler2.close closing DirectUpdateHandler2{commits=0,autocommits=0,soft
autocommits=0,optimizes=0,rollbacks=0,expungeDeletes=0,docsPending=0,adds=0,deletesById=0,deletesByQuery=1,errors=1,cumulative_adds=0,cumulative_deletesById=0,cumulative_deletesByQuery=1,cumulative_errors=1}
   [junit4]   2> 2089 T259 C19 oasc.SolrDeletionPolicy.onCommit SolrDeletionPolicy.onCommit:
commits:num=2
   [junit4]   2> 		commit{dir=org.apache.lucene.store.RAMDirectory@20713a72 lockFactory=org.apache.lucene.store.NativeFSLockFactory@31664cde,segFN=segments_1,generation=1,filenames=[segments_1]
   [junit4]   2> 		commit{dir=org.apache.lucene.store.RAMDirectory@20713a72 lockFactory=org.apache.lucene.store.NativeFSLockFactory@31664cde,segFN=segments_2,generation=2,filenames=[segments_2]
   [junit4]   2> 2089 T259 C19 oasc.SolrDeletionPolicy.updateCommits newest commit = 2
   [junit4]   2> 2090 T259 oasc.SolrCore.close [core1]  CLOSING SolrCore org.apache.solr.core.SolrCore@71aefd7b
   [junit4]   2> 2091 T259 oasc.SolrCore.closeSearcher [core1] Closing main searcher on
request.
   [junit4]   2> 2091 T259 oasu.DirectUpdateHandler2.close closing DirectUpdateHandler2{commits=0,autocommits=0,soft
autocommits=0,optimizes=0,rollbacks=0,expungeDeletes=0,docsPending=0,adds=0,deletesById=0,deletesByQuery=0,errors=0,cumulative_adds=0,cumulative_deletesById=0,cumulative_deletesByQuery=0,cumulative_errors=0}
   [junit4]   2> 2091 T259 oejsh.ContextHandler.doStop stopped o.e.j.s.ServletContextHandler{/example,null}
   [junit4]   2> NOTE: reproduce with: ant test  -Dtestcase=MultiCoreExampleJettyTest -Dtests.method=testDistributed
-Dtests.seed=A9F024AB7D0E0400 -Dtests.multiplier=3 -Dtests.locale=no_NO_NY -Dtests.timezone=Europe/Helsinki
-Dargs="-Dfile.encoding=UTF-8"
   [junit4]   2>
   [junit4]    > (@AfterClass output)
   [junit4]   2> NOTE: test params are: codec=SimpleText, sim=RandomSimilarityProvider(queryNorm=false,coord=false):
{}, locale=no_NO_NY, timezone=Europe/Helsinki
   [junit4]   2> NOTE: Linux 2.6.32-41-server amd64/Sun Microsystems Inc. 1.6.0_32 (64-bit)/cpus=8,threads=1,free=94429656,total=137756672
   [junit4]   2> NOTE: All tests run in this JVM: [JettyWebappTest, DocumentAnalysisResponseTest,
TestUpdateRequestCodec, SolrExceptionTest, SolrExampleStreamingBinaryTest, SolrParamTest,
TestHash, LargeVolumeBinaryJettyTest, ModifiableSolrParamsTest, LargeVolumeJettyTest, TestNamedListCodec,
LargeVolumeEmbeddedTest, QueryResponseTest, TestEmbeddedSolrServer, FacetFieldTest, AnlysisResponseBaseTest,
SolrQueryTest, TestLBHttpSolrServer, SolrExampleJettyTest, TestBatchUpdate, MultiCoreExampleJettyTest]
   [junit4]   2> 
   [junit4] Completed on J1 in 1.26s, 2 tests, 1 error <<< FAILURES!
[...truncated 40 lines...]

[...truncated 11002 lines...]

[...truncated 11002 lines...]

[...truncated 11002 lines...]

[...truncated 11002 lines...]

[...truncated 11002 lines...]



Mime
View raw message