lucene-dev mailing list archives

Site index · List index
Message view « Date » · « Thread »
Top « Date » · « Thread »
From jenk...@sd-datasolutions.de
Subject [JENKINS] Lucene-Solr-trunk-Windows-Java7-64 - Build # 252 - Still Failing!
Date Wed, 06 Jun 2012 12:30:48 GMT
Build: http://jenkins.sd-datasolutions.de/job/Lucene-Solr-trunk-Windows-Java7-64/252/

1 tests failed.
REGRESSION:  org.apache.lucene.index.TestDocumentsWriterStallControl.testAccquireReleaseRace

Error Message:
control claims no stalled threads but waiter seems to be blocked

Stack Trace:
java.lang.AssertionError: control claims no stalled threads but waiter seems to be blocked
	at __randomizedtesting.SeedInfo.seed([A49457CD5688CBD8:9EE847FF6E680269]:0)
	at org.junit.Assert.fail(Assert.java:93)
	at org.junit.Assert.assertTrue(Assert.java:43)
	at org.apache.lucene.index.TestDocumentsWriterStallControl.testAccquireReleaseRace(TestDocumentsWriterStallControl.java:163)
	at sun.reflect.NativeMethodAccessorImpl.invoke0(Native Method)
	at sun.reflect.NativeMethodAccessorImpl.invoke(NativeMethodAccessorImpl.java:57)
	at sun.reflect.DelegatingMethodAccessorImpl.invoke(DelegatingMethodAccessorImpl.java:43)
	at java.lang.reflect.Method.invoke(Method.java:601)
	at com.carrotsearch.randomizedtesting.RandomizedRunner.invoke(RandomizedRunner.java:1969)
	at com.carrotsearch.randomizedtesting.RandomizedRunner.access$1100(RandomizedRunner.java:132)
	at com.carrotsearch.randomizedtesting.RandomizedRunner$6.evaluate(RandomizedRunner.java:814)
	at com.carrotsearch.randomizedtesting.RandomizedRunner$7.evaluate(RandomizedRunner.java:875)
	at com.carrotsearch.randomizedtesting.RandomizedRunner$8.evaluate(RandomizedRunner.java:889)
	at org.apache.lucene.util.TestRuleSetupTeardownChained$1.evaluate(TestRuleSetupTeardownChained.java:50)
	at org.apache.lucene.util.TestRuleFieldCacheSanity$1.evaluate(TestRuleFieldCacheSanity.java:32)
	at org.apache.lucene.util.AbstractBeforeAfterRule$1.evaluate(AbstractBeforeAfterRule.java:45)
	at com.carrotsearch.randomizedtesting.rules.SystemPropertiesInvariantRule$1.evaluate(SystemPropertiesInvariantRule.java:55)
	at org.apache.lucene.util.TestRuleReportUncaughtExceptions$1.evaluate(TestRuleReportUncaughtExceptions.java:68)
	at org.apache.lucene.util.TestRuleThreadAndTestName$1.evaluate(TestRuleThreadAndTestName.java:48)
	at org.apache.lucene.util.TestRuleMarkFailure$1.evaluate(TestRuleMarkFailure.java:48)
	at com.carrotsearch.randomizedtesting.RandomizedRunner.runSingleTest(RandomizedRunner.java:821)
	at com.carrotsearch.randomizedtesting.RandomizedRunner.access$700(RandomizedRunner.java:132)
	at com.carrotsearch.randomizedtesting.RandomizedRunner$3$1.run(RandomizedRunner.java:669)
	at com.carrotsearch.randomizedtesting.RandomizedRunner$3.evaluate(RandomizedRunner.java:695)
	at com.carrotsearch.randomizedtesting.RandomizedRunner$4.evaluate(RandomizedRunner.java:734)
	at com.carrotsearch.randomizedtesting.RandomizedRunner$5.evaluate(RandomizedRunner.java:745)
	at org.apache.lucene.util.AbstractBeforeAfterRule$1.evaluate(AbstractBeforeAfterRule.java:45)
	at org.apache.lucene.util.TestRuleReportUncaughtExceptions$1.evaluate(TestRuleReportUncaughtExceptions.java:68)
	at org.apache.lucene.util.TestRuleStoreClassName$1.evaluate(TestRuleStoreClassName.java:38)
	at org.apache.lucene.util.TestRuleIcuHack$1.evaluate(TestRuleIcuHack.java:51)
	at com.carrotsearch.randomizedtesting.rules.SystemPropertiesInvariantRule$1.evaluate(SystemPropertiesInvariantRule.java:55)
	at org.apache.lucene.util.TestRuleNoInstanceHooksOverrides$1.evaluate(TestRuleNoInstanceHooksOverrides.java:53)
	at org.apache.lucene.util.TestRuleNoStaticHooksShadowing$1.evaluate(TestRuleNoStaticHooksShadowing.java:52)
	at org.apache.lucene.util.TestRuleAssertionsRequired$1.evaluate(TestRuleAssertionsRequired.java:36)
	at org.apache.lucene.util.TestRuleMarkFailure$1.evaluate(TestRuleMarkFailure.java:48)
	at org.apache.lucene.util.TestRuleIgnoreTestSuites$1.evaluate(TestRuleIgnoreTestSuites.java:56)
	at com.carrotsearch.randomizedtesting.RandomizedRunner.runSuite(RandomizedRunner.java:605)
	at com.carrotsearch.randomizedtesting.RandomizedRunner.access$400(RandomizedRunner.java:132)
	at com.carrotsearch.randomizedtesting.RandomizedRunner$2.run(RandomizedRunner.java:551)




Build Log:
[...truncated 1410 lines...]
   [junit4] Suite: org.apache.lucene.search.TestSimilarity
   [junit4] Completed in 0.04s, 1 test
   [junit4]  
   [junit4] Suite: org.apache.lucene.util.TestAttributeSource
   [junit4] Completed in 0.03s, 5 tests
   [junit4]  
   [junit4] Suite: org.apache.lucene.util.TestTwoPhaseCommitTool
   [junit4] Completed in 0.03s, 4 tests
   [junit4]  
   [junit4] Suite: org.apache.lucene.search.TestTopScoreDocCollector
   [junit4] Completed in 0.02s, 1 test
   [junit4]  
   [junit4] Suite: org.apache.lucene.index.TestFieldInfos
   [junit4] Completed in 0.02s, 2 tests
   [junit4]  
   [junit4] Suite: org.apache.lucene.search.TestPositiveScoresOnlyCollector
   [junit4] Completed in 0.01s, 1 test
   [junit4]  
   [junit4] Suite: org.apache.lucene.util.TestIOUtils
   [junit4] Completed in 0.01s, 1 test
   [junit4]  
   [junit4] Suite: org.apache.lucene.index.TestIndexCommit
   [junit4] Completed in 0.01s, 1 test
   [junit4]  
   [junit4] Suite: org.apache.lucene.util.TestByteBlockPool
   [junit4] Completed in 0.01s, 1 test
   [junit4]  
   [junit4] Suite: org.apache.lucene.util.TestVersionComparator
   [junit4] Completed in 0.01s, 1 test
   [junit4]  
   [junit4] Suite: org.apache.lucene.index.Test2BPostings
   [junit4] IGNOR/A 0.00s | Test2BPostings.test
   [junit4]    > Assumption #1: 'nightly' test group is disabled (@Nightly)
   [junit4] Completed in 0.01s, 1 test, 1 skipped
   [junit4]  
   [junit4] Suite: org.apache.lucene.index.TestDocumentsWriterStallControl
   [junit4] FAILURE 12.5s | TestDocumentsWriterStallControl.testAccquireReleaseRace
   [junit4]    > Throwable #1: java.lang.AssertionError: control claims no stalled threads
but waiter seems to be blocked
   [junit4]    > 	at __randomizedtesting.SeedInfo.seed([A49457CD5688CBD8:9EE847FF6E680269]:0)
   [junit4]    > 	at org.junit.Assert.fail(Assert.java:93)
   [junit4]    > 	at org.junit.Assert.assertTrue(Assert.java:43)
   [junit4]    > 	at org.apache.lucene.index.TestDocumentsWriterStallControl.testAccquireReleaseRace(TestDocumentsWriterStallControl.java:163)
   [junit4]    > 	at sun.reflect.NativeMethodAccessorImpl.invoke0(Native Method)
   [junit4]    > 	at sun.reflect.NativeMethodAccessorImpl.invoke(NativeMethodAccessorImpl.java:57)
   [junit4]    > 	at sun.reflect.DelegatingMethodAccessorImpl.invoke(DelegatingMethodAccessorImpl.java:43)
   [junit4]    > 	at java.lang.reflect.Method.invoke(Method.java:601)
   [junit4]    > 	at com.carrotsearch.randomizedtesting.RandomizedRunner.invoke(RandomizedRunner.java:1969)
   [junit4]    > 	at com.carrotsearch.randomizedtesting.RandomizedRunner.access$1100(RandomizedRunner.java:132)
   [junit4]    > 	at com.carrotsearch.randomizedtesting.RandomizedRunner$6.evaluate(RandomizedRunner.java:814)
   [junit4]    > 	at com.carrotsearch.randomizedtesting.RandomizedRunner$7.evaluate(RandomizedRunner.java:875)
   [junit4]    > 	at com.carrotsearch.randomizedtesting.RandomizedRunner$8.evaluate(RandomizedRunner.java:889)
   [junit4]    > 	at org.apache.lucene.util.TestRuleSetupTeardownChained$1.evaluate(TestRuleSetupTeardownChained.java:50)
   [junit4]    > 	at org.apache.lucene.util.TestRuleFieldCacheSanity$1.evaluate(TestRuleFieldCacheSanity.java:32)
   [junit4]    > 	at org.apache.lucene.util.AbstractBeforeAfterRule$1.evaluate(AbstractBeforeAfterRule.java:45)
   [junit4]    > 	at com.carrotsearch.randomizedtesting.rules.SystemPropertiesInvariantRule$1.evaluate(SystemPropertiesInvariantRule.java:55)
   [junit4]    > 	at org.apache.lucene.util.TestRuleReportUncaughtExceptions$1.evaluate(TestRuleReportUncaughtExceptions.java:68)
   [junit4]    > 	at org.apache.lucene.util.TestRuleThreadAndTestName$1.evaluate(TestRuleThreadAndTestName.java:48)
   [junit4]    > 	at org.apache.lucene.util.TestRuleMarkFailure$1.evaluate(TestRuleMarkFailure.java:48)
   [junit4]    > 	at com.carrotsearch.randomizedtesting.RandomizedRunner.runSingleTest(RandomizedRunner.java:821)
   [junit4]    > 	at com.carrotsearch.randomizedtesting.RandomizedRunner.access$700(RandomizedRunner.java:132)
   [junit4]    > 	at com.carrotsearch.randomizedtesting.RandomizedRunner$3$1.run(RandomizedRunner.java:669)
   [junit4]    > 	at com.carrotsearch.randomizedtesting.RandomizedRunner$3.evaluate(RandomizedRunner.java:695)
   [junit4]    > 	at com.carrotsearch.randomizedtesting.RandomizedRunner$4.evaluate(RandomizedRunner.java:734)
   [junit4]    > 	at com.carrotsearch.randomizedtesting.RandomizedRunner$5.evaluate(RandomizedRunner.java:745)
   [junit4]    > 	at org.apache.lucene.util.AbstractBeforeAfterRule$1.evaluate(AbstractBeforeAfterRule.java:45)
   [junit4]    > 	at org.apache.lucene.util.TestRuleReportUncaughtExceptions$1.evaluate(TestRuleReportUncaughtExceptions.java:68)
   [junit4]    > 	at org.apache.lucene.util.TestRuleStoreClassName$1.evaluate(TestRuleStoreClassName.java:38)
   [junit4]    > 	at org.apache.lucene.util.TestRuleIcuHack$1.evaluate(TestRuleIcuHack.java:51)
   [junit4]    > 	at com.carrotsearch.randomizedtesting.rules.SystemPropertiesInvariantRule$1.evaluate(SystemPropertiesInvariantRule.java:55)
   [junit4]    > 	at org.apache.lucene.util.TestRuleNoInstanceHooksOverrides$1.evaluate(TestRuleNoInstanceHooksOverrides.java:53)
   [junit4]    > 	at org.apache.lucene.util.TestRuleNoStaticHooksShadowing$1.evaluate(TestRuleNoStaticHooksShadowing.java:52)
   [junit4]    > 	at org.apache.lucene.util.TestRuleAssertionsRequired$1.evaluate(TestRuleAssertionsRequired.java:36)
   [junit4]    > 	at org.apache.lucene.util.TestRuleMarkFailure$1.evaluate(TestRuleMarkFailure.java:48)
   [junit4]    > 	at org.apache.lucene.util.TestRuleIgnoreTestSuites$1.evaluate(TestRuleIgnoreTestSuites.java:56)
   [junit4]    > 	at com.carrotsearch.randomizedtesting.RandomizedRunner.runSuite(RandomizedRunner.java:605)
   [junit4]    > 	at com.carrotsearch.randomizedtesting.RandomizedRunner.access$400(RandomizedRunner.java:132)
   [junit4]    > 	at com.carrotsearch.randomizedtesting.RandomizedRunner$2.run(RandomizedRunner.java:551)
   [junit4]    > 
   [junit4]   2> java.lang.AssertionError
   [junit4]   2> 	at org.junit.Assert.fail(Assert.java:92)
   [junit4]   2> 	at org.junit.Assert.assertTrue(Assert.java:43)
   [junit4]   2> 	at org.junit.Assert.assertTrue(Assert.java:54)
   [junit4]   2> 	at org.apache.lucene.index.TestDocumentsWriterStallControl$Waiter.run(TestDocumentsWriterStallControl.java:225)
   [junit4]   2> java.lang.AssertionError
   [junit4]   2> 	at org.junit.Assert.fail(Assert.java:92)
   [junit4]   2> 	at org.junit.Assert.assertTrue(Assert.java:43)
   [junit4]   2> 	at org.junit.Assert.assertTrue(Assert.java:54)
   [junit4]   2> 	at org.apache.lucene.index.TestDocumentsWriterStallControl$Updater.run(TestDocumentsWriterStallControl.java:275)
   [junit4]   2> java.lang.AssertionError
   [junit4]   2> 	at org.junit.Assert.fail(Assert.java:92)
   [junit4]   2> 	at org.junit.Assert.assertTrue(Assert.java:43)
   [junit4]   2> 	at org.junit.Assert.assertTrue(Assert.java:54)
   [junit4]   2> 	at org.apache.lucene.index.TestDocumentsWriterStallControl$Updater.run(TestDocumentsWriterStallControl.java:275)
   [junit4]   2> NOTE: reproduce with: ant test  -Dtestcase=TestDocumentsWriterStallControl
-Dtests.method=testAccquireReleaseRace -Dtests.seed=A49457CD5688CBD8 -Dtests.locale=en_GB
-Dtests.timezone=Europe/Prague -Dargs="-Dfile.encoding=Cp1252"
   [junit4]   2>
   [junit4]    > (@AfterClass output)
   [junit4]   2> NOTE: test params are: codec=Lucene40: {}, sim=RandomSimilarityProvider(queryNorm=true,coord=false):
{}, locale=en_GB, timezone=Europe/Prague
   [junit4]   2> NOTE: Windows 7 6.1 amd64/Oracle Corporation 1.7.0_04 (64-bit)/cpus=2,threads=1,free=165476936,total=312344576
   [junit4]   2> NOTE: All tests run in this JVM: [TestFieldMaskingSpanQuery, TestLock,
TestUTF32ToUTF8, TestOmitTf, TestDocBoost, TestVirtualMethod, TestNeverDelete, TestComplexExplanations,
TestCachingCollector, TestFieldsReader, TestSimpleExplanationsOfNonMatches, TestCharTermAttributeImpl,
TestIndexWriterWithThreads, TestFuzzyQuery, TestTermScorer, TestSimpleExplanations, TestSort,
TestDisjunctionMaxQuery, TestCrashCausesCorruptIndex, TestNRTCachingDirectory, TestScoreCachingWrappingScorer,
TestCustomSearcherSort, TestMultiFields, TestPostingsOffsets, TestSpansAdvanced2, TestSpanExplanations,
MultiCollectorTest, TestPerSegmentDeletes, TestMultiPhraseQuery, TestBytesRef, TestSpanFirstQuery,
TestFieldCache, TestAssertions, TestIntBlockCodec, TestFieldCacheTermsFilter, TestTopDocsCollector,
TestFlex, TestNewestSegment, TestNoMergePolicy, TestBackwardsCompatibility, TestBytesRefHash,
TestSumDocFreq, TestIndexFileDeleter, TestIndexWriterNRTIsCurrent, TestDeterminizeLexicon,
TestIndexableField, TestBooleanScorer, TestSetOnce, TestDateFilter, TestLazyProxSkipping,
TestRAMDirectory, TestFilteredSearch, TestSubScorerFreqs, TestBufferedIndexInput, ThrowInUncaught,
TestCodecs, TestDocValuesScoring, TestRamUsageEstimator, TestTermdocPerf, TestPrefixQuery,
TestThreadedForceMerge, TestRollingBuffer, TestDocTermOrds, NestedSetupChain, NestedTeardownChain,
TestIndexWriterCommit, TestAutomatonQuery, TestBooleanMinShouldMatch, TestConsistentFieldNumbers,
TestMultiMMap, TestFixedBitSet, TestSpansAdvanced, TestCompoundFile, TestIntsRef, TestFieldCacheSanityChecker,
TestNumericRangeQuery64, TestSpanSearchEquivalence, TestPhrasePrefixQuery, Test10KPulsings,
TestIndexWriterUnicode, InBeforeClass, InAfterClass, NonStringProperties, InTestMethod, TestFileSwitchDirectory,
TestForceMergeForever, TestReuseDocsEnum, TestDocsAndPositions, TestHugeRamFile, TestFilteredQuery,
TestPackedInts, TestRollback, TestConcurrentMergeScheduler, TestSloppyPhraseQuery2, TestNoMergeScheduler,
TestOpenBitSet, TestPrefixCodedTerms, TestMinimize, TestDemo, TestPayloadTermQuery, TestNumericUtils,
TestStressIndexing, Nested, Nested, TestNamedSPILoader, TestPositionIncrement, TestTerm, TestPrefixInBooleanQuery,
TestDocIdSet, TestCopyBytes, TestElevationComparator, TestPerFieldPostingsFormat, TestSimilarity2,
TestParallelCompositeReader, TestBitUtil, TestParallelTermEnum, TestUniqueTermCount, TestScorerPerf,
TestTermRangeFilter, TestBinaryTerms, TestIndexWriterMerging, TestIndexWriterMergePolicy,
TestDoc, TestRollingUpdates, Nested2, Nested1, Nested3, TestDocumentsWriterDeleteQueue, TestPersistentSnapshotDeletionPolicy,
TestDocCount, TestSimilarityBase, TestFilterAtomicReader, TestSimpleAttributeImpl, TestSpanMultiTermQueryWrapper,
TestDocument, TestTermVectorsWriter, TestFieldCacheRewriteMethod, TestWindowsMMap, TestCachingWrapperFilter,
TestAutomatonQueryUnicode, TestCloseableThreadLocal, TestNumericTokenStream, TestSimilarityProvider,
TestExternalCodecs, TestPayloadSpans, TestFlushByRamOrCountsPolicy, TestNRTThreads, TestPriorityQueue,
TestNGramPhraseQuery, TestStressNRT, TestIndexWriterDelete, TestIndexWriterConfig, TestStressAdvance,
TestSortedVIntList, TestMatchAllDocsQuery, TestDeletionPolicy, TestFieldCacheRangeFilter,
TestSameTokenSamePosition, TestComplexExplanationsOfNonMatches, TestFieldValueFilter, TestTransactions,
TestBoolean2, TestMultiValuedNumericRangeQuery, TestVersion, TestNot, TestByteArrayDataInput,
TestSmallFloat, TestSnapshotDeletionPolicy, TestPayloadNearQuery, TestCollectionUtil, TestMaxTermFrequency,
TestBinaryDocument, TestOmitPositions, TestIndexInput, TestIndexWriterReader, TestRamUsageEstimatorOnWildAnimals,
TestUnicodeUtil, TestDateSort, TestMockAnalyzer, TestMixedCodecs, TestCompiledAutomaton, TestDocValuesIndexing,
TestIndexWriterOnJRECrash, TestTermVectors, TestTermRangeQuery, TestParallelReaderEmptyIndex,
Nested, TestNearSpansOrdered, TestReaderClosed, TestSizeBoundedForceMerge, TestSloppyPhraseQuery,
TestRollingCharBuffer, TestIndexWriterLockRelease, TestStressIndexing2, TestToken, TestCheckIndex,
Before3, Before3, TestQueryWrapperFilter, TestSearchForDuplicates, TestBitVector, TestDocValues,
TestSegmentReader, TestNoDeletionPolicy, TestIsCurrent, TestLookaheadTokenFilter, TestParallelAtomicReader,
Test2BTerms, TestDirectory, TestDateTools, TestAppendingCodec, TestSpans, TestSearcherManager,
TestMultiThreadTermVectors, TestAtomicUpdate, TestWeakIdentityMap, TestExplanations, TestDuelingCodecs,
TestMockCharFilter, TestPhraseQuery, TestIndexWriterExceptions, TestShardSearching, TestPayloadExplanations,
TestArrayUtil, TestLevenshteinAutomata, TestNorms, TestSearchAfter, TestDocumentWriter, Nested,
Nested, Nested, Nested, Nested, Nested, Nested, Nested, Nested, Nested, Nested, Nested, Nested,
Nested, Nested, Nested, Nested, Nested, Nested, Nested, Nested, TestRegexpRandom2, TestGraphTokenizers,
TestAddIndexes, TestFSTs, TestBasics, TestIndexWriter, TestNumericRangeQuery32, TestSegmentTermDocs,
TestTermsEnum, TestDirectoryReaderReopen, TestTopDocsMerge, TestTimeLimitingCollector, TestNRTManager,
TestByteSlices, TestTypePromotion, TestNRTReaderWithThreads, TestIndexWriterForceMerge, TestSearchWithThreads,
TestOmitNorms, TestLongPostings, TestTermsEnum2, TestTieredMergePolicy, TestDirectoryReader,
TestIndexWriterOnDiskFull, TestLockFactory, TestRandomStoredFields, TestDoubleBarrelLRUCache,
TestPrefixRandom, TestDeterminism, TestBooleanOr, TestCrash, TestCustomNorms, TestSegmentMerger,
TestMergeSchedulerExternal, TestMultiTermConstantScore, TestPagedBytes, TestPayloadProcessorProvider,
TestForTooMuchCloning, TestPayloads, TestMultiLevelSkipList, TestTransactionRollback, TestSimpleSearchEquivalence,
TestRegexpRandom, TestBasicOperations, TestBooleanQuery, TestIdentityHashSet, TestSentinelIntSet,
TestSpecialOperations, TestWildcardRandom, TestWildcard, TestRegexpQuery, TestTermVectorsReader,
TestSpanExplanationsOfNonMatches, TestSearch, TestMultiTermQueryRewrites, TestSegmentTermEnum,
TestRecyclingByteBlockAllocator, TestPulsingReuse, TestConstantScoreQuery, TestPrefixFilter,
TestCharsRef, TestCachingTokenFilter, TestSimilarity, TestAttributeSource, TestTwoPhaseCommitTool,
TestTopScoreDocCollector, TestFieldInfos, TestPositiveScoresOnlyCollector, TestIOUtils, TestIndexCommit,
TestByteBlockPool, TestVersionComparator, Test2BPostings, TestDocumentsWriterStallControl]
   [junit4]   2> 
   [junit4] Completed in 13.20s, 3 tests, 1 failure <<< FAILURES!
[...truncated 19 lines...]

[...truncated 1530 lines...]

[...truncated 1530 lines...]

[...truncated 1530 lines...]

[...truncated 1530 lines...]

[...truncated 1530 lines...]



Mime
View raw message