lucene-dev mailing list archives: May 2012

Site index · List index
Message list« Previous · 1 · 2 · 3 · 4 · 5 · 6 · 7 · 8 · 9 · 10 · 11 · 12 · 13 · 14 · 15 · 16 · 17 · 18 · 19 · 20 · 21 · 22 · 23 · 24 · Next »Thread · Author · Date
jenk...@sd-datasolutions.de Build failed in Jenkins: Windows-Lucene-Solr-tests-only-trunk #21 Wed, 16 May, 20:32
jenk...@sd-datasolutions.de   Build failed in Jenkins: Windows-Lucene-Solr-tests-only-trunk #22 Wed, 16 May, 21:51
jenk...@sd-datasolutions.de     Jenkins build is back to normal : Windows-Lucene-Solr-tests-only-trunk #23 Wed, 16 May, 22:36
[jira] [Commented] (SOLR-1726) Deep Paging and Large Results Improvements
Erik Hatcher (JIRA)   [jira] [Commented] (SOLR-1726) Deep Paging and Large Results Improvements Wed, 16 May, 20:51
Mark Miller (JIRA)   [jira] [Commented] (SOLR-1726) Deep Paging and Large Results Improvements Wed, 16 May, 23:39
[jira] [Commented] (SOLR-3454) ArrayIndexOutOfBoundsException while grouping via Solrj
Martijn van Groningen (JIRA)   [jira] [Commented] (SOLR-3454) ArrayIndexOutOfBoundsException while grouping via Solrj Wed, 16 May, 21:17
ludovic Boutros (JIRA)   [jira] [Commented] (SOLR-3454) ArrayIndexOutOfBoundsException while grouping via Solrj Thu, 17 May, 09:01
ludovic Boutros (JIRA)   [jira] [Commented] (SOLR-3454) ArrayIndexOutOfBoundsException while grouping via Solrj Thu, 17 May, 09:33
ludovic Boutros (JIRA)   [jira] [Commented] (SOLR-3454) ArrayIndexOutOfBoundsException while grouping via Solrj Thu, 17 May, 18:44
Dawid Weiss (JIRA) [jira] [Resolved] (LUCENE-4047) Cleanup of LuceneTestCase Wed, 16 May, 21:17
[jira] [Commented] (LUCENE-4054) Overrides of @Before or @After hooks should cause a test error.
Dawid Weiss (JIRA)   [jira] [Commented] (LUCENE-4054) Overrides of @Before or @After hooks should cause a test error. Wed, 16 May, 21:19
Dawid Weiss (JIRA)   [jira] [Commented] (LUCENE-4054) Overrides of @Before or @After hooks should cause a test error. Fri, 18 May, 07:55
Steven Rowe (JIRA)   [jira] [Commented] (LUCENE-4054) Overrides of @Before or @After hooks should cause a test error. Fri, 18 May, 15:31
Dawid Weiss (JIRA)   [jira] [Commented] (LUCENE-4054) Overrides of @Before or @After hooks should cause a test error. Fri, 18 May, 15:47
[jira] [Updated] (SOLR-3453) edismax lowercaseOperators=false broken by SOLR-3026
Tomás Fernández Löbbe (JIRA)   [jira] [Updated] (SOLR-3453) edismax lowercaseOperators=false broken by SOLR-3026 Wed, 16 May, 21:19
Tomás Fernández Löbbe (JIRA)   [jira] [Updated] (SOLR-3453) edismax lowercaseOperators=false broken by SOLR-3026 Wed, 16 May, 21:41
[jira] [Commented] (SOLR-2268) Add support for Point in Polygon searches
Kiran Sugana (JIRA)   [jira] [Commented] (SOLR-2268) Add support for Point in Polygon searches Wed, 16 May, 23:25
David Smiley (JIRA)   [jira] [Commented] (SOLR-2268) Add support for Point in Polygon searches Thu, 17 May, 02:06
jenk...@sd-datasolutions.de Build failed in Jenkins: Windows-Lucene-Solr-tests-only-trunk #24 Wed, 16 May, 23:59
jenk...@sd-datasolutions.de   Jenkins build is back to normal : Windows-Lucene-Solr-tests-only-trunk #25 Thu, 17 May, 00:44
Apache Jenkins Server [JENKINS] Lucene-Solr-tests-only-trunk - Build # 14109 - Failure Thu, 17 May, 00:40
Michael Garski (JIRA) [jira] [Created] (SOLR-3465) Replication Causes Two Searcher Warmups Thu, 17 May, 01:10
Michael Garski (JIRA) [jira] [Commented] (SOLR-3465) Replication Causes Two Searcher Warmups Thu, 17 May, 01:38
jenk...@sd-datasolutions.de Build failed in Jenkins: Windows-Lucene-Solr-tests-only-trunk-java7 #19 Thu, 17 May, 03:37
jenk...@sd-datasolutions.de   Build failed in Jenkins: Windows-Lucene-Solr-tests-only-trunk-java7 #20 Thu, 17 May, 05:01
jenk...@sd-datasolutions.de     Build failed in Jenkins: Windows-Lucene-Solr-tests-only-trunk-java7 #21 Thu, 17 May, 07:09
jenk...@sd-datasolutions.de       Jenkins build is back to normal : Windows-Lucene-Solr-tests-only-trunk-java7 #22 Thu, 17 May, 09:23
jenk...@sd-datasolutions.de Build failed in Jenkins: Windows-Lucene-Solr-tests-only-trunk #28 Thu, 17 May, 04:16
jenk...@sd-datasolutions.de   Build failed in Jenkins: Windows-Lucene-Solr-tests-only-trunk #29 Thu, 17 May, 05:42
jenk...@sd-datasolutions.de     Jenkins build is back to normal : Windows-Lucene-Solr-tests-only-trunk #30 Thu, 17 May, 06:30
jenk...@sd-datasolutions.de Build failed in Jenkins: Lucene-Solr-tests-only-trunk #196 Thu, 17 May, 05:53
jenk...@sd-datasolutions.de   Jenkins build is back to normal : Lucene-Solr-tests-only-trunk #197 Thu, 17 May, 06:22
Shai Erera (JIRA) [jira] [Created] (LUCENE-4064) Move ContentSource to PerfRunData out of DocMaker Thu, 17 May, 06:11
Re: Using term offsets for hit highlighting
Alan Woodward   Re: Using term offsets for hit highlighting Thu, 17 May, 08:03
Simon Willnauer     Re: Using term offsets for hit highlighting Thu, 17 May, 12:15
Alan Woodward       Re: Using term offsets for hit highlighting Tue, 22 May, 18:38
Simon Willnauer         Re: Using term offsets for hit highlighting Wed, 23 May, 10:59
Alan Woodward           Re: Using term offsets for hit highlighting Wed, 23 May, 11:23
Simon Willnauer             Re: Using term offsets for hit highlighting Wed, 23 May, 12:43
Alan Woodward               Re: Using term offsets for hit highlighting Wed, 23 May, 16:46
Simon Willnauer                 Re: Using term offsets for hit highlighting Wed, 23 May, 18:14
Shai Erera (JIRA) [jira] [Updated] (LUCENE-4064) Move ContentSource to PerfRunData out of DocMaker Thu, 17 May, 08:30
jenk...@sd-datasolutions.de Build failed in Jenkins: Windows-Lucene-Solr-tests-only-trunk #32 Thu, 17 May, 08:39
jenk...@sd-datasolutions.de   Jenkins build is back to normal : Windows-Lucene-Solr-tests-only-trunk #33 Thu, 17 May, 10:08
Stefan Matheis (steffkes) (JIRA) [jira] [Resolved] (SOLR-3444) Optimize Navigation for global Items Thu, 17 May, 08:47
Apache Jenkins Server [JENKINS] Lucene-Solr-tests-only-trunk-java7 - Build # 2569 - Failure Thu, 17 May, 10:58
Robert Muir   Re: [JENKINS] Lucene-Solr-tests-only-trunk-java7 - Build # 2569 - Failure Thu, 17 May, 13:15
Robert Muir     Re: [JENKINS] Lucene-Solr-tests-only-trunk-java7 - Build # 2569 - Failure Thu, 17 May, 13:44
Shai Erera (JIRA) [jira] [Resolved] (LUCENE-4064) Move ContentSource to PerfRunData out of DocMaker Thu, 17 May, 11:23
jenk...@sd-datasolutions.de Build failed in Jenkins: Lucene-Solr-tests-only-trunk-java7 #27 Thu, 17 May, 11:26
jenk...@sd-datasolutions.de   Jenkins build is back to normal : Lucene-Solr-tests-only-trunk-java7 #28 Thu, 17 May, 13:11
jenk...@sd-datasolutions.de Build failed in Jenkins: Windows-Lucene-Solr-tests-only-trunk-java7 #23 Thu, 17 May, 11:31
jenk...@sd-datasolutions.de   Jenkins build is back to normal : Windows-Lucene-Solr-tests-only-trunk-java7 #24 Thu, 17 May, 13:46
Apache Jenkins Server [JENKINS] Lucene-Solr-tests-only-trunk - Build # 14124 - Failure Thu, 17 May, 12:56
Robert Muir (JIRA) [jira] [Updated] (LUCENE-4065) FilteringTokenFilter should never corrupt the tokenstream graph Thu, 17 May, 13:41
Robert Muir (JIRA) [jira] [Created] (LUCENE-4065) FilteringTokenFilter should never corrupt the tokenstream graph Thu, 17 May, 13:41
Robert Muir (JIRA) [jira] [Commented] (LUCENE-4065) FilteringTokenFilter should never corrupt the tokenstream graph Thu, 17 May, 13:45
[jira] [Commented] (SOLR-3460) Improve cmd line config bootstrap tool.
Mark Miller (JIRA)   [jira] [Commented] (SOLR-3460) Improve cmd line config bootstrap tool. Thu, 17 May, 14:54
Mark Miller (JIRA)   [jira] [Commented] (SOLR-3460) Improve cmd line config bootstrap tool. Thu, 17 May, 17:08
jenk...@sd-datasolutions.de Build failed in Jenkins: Lucene-Solr-tests-only-trunk #214 Thu, 17 May, 15:46
jenk...@sd-datasolutions.de   Jenkins build is back to normal : Lucene-Solr-tests-only-trunk #215 Thu, 17 May, 16:12
Ryan McKinley (JIRA) [jira] [Resolved] (SOLR-3455) WordDelimiterFilterFactory split word on hyphen though generateWordParts="0" Thu, 17 May, 16:14
jenk...@sd-datasolutions.de Build failed in Jenkins: Windows-Lucene-Solr-tests-only-trunk #39 Thu, 17 May, 16:35
jenk...@sd-datasolutions.de   Build failed in Jenkins: Windows-Lucene-Solr-tests-only-trunk #40 Thu, 17 May, 17:53
jenk...@sd-datasolutions.de     Build failed in Jenkins: Windows-Lucene-Solr-tests-only-trunk #41 Thu, 17 May, 18:35
jenk...@sd-datasolutions.de       Build failed in Jenkins: Windows-Lucene-Solr-tests-only-trunk #42 Thu, 17 May, 19:54
jenk...@sd-datasolutions.de         Build failed in Jenkins: Windows-Lucene-Solr-tests-only-trunk #43 Thu, 17 May, 20:42
jenk...@sd-datasolutions.de           Build failed in Jenkins: Windows-Lucene-Solr-tests-only-trunk #44 Thu, 17 May, 22:03
jenk...@sd-datasolutions.de             Build failed in Jenkins: Windows-Lucene-Solr-tests-only-trunk #45 Thu, 17 May, 22:44
jenk...@sd-datasolutions.de               Jenkins build is back to normal : Windows-Lucene-Solr-tests-only-trunk #46 Fri, 18 May, 00:07
jenk...@sd-datasolutions.de Build failed in Jenkins: Lucene-Solr-tests-only-trunk #217 Thu, 17 May, 16:44
Robert Muir   Re: Build failed in Jenkins: Lucene-Solr-tests-only-trunk #217 Thu, 17 May, 16:49
jenk...@sd-datasolutions.de   Jenkins build is back to normal : Lucene-Solr-tests-only-trunk #218 Thu, 17 May, 17:11
Robert Muir (JIRA) [jira] [Created] (LUCENE-4066) TestDocumentsWriterDeleteQueue failure Thu, 17 May, 16:50
jenk...@sd-datasolutions.de Build failed in Jenkins: Windows-Lucene-Solr-tests-only-trunk-java7 #26 Thu, 17 May, 17:13
jenk...@sd-datasolutions.de   Build failed in Jenkins: Windows-Lucene-Solr-tests-only-trunk-java7 #27 Thu, 17 May, 19:14
jenk...@sd-datasolutions.de     Build failed in Jenkins: Windows-Lucene-Solr-tests-only-trunk-java7 #28 Thu, 17 May, 21:24
jenk...@sd-datasolutions.de       Build failed in Jenkins: Windows-Lucene-Solr-tests-only-trunk-java7 #29 Thu, 17 May, 23:21
jenk...@sd-datasolutions.de         Jenkins build is back to normal : Windows-Lucene-Solr-tests-only-trunk-java7 #30 Fri, 18 May, 01:44
phatak.prachi (JIRA) [jira] [Created] (SOLR-3466) org.apache.solr.common.SolrException: org.apache.lucene.queryParser.ParseException: Cannot parse Thu, 17 May, 18:02
Erik Hatcher (JIRA) [jira] [Resolved] (SOLR-3466) org.apache.solr.common.SolrException: org.apache.lucene.queryParser.ParseException: Cannot parse Thu, 17 May, 18:06
Erik Hatcher (JIRA) [jira] [Closed] (SOLR-3466) org.apache.solr.common.SolrException: org.apache.lucene.queryParser.ParseException: Cannot parse Thu, 17 May, 18:06
[jira] [Commented] (SOLR-3466) org.apache.solr.common.SolrException: org.apache.lucene.queryParser.ParseException: Cannot parse
phatak.prachi (JIRA)   [jira] [Commented] (SOLR-3466) org.apache.solr.common.SolrException: org.apache.lucene.queryParser.ParseException: Cannot parse Thu, 17 May, 18:12
phatak.prachi (JIRA)   [jira] [Commented] (SOLR-3466) org.apache.solr.common.SolrException: org.apache.lucene.queryParser.ParseException: Cannot parse Thu, 17 May, 18:24
Jack Krupansky (JIRA)   [jira] [Commented] (SOLR-3466) org.apache.solr.common.SolrException: org.apache.lucene.queryParser.ParseException: Cannot parse Thu, 17 May, 18:28
phatak.prachi (JIRA)   [jira] [Commented] (SOLR-3466) org.apache.solr.common.SolrException: org.apache.lucene.queryParser.ParseException: Cannot parse Thu, 17 May, 18:40
Jack Krupansky (JIRA)   [jira] [Commented] (SOLR-3466) org.apache.solr.common.SolrException: org.apache.lucene.queryParser.ParseException: Cannot parse Thu, 17 May, 18:50
[jira] [Updated] (LUCENE-4066) TestDocumentsWriterDeleteQueue failure
Robert Muir (JIRA)   [jira] [Updated] (LUCENE-4066) TestDocumentsWriterDeleteQueue failure Thu, 17 May, 18:16
Simon Willnauer (JIRA)   [jira] [Updated] (LUCENE-4066) TestDocumentsWriterDeleteQueue failure Thu, 17 May, 18:28
[jira] [Commented] (LUCENE-4066) TestDocumentsWriterDeleteQueue failure
Michael McCandless (JIRA)   [jira] [Commented] (LUCENE-4066) TestDocumentsWriterDeleteQueue failure Thu, 17 May, 18:18
Robert Muir (JIRA)   [jira] [Commented] (LUCENE-4066) TestDocumentsWriterDeleteQueue failure Thu, 17 May, 18:34
Message list« Previous · 1 · 2 · 3 · 4 · 5 · 6 · 7 · 8 · 9 · 10 · 11 · 12 · 13 · 14 · 15 · 16 · 17 · 18 · 19 · 20 · 21 · 22 · 23 · 24 · Next »Thread · Author · Date
Box list
Jul 20142350
Jun 20142449
May 20142413
Apr 20142907
Mar 20144665
Feb 20143213
Jan 20142911
Dec 20132110
Nov 20132927
Oct 20132744
Sep 20132456
Aug 20132287
Jul 20133410
Jun 20132692
May 20133255
Apr 20133384
Mar 20134644
Feb 20132546
Jan 20133484
Dec 20123432
Nov 20122464
Oct 20122575
Sep 20123298
Aug 20122500
Jul 20123169
Jun 20122455
May 20122133
Apr 20122814
Mar 20123797
Feb 20122728
Jan 20121947
Dec 20111561
Nov 20111964
Oct 20111910
Sep 20112158
Aug 20111761
Jul 20112181
Jun 20112740
May 20112539
Apr 20111381
Mar 20112161
Feb 20111436
Jan 20112207
Dec 20101548
Nov 20101726
Oct 20101945
Sep 20101506
Aug 20101216
Jul 20101125
Jun 20101159
May 20101692
Apr 20101388
Mar 20101465
Feb 2010853
Jan 2010929
Dec 20091505
Nov 20091940
Oct 20091918
Sep 20091032
Aug 20092143
Jul 20091221
Jun 20091782
May 2009908
Apr 20091253
Mar 2009613
Feb 2009487
Jan 2009716
Dec 20081037
Nov 2008673
Oct 2008327
Sep 2008738
Aug 2008445
Jul 2008458
Jun 2008313
May 2008395
Apr 2008311
Mar 2008552
Feb 2008485
Jan 2008821
Dec 2007636
Nov 2007651
Oct 2007435
Sep 2007285
Aug 2007335
Jul 2007432
Jun 2007574
May 2007412
Apr 2007405
Mar 2007593
Feb 2007546
Jan 2007634
Dec 2006472
Nov 2006476
Oct 2006463
Sep 2006294
Aug 2006398
Jul 2006340
Jun 2006537
May 2006720
Apr 2006326
Mar 2006283
Feb 2006179
Jan 2006201
Dec 2005218
Nov 2005306
Oct 2005282
Sep 2005181
Aug 2005188
Jul 2005154
Jun 2005952
May 2005274
Apr 2005295
Mar 2005147
Feb 2005424
Jan 2005344
Dec 2004323
Nov 2004300
Oct 2004354
Sep 2004361
Aug 2004434
Jul 2004252
Jun 2004124
May 2004302
Apr 2004338
Mar 2004368
Feb 2004305
Jan 2004292
Dec 2003157
Nov 2003164
Oct 2003355
Sep 2003352
Aug 200344
Jul 200368
Jun 2003126
May 2003153
Apr 2003168
Mar 2003108
Feb 2003146
Jan 2003201
Dec 200294
Nov 2002161
Oct 2002154
Sep 2002227
Aug 2002137
Jul 2002177
Jun 2002244
May 2002339
Apr 2002191
Mar 2002158
Feb 2002323
Jan 2002186
Dec 200180
Nov 200178
Oct 2001231
Sep 200170