lucene-dev mailing list archives

Site index · List index
Message view « Date » · « Thread »
Top « Date » · « Thread »
From jenk...@sd-datasolutions.de
Subject Build failed in Jenkins: Lucene-Solr-trunk-Windows-Java6-64 #337
Date Thu, 31 May 2012 07:37:50 GMT
See <http://jenkins.sd-datasolutions.de/job/Lucene-Solr-trunk-Windows-Java6-64/337/>

------------------------------------------
[...truncated 10767 lines...]
   [junit4]   2> 1081 T3671 oashc.HttpShardHandlerFactory.getParameter Setting maximumPoolSize
to: 2147483647
   [junit4]   2> 1081 T3671 oashc.HttpShardHandlerFactory.getParameter Setting maxThreadIdleTime
to: 5
   [junit4]   2> 1081 T3671 oashc.HttpShardHandlerFactory.getParameter Setting sizeOfQueue
to: -1
   [junit4]   2> 1082 T3671 oashc.HttpShardHandlerFactory.getParameter Setting fairnessPolicy
to: false
   [junit4]   2> 1082 T3671 oascsi.HttpClientUtil.createClient Creating new http client,
config:maxConnectionsPerHost=20&maxConnections=10000&socketTimeout=0&connTimeout=0&retry=false
   [junit4]   2> 1086 T3673 oasc.SolrCore.registerSearcher [collection1] Registered new
searcher Searcher@77668827 main{StandardDirectoryReader(segments_2:3 _0(5.0):C3)}
   [junit4]   2> 1086 T3671 oasc.CoreContainer.register registering core: collection1
   [junit4]   2> 1087 T3671 oas.SolrTestCaseJ4.initCore ####initCore end
   [junit4]   2> ASYNC  NEW_CORE C220 name=collection1 org.apache.solr.core.SolrCore@107ede1
   [junit4]   2> 1087 T3671 C220 REQ [collection1] webapp=null path=null params={q=ac&spellcheck.count=2&qt=/suggest_tst&spellcheck.onlyMorePopular=true}
status=0 QTime=0 
   [junit4]   2> 1091 T3671 oas.SolrTestCaseJ4.assertQ SEVERE REQUEST FAILED: xpath=//lst[@name='spellcheck']/lst[@name='suggestions']/lst[@name='ac']/int[@name='numFound'][.='2']
   [junit4]   2> 		xml response was: <?xml version="1.0" encoding="UTF-8"?>
   [junit4]   2> 	<response>
   [junit4]   2> 	<lst name="responseHeader"><int name="status">0</int><int
name="QTime">0</int></lst><lst name="spellcheck"><lst name="suggestions"/></lst>
   [junit4]   2> 	</response>
   [junit4]   2> 	
   [junit4]   2> 		request was:q=ac&spellcheck.count=2&qt=/suggest_tst&spellcheck.onlyMorePopular=true
   [junit4]   2> 1091 T3671 oasc.SolrException.log SEVERE REQUEST FAILED: q=ac&spellcheck.count=2&qt=/suggest_tst&spellcheck.onlyMorePopular=true:java.lang.RuntimeException:
REQUEST FAILED: xpath=//lst[@name='spellcheck']/lst[@name='suggestions']/lst[@name='ac']/int[@name='numFound'][.='2']
   [junit4]   2> 		xml response was: <?xml version="1.0" encoding="UTF-8"?>
   [junit4]   2> 	<response>
   [junit4]   2> 	<lst name="responseHeader"><int name="status">0</int><int
name="QTime">0</int></lst><lst name="spellcheck"><lst name="suggestions"/></lst>
   [junit4]   2> 	</response>
   [junit4]   2> 	
   [junit4]   2> 		request was:q=ac&spellcheck.count=2&qt=/suggest_tst&spellcheck.onlyMorePopular=true
   [junit4]   2> 		at org.apache.solr.SolrTestCaseJ4.assertQ(SolrTestCaseJ4.java:452)
   [junit4]   2> 		at org.apache.solr.SolrTestCaseJ4.assertQ(SolrTestCaseJ4.java:426)
   [junit4]   2> 		at org.apache.solr.spelling.suggest.SuggesterTest.testReload(SuggesterTest.java:91)
   [junit4]   2> 		at sun.reflect.NativeMethodAccessorImpl.invoke0(Native Method)
   [junit4]   2> 		at sun.reflect.NativeMethodAccessorImpl.invoke(NativeMethodAccessorImpl.java:39)
   [junit4]   2> 		at sun.reflect.DelegatingMethodAccessorImpl.invoke(DelegatingMethodAccessorImpl.java:25)
   [junit4]   2> 		at java.lang.reflect.Method.invoke(Method.java:597)
   [junit4]   2> 		at com.carrotsearch.randomizedtesting.RandomizedRunner.invoke(RandomizedRunner.java:1969)
   [junit4]   2> 		at com.carrotsearch.randomizedtesting.RandomizedRunner.access$1100(RandomizedRunner.java:132)
   [junit4]   2> 		at com.carrotsearch.randomizedtesting.RandomizedRunner$6.evaluate(RandomizedRunner.java:814)
   [junit4]   2> 		at com.carrotsearch.randomizedtesting.RandomizedRunner$7.evaluate(RandomizedRunner.java:875)
   [junit4]   2> 		at com.carrotsearch.randomizedtesting.RandomizedRunner$8.evaluate(RandomizedRunner.java:889)
   [junit4]   2> 		at com.carrotsearch.randomizedtesting.rules.SystemPropertiesRestoreRule$1.evaluate(SystemPropertiesRestoreRule.java:53)
   [junit4]   2> 		at org.apache.lucene.util.TestRuleSetupTeardownChained$1.evaluate(TestRuleSetupTeardownChained.java:50)
   [junit4]   2> 		at org.apache.lucene.util.TestRuleFieldCacheSanity$1.evaluate(TestRuleFieldCacheSanity.java:32)
   [junit4]   2> 		at org.apache.lucene.util.AbstractBeforeAfterRule$1.evaluate(AbstractBeforeAfterRule.java:45)
   [junit4]   2> 		at com.carrotsearch.randomizedtesting.rules.SystemPropertiesInvariantRule$1.evaluate(SystemPropertiesInvariantRule.java:55)
   [junit4]   2> 		at org.apache.lucene.util.TestRuleReportUncaughtExceptions$1.evaluate(TestRuleReportUncaughtExceptions.java:68)
   [junit4]   2> 		at org.apache.lucene.util.TestRuleThreadAndTestName$1.evaluate(TestRuleThreadAndTestName.java:48)
   [junit4]   2> 		at org.apache.lucene.util.TestRuleMarkFailure$1.evaluate(TestRuleMarkFailure.java:48)
   [junit4]   2> 		at com.carrotsearch.randomizedtesting.RandomizedRunner.runSingleTest(RandomizedRunner.java:821)
   [junit4]   2> 		at com.carrotsearch.randomizedtesting.RandomizedRunner.access$700(RandomizedRunner.java:132)
   [junit4]   2> 		at com.carrotsearch.randomizedtesting.RandomizedRunner$3$1.run(RandomizedRunner.java:669)
   [junit4]   2> 		at com.carrotsearch.randomizedtesting.RandomizedRunner$3.evaluate(RandomizedRunner.java:695)
   [junit4]   2> 		at com.carrotsearch.randomizedtesting.RandomizedRunner$4.evaluate(RandomizedRunner.java:734)
   [junit4]   2> 		at com.carrotsearch.randomizedtesting.RandomizedRunner$5.evaluate(RandomizedRunner.java:745)
   [junit4]   2> 		at com.carrotsearch.randomizedtesting.rules.SystemPropertiesRestoreRule$1.evaluate(SystemPropertiesRestoreRule.java:53)
   [junit4]   2> 		at org.apache.lucene.util.AbstractBeforeAfterRule$1.evaluate(AbstractBeforeAfterRule.java:45)
   [junit4]   2> 		at org.apache.lucene.util.TestRuleReportUncaughtExceptions$1.evaluate(TestRuleReportUncaughtExceptions.java:68)
   [junit4]   2> 		at org.apache.lucene.util.TestRuleStoreClassName$1.evaluate(TestRuleStoreClassName.java:38)
   [junit4]   2> 		at org.apache.lucene.util.TestRuleIcuHack$1.evaluate(TestRuleIcuHack.java:51)
   [junit4]   2> 		at com.carrotsearch.randomizedtesting.rules.SystemPropertiesInvariantRule$1.evaluate(SystemPropertiesInvariantRule.java:55)
   [junit4]   2> 		at org.apache.lucene.util.TestRuleNoInstanceHooksOverrides$1.evaluate(TestRuleNoInstanceHooksOverrides.java:53)
   [junit4]   2> 		at org.apache.lucene.util.TestRuleNoStaticHooksShadowing$1.evaluate(TestRuleNoStaticHooksShadowing.java:52)
   [junit4]   2> 		at org.apache.lucene.util.TestRuleAssertionsRequired$1.evaluate(TestRuleAssertionsRequired.java:36)
   [junit4]   2> 		at org.apache.lucene.util.TestRuleMarkFailure$1.evaluate(TestRuleMarkFailure.java:48)
   [junit4]   2> 		at org.apache.lucene.util.TestRuleIgnoreTestSuites$1.evaluate(TestRuleIgnoreTestSuites.java:56)
   [junit4]   2> 		at com.carrotsearch.randomizedtesting.RandomizedRunner.runSuite(RandomizedRunner.java:605)
   [junit4]   2> 		at com.carrotsearch.randomizedtesting.RandomizedRunner.access$400(RandomizedRunner.java:132)
   [junit4]   2> 		at com.carrotsearch.randomizedtesting.RandomizedRunner$2.run(RandomizedRunner.java:551)
   [junit4]   2> 	
   [junit4]   2> 1092 T3671 oas.SolrTestCaseJ4.tearDown ###Ending testReload
   [junit4]   2> NOTE: reproduce with: ant test  -Dtestcase=SuggesterTSTTest -Dtests.method=testReload
-Dtests.seed=354325683906B3A4 -Dtests.locale=en_SG -Dtests.timezone=Asia/Manila -Dargs="-Dfile.encoding=Cp1252"
   [junit4]   2>
   [junit4]    > (@AfterClass output)
   [junit4]   2> 1322 T3671 oas.SolrTestCaseJ4.deleteCore ###deleteCore
   [junit4]   2> 1322 T3671 oasc.CoreContainer.shutdown Shutting down CoreContainer instance=141877034
   [junit4]   2> 1322 T3671 oasc.SolrCore.close [collection1]  CLOSING SolrCore org.apache.solr.core.SolrCore@107ede1
   [junit4]   2> 1322 T3671 oasc.SolrCore.closeSearcher [collection1] Closing main searcher
on request.
   [junit4]   2> 1322 T3671 oasu.DirectUpdateHandler2.close closing DirectUpdateHandler2{commits=3,autocommits=0,soft
autocommits=0,optimizes=0,rollbacks=0,expungeDeletes=0,docsPending=0,adds=0,deletesById=0,deletesByQuery=0,errors=0,cumulative_adds=7,cumulative_deletesById=0,cumulative_deletesByQuery=0,cumulative_errors=0}
   [junit4]   2> NOTE: test params are: codec=Lucene40: {}, sim=RandomSimilarityProvider(queryNorm=true,coord=true):
{}, locale=en_SG, timezone=Asia/Manila
   [junit4]   2> NOTE: Windows 7 6.1 amd64/Sun Microsystems Inc. 1.6.0_32 (64-bit)/cpus=2,threads=1,free=64562080,total=195624960
   [junit4]   2> NOTE: All tests run in this JVM: [TestFastLRUCache, TestJapanesePartOfSpeechStopFilterFactory,
CSVRequestHandlerTest, SolrRequestParserTest, TestBulgarianStemFilterFactory, TestGermanNormalizationFilterFactory,
SpellCheckCollatorTest, TestUpdate, SearchHandlerTest, SuggesterWFSTTest, CoreAdminHandlerTest,
IndexBasedSpellCheckerTest, TestSolrCoreProperties, TestPropInject, XmlUpdateRequestHandlerTest,
EchoParamsTest, BadComponentTest, DateMathParserTest, TestPropInjectDefaults, TestMergePolicyConfig,
QueryParsingTest, SolrCoreTest, TestMultiWordSynonyms, TestCapitalizationFilterFactory, PluginInfoTest,
TestGreekLowerCaseFilterFactory, TestMultiCoreConfBootstrap, UpdateRequestProcessorFactoryTest,
TestJmxIntegration, SnowballPorterFilterFactoryTest, HighlighterConfigTest, TestShingleFilterFactory,
TestCJKBigramFilterFactory, TestPatternTokenizerFactory, TestStandardFactories, TestLMJelinekMercerSimilarityFactory,
TestNGramFilters, TestPortugueseLightStemFilterFactory, TestHungarianLightStemFilterFactory,
DirectUpdateHandlerTest, TestCollationField, DistributedTermsComponentTest, BinaryUpdateRequestHandlerTest,
CloudStateTest, TestLatvianStemFilterFactory, TestGermanStemFilterFactory, SortByFunctionTest,
TestPHPSerializedResponseWriter, TestIndexSearcher, ZkNodePropsTest, DirectSolrConnectionTest,
TestBadConfig, IndexSchemaRuntimeFieldTest, TestSpanishLightStemFilterFactory, TestPhoneticFilterFactory,
TestFaceting, TestFrenchLightStemFilterFactory, TestSynonymFilterFactory, TestElisionFilterFactory,
SpellPossibilityIteratorTest, MinimalSchemaTest, TermVectorComponentTest, TestBM25SimilarityFactory,
TestReverseStringFilterFactory, FileBasedSpellCheckerTest, TestSystemIdResolver, NotRequiredUniqueKeyTest,
TestArabicFilters, CopyFieldTest, TestPluginEnable, TestThaiWordFilterFactory, FileUtilsTest,
TestPerFieldSimilarity, DistanceFunctionTest, IndexSchemaTest, ZkSolrClientTest, LengthFilterTest,
TestWriterPerf, TestHTMLStripCharFilterFactory, FieldMutatingUpdateProcessorTest, TestJapaneseBaseFormFilterFactory,
PeerSyncTest, TestCSVResponseWriter, TestSort, StandardRequestHandlerTest, TestJoin, MultiTermTest,
TestDocSet, TestHashPartitioner, TestRandomFaceting, LegacyHTMLStripCharFilterTest, RequestHandlersTest,
TestDictionaryCompoundWordTokenFilterFactory, ZkControllerTest, HighlighterTest, TestXIncludeConfig,
TestBinaryField, DisMaxRequestHandlerTest, NodeStateWatcherTest, BasicDistributedZkTest, DirectUpdateHandlerOptimizeTest,
NumericFieldsTest, CacheHeaderTest, FullSolrCloudTest, TestRealTimeGet, TestIndonesianStemFilterFactory,
TestWordDelimiterFilterFactory, BasicZkTest, JsonLoaderTest, PingRequestHandlerTest, TestTypeTokenFilterFactory,
ResourceLoaderTest, JSONWriterTest, TestBrazilianStemFilterFactory, DistributedQueryElevationComponentTest,
SOLR749Test, TestSuggestSpellingConverter, LeaderElectionTest, RecoveryZkTest, ShowFileRequestHandlerTest,
TestStopFilterFactory, ReturnFieldsTest, TestReplicationHandler, DocumentBuilderTest, TestSolrDeletionPolicy1,
BasicFunctionalityTest, TestLRUCache, AlternateDirectoryTest, SuggesterTest, BadIndexSchemaTest,
TestIndexingPerformance, TestQueryTypes, TestHindiFilters, TestBeiderMorseFilterFactory, LeaderElectionIntegrationTest,
OverseerTest, LoggingHandlerTest, SolrInfoMBeanTest, IndexReaderFactoryTest, TestPatternReplaceFilterFactory,
TestItalianLightStemFilterFactory, TestQueryUtils, TestCodecSupport, TestDFRSimilarityFactory,
TestKeywordMarkerFilterFactory, TimeZoneUtilsTest, TestConfig, TestIrishLowerCaseFilterFactory,
TestFunctionQuery, DebugComponentTest, TestRussianLightStemFilterFactory, SpellCheckComponentTest,
UUIDFieldTest, TestJmxMonitoredMap, TestDelimitedPayloadTokenFilterFactory, SystemInfoHandlerTest,
TestIBSimilarityFactory, TestGroupingSearch, SolrIndexConfigTest, TestSolrXMLSerializer, SoftAutoCommitTest,
FieldAnalysisRequestHandlerTest, QueryElevationComponentTest, ConvertedLegacyTest, TestNorwegianMinimalStemFilterFactory,
TestSwedishLightStemFilterFactory, FastVectorHighlighterTest, TestCoreContainer, CurrencyFieldTest,
AutoCommitTest, TestLFUCache, SolrPluginUtilsTest, TestDistributedSearch, SpellingQueryConverterTest,
TestGreekStemFilterFactory, TestStemmerOverrideFilterFactory, TestTrie, TestExtendedDismaxParser,
TestFiltering, TestSolrQueryParser, OpenExchangeRatesOrgProviderTest, OutputWriterTest, PrimitiveFieldTypeTest,
TestWikipediaTokenizerFactory, TestTrimFilterFactory, SampleTest, TestPortugueseMinimalStemFilterFactory,
TestBinaryResponseWriter, DoubleMetaphoneFilterFactoryTest, TestKeepFilterFactory, TestPatternReplaceCharFilterFactory,
TestDistributedGrouping, DOMUtilTest, SimpleFacetsTest, SolrCmdDistributorTest, TestRecovery,
TestRangeQuery, TestPortugueseStemFilterFactory, TestKStemFilterFactory, FullSolrCloudDistribCmdsTest,
CloudStateUpdateTest, DistributedSpellCheckComponentTest, SuggesterFSTTest, MoreLikeThisHandlerTest,
StatsComponentTest, LukeRequestHandlerTest, SignatureUpdateProcessorFactoryTest, TestSolrDeletionPolicy2,
TestPseudoReturnFields, TestLMDirichletSimilarityFactory, TermsComponentTest, TestSurroundQueryParser,
DirectSolrSpellCheckerTest, UniqFieldsUpdateProcessorFactoryTest, XsltUpdateRequestHandlerTest,
TestRemoteStreaming, SuggesterTSTTest]
   [junit4]   2> 
   [junit4] Completed in 1.38s, 4 tests, 1 error <<< FAILURES!
   [junit4]  
   [junit4] Suite: org.apache.solr.search.SpatialFilterTest
   [junit4] Completed in 1.69s, 3 tests
   [junit4]  
   [junit4] Suite: org.apache.solr.schema.PolyFieldTest
   [junit4] Completed in 1.35s, 4 tests
   [junit4]  
   [junit4] Suite: org.apache.solr.servlet.NoCacheHeaderTest
   [junit4] Completed in 0.97s, 3 tests
   [junit4]  
   [junit4] Suite: org.apache.solr.core.SolrCoreCheckLockOnStartupTest
   [junit4] Completed in 1.69s, 2 tests
   [junit4]  
   [junit4] Suite: org.apache.solr.handler.DocumentAnalysisRequestHandlerTest
   [junit4] Completed in 0.93s, 4 tests
   [junit4]  
   [junit4] Suite: org.apache.solr.search.TestFoldingMultitermQuery
   [junit4] Completed in 1.34s, 18 tests
   [junit4]  
   [junit4] Suite: org.apache.solr.schema.TestOmitPositions
   [junit4] Completed in 1.20s, 2 tests
   [junit4]  
   [junit4] Suite: org.apache.solr.analysis.TestReversedWildcardFilterFactory
   [junit4] Completed in 0.70s, 4 tests
   [junit4]  
   [junit4] Suite: org.apache.solr.handler.TestCSVLoader
   [junit4] Completed in 1.50s, 5 tests
   [junit4]  
   [junit4] Suite: org.apache.solr.search.TestValueSourceCache
   [junit4] Completed in 0.98s, 2 tests
   [junit4]  
   [junit4] Suite: org.apache.solr.schema.RequiredFieldsTest
   [junit4] Completed in 0.81s, 3 tests
   [junit4]  
   [junit4] Suite: org.apache.solr.core.TestArbitraryIndexDir
   [junit4] Completed in 0.91s, 1 test
   [junit4]  
   [junit4] Suite: org.apache.solr.handler.admin.MBeansHandlerTest
   [junit4] Completed in 0.91s, 1 test
   [junit4]  
   [junit4] Suite: org.apache.solr.update.UpdateParamsTest
   [junit4] Completed in 0.91s, 1 test
   [junit4]  
   [junit4] Suite: org.apache.solr.core.TestQuerySenderListener
   [junit4] Completed in 0.85s, 3 tests
   [junit4]  
   [junit4] Suite: org.apache.solr.core.TestQuerySenderNoQuery
   [junit4] Completed in 0.87s, 3 tests
   [junit4]  
   [junit4] Suite: org.apache.solr.util.TestNumberUtils
   [junit4] Completed in 0.21s, 1 test
   [junit4]  
   [junit4] Suite: org.apache.solr.search.TestSearchPerf
   [junit4] Completed in 0.48s, 1 test
   [junit4]  
   [junit4] Suite: org.apache.solr.analysis.TestJapaneseTokenizerFactory
   [junit4] Completed in 0.02s, 4 tests
   [junit4]  
   [junit4] Suite: org.apache.solr.search.similarities.TestDefaultSimilarityFactory
   [junit4] Completed in 0.15s, 1 test
   [junit4]  
   [junit4] Suite: org.apache.solr.analysis.TestLuceneMatchVersion
   [junit4] Completed in 0.27s, 1 test
   [junit4]  
   [junit4] Suite: org.apache.solr.spelling.suggest.TestPhraseSuggestions
   [junit4] Completed in 0.18s, 1 test
   [junit4]  
   [junit4] Suite: org.apache.solr.analysis.TestHyphenationCompoundWordTokenFilterFactory
   [junit4] Completed in 0.19s, 2 tests
   [junit4]  
   [junit4] Suite: org.apache.solr.analysis.TestUAX29URLEmailTokenizerFactory
   [junit4] Completed in 0.04s, 8 tests
   [junit4]  
   [junit4] Suite: org.apache.solr.update.processor.URLClassifyProcessorTest
   [junit4] Completed in 0.03s, 7 tests
   [junit4]  
   [junit4] Suite: org.apache.solr.util.PrimUtilsTest
   [junit4] Completed in 0.04s, 2 tests
   [junit4]  
   [junit4] Suite: org.apache.solr.analysis.TestGalicianStemFilterFactory
   [junit4] Completed in 0.01s, 1 test
   [junit4]  
   [junit4] Suite: org.apache.solr.internal.csv.CharBufferTest
   [junit4] Completed in 0.02s, 13 tests
   [junit4]  
   [junit4] Suite: org.apache.solr.schema.DateFieldTest
   [junit4] IGNORED 0.00s | DateFieldTest.testRoundTripNonPositiveYear
   [junit4]    > Cause: Annotated @Ignore(SOLR-2773: Non-Positive years don't work)
   [junit4] Completed in 0.02s, 8 tests, 1 skipped
   [junit4]  
   [junit4] Suite: org.apache.solr.analysis.TestGalicianMinimalStemFilterFactory
   [junit4] Completed in 0.01s, 1 test
   [junit4]  
   [junit4] Suite: org.apache.solr.analysis.CommonGramsFilterFactoryTest
   [junit4] Completed in 0.01s, 2 tests
   [junit4]  
   [junit4] Suite: org.apache.solr.internal.csv.CSVUtilsTest
   [junit4] Completed in 0.02s, 14 tests
   [junit4]  
   [junit4] Suite: org.apache.solr.analysis.TestNorwegianLightStemFilterFactory
   [junit4] Completed in 0.01s, 1 test
   [junit4]  
   [junit4] Suite: org.apache.solr.analysis.TestHunspellStemFilterFactory
   [junit4] Completed in 0.02s, 1 test
   [junit4]  
   [junit4] Suite: org.apache.solr.util.TestUtils
   [junit4] Completed in 0.01s, 3 tests
   [junit4]  
   [junit4] Suite: org.apache.solr.analysis.CommonGramsQueryFilterFactoryTest
   [junit4] Completed in 0.01s, 2 tests
   [junit4]  
   [junit4] Suite: org.apache.solr.analysis.TestFinnishLightStemFilterFactory
   [junit4] Completed in 0.01s, 1 test
   [junit4]  
   [junit4] Suite: org.apache.solr.analysis.TestPorterStemFilterFactory
   [junit4] Completed in 0.01s, 1 test
   [junit4]  
   [junit4] Suite: org.apache.solr.analysis.TestFrenchMinimalStemFilterFactory
   [junit4] Completed in 0.01s, 1 test
   [junit4]  
   [junit4] Suite: org.apache.solr.analysis.TestGermanLightStemFilterFactory
   [junit4] Completed in 0.01s, 1 test
   [junit4]  
   [junit4] Suite: org.apache.solr.analysis.TestPersianNormalizationFilterFactory
   [junit4] Completed in 0.01s, 1 test
   [junit4]  
   [junit4] Suite: org.apache.solr.analysis.TestTurkishLowerCaseFilterFactory
   [junit4] Completed in 0.00s, 1 test
   [junit4]  
   [junit4] Suite: org.apache.solr.analysis.TestCJKWidthFilterFactory
   [junit4] Completed in 0.01s, 1 test
   [junit4]  
   [junit4] Suite: org.apache.solr.analysis.TestCzechStemFilterFactory
   [junit4] Completed in 0.01s, 1 test
   [junit4]  
   [junit4] Suite: org.apache.solr.analysis.TestGermanMinimalStemFilterFactory
   [junit4] Completed in 0.01s, 1 test
   [junit4]  
   [junit4] Suite: org.apache.solr.analysis.TestEnglishMinimalStemFilterFactory
   [junit4] Completed in 0.01s, 1 test
   [junit4]  
   [junit4] Suite: org.apache.solr.analysis.TestMappingCharFilterFactory
   [junit4] Completed in 0.01s, 1 test
   [junit4]  
   [junit4] Suite: org.apache.solr.core.RAMDirectoryFactoryTest
   [junit4] Completed in 0.01s, 1 test
   [junit4]  
   [junit4] Suite: org.apache.solr.analysis.TestRemoveDuplicatesTokenFilterFactory
   [junit4] Completed in 0.01s, 1 test
   [junit4]  
   [junit4] Suite: org.apache.solr.schema.PreAnalyzedFieldTest
   [junit4] Completed in 0.02s, 3 tests
   [junit4]  
   [junit4] Suite: org.apache.solr.util.CircularListTest
   [junit4] Completed in 0.00s, 1 test
   [junit4]  
   [junit4] JVM J0:     0.74 ..   916.40 =   915.66s
   [junit4] Execution time total: 15 minutes 16 seconds
   [junit4] Tests summary: 278 suites, 941 tests, 1 error, 10 ignored (5 assumptions)

BUILD FAILED
<http://jenkins.sd-datasolutions.de/job/Lucene-Solr-trunk-Windows-Java6-64/ws/build.xml>:29:
The following error occurred while executing this line:
<http://jenkins.sd-datasolutions.de/job/Lucene-Solr-trunk-Windows-Java6-64/ws/solr\build.xml>:144:
The following error occurred while executing this line:
<http://jenkins.sd-datasolutions.de/job/Lucene-Solr-trunk-Windows-Java6-64/ws/lucene\module-build.xml>:62:
The following error occurred while executing this line:
<http://jenkins.sd-datasolutions.de/job/Lucene-Solr-trunk-Windows-Java6-64/ws/lucene\common-build.xml>:1019:
The following error occurred while executing this line:
<http://jenkins.sd-datasolutions.de/job/Lucene-Solr-trunk-Windows-Java6-64/ws/lucene\common-build.xml>:745:
There were test failures: 278 suites, 941 tests, 1 error, 10 ignored (5 assumptions)

Total time: 34 minutes 52 seconds
Build step 'Invoke Ant' marked build as failure
Recording test results

---------------------------------------------------------------------
To unsubscribe, e-mail: dev-unsubscribe@lucene.apache.org
For additional commands, e-mail: dev-help@lucene.apache.org


Mime
View raw message