lucene-dev mailing list archives

Site index · List index
Message view « Date » · « Thread »
Top « Date » · « Thread »
From jenk...@sd-datasolutions.de
Subject Build failed in Jenkins: Lucene-Solr-tests-only-trunk-java7 #43
Date Fri, 18 May 2012 19:30:18 GMT
See <http://jenkins.sd-datasolutions.de/job/Lucene-Solr-tests-only-trunk-java7/43/changes>

Changes:

[sarowe] LUCENE-3983: HTMLStripCharFilter: Stop upcasing HTML character entity names at class
initialization time; instead, provide hard-coded upcased versions for a small set of them.

------------------------------------------
[...truncated 15092 lines...]
   [junit4]    > 	at __randomizedtesting.SeedInfo.seed([50074E0E5BCCA2F3:52482EA1B548BAF6]:0)
   [junit4]    > 	at org.apache.solr.util.TestHarness.update(TestHarness.java:260)
   [junit4]    > 	at org.apache.solr.util.TestHarness.checkUpdateStatus(TestHarness.java:304)
   [junit4]    > 	at org.apache.solr.util.TestHarness.validateUpdate(TestHarness.java:274)
   [junit4]    > 	at org.apache.solr.SolrTestCaseJ4.checkUpdateU(SolrTestCaseJ4.java:408)
   [junit4]    > 	at org.apache.solr.SolrTestCaseJ4.assertU(SolrTestCaseJ4.java:387)
   [junit4]    > 	at org.apache.solr.SolrTestCaseJ4.assertU(SolrTestCaseJ4.java:381)
   [junit4]    > 	at org.apache.solr.SolrTestCaseJ4.clearIndex(SolrTestCaseJ4.java:753)
   [junit4]    > 	at org.apache.solr.handler.dataimport.TestSqlEntityProcessorDelta2.setUp(TestSqlEntityProcessorDelta2.java:68)
   [junit4]    > 	at sun.reflect.NativeMethodAccessorImpl.invoke0(Native Method)
   [junit4]    > 	at sun.reflect.NativeMethodAccessorImpl.invoke(NativeMethodAccessorImpl.java:57)
   [junit4]    > 	at sun.reflect.DelegatingMethodAccessorImpl.invoke(DelegatingMethodAccessorImpl.java:43)
   [junit4]    > 	at java.lang.reflect.Method.invoke(Method.java:601)
   [junit4]    > 	at com.carrotsearch.randomizedtesting.RandomizedRunner.invoke(RandomizedRunner.java:1969)
   [junit4]    > 	at com.carrotsearch.randomizedtesting.RandomizedRunner.access$1100(RandomizedRunner.java:132)
   [junit4]    > 	at com.carrotsearch.randomizedtesting.RandomizedRunner$7.evaluate(RandomizedRunner.java:873)
   [junit4]    > 	at com.carrotsearch.randomizedtesting.RandomizedRunner$8.evaluate(RandomizedRunner.java:889)
   [junit4]    > 	at com.carrotsearch.randomizedtesting.rules.SystemPropertiesRestoreRule$1.evaluate(SystemPropertiesRestoreRule.java:53)
   [junit4]    > 	at org.apache.lucene.util.TestRuleSetupTeardownChained$1.evaluate(TestRuleSetupTeardownChained.java:50)
   [junit4]    > 	at org.apache.lucene.util.TestRuleFieldCacheSanity$1.evaluate(TestRuleFieldCacheSanity.java:32)
   [junit4]    > 	at org.apache.lucene.util.AbstractBeforeAfterRule$1.evaluate(AbstractBeforeAfterRule.java:45)
   [junit4]    > 	at com.carrotsearch.randomizedtesting.rules.SystemPropertiesInvariantRule$1.evaluate(SystemPropertiesInvariantRule.java:55)
   [junit4]    > 	at org.apache.lucene.util.TestRuleReportUncaughtExceptions$1.evaluate(TestRuleReportUncaughtExceptions.java:68)
   [junit4]    > 	at org.apache.lucene.util.TestRuleThreadAndTestName$1.evaluate(TestRuleThreadAndTestName.java:48)
   [junit4]    > 	at org.apache.lucene.util.TestRuleMarkFailure$1.evaluate(TestRuleMarkFailure.java:48)
   [junit4]    > 	at com.carrotsearch.randomizedtesting.RandomizedRunner.runSingleTest(RandomizedRunner.java:821)
   [junit4]    > 	at com.carrotsearch.randomizedtesting.RandomizedRunner.access$700(RandomizedRunner.java:132)
   [junit4]    > 	at com.carrotsearch.randomizedtesting.RandomizedRunner$3$1.run(RandomizedRunner.java:669)
   [junit4]    > 	at com.carrotsearch.randomizedtesting.RandomizedRunner$3.evaluate(RandomizedRunner.java:695)
   [junit4]    > 	at com.carrotsearch.randomizedtesting.RandomizedRunner$4.evaluate(RandomizedRunner.java:734)
   [junit4]    > 	at com.carrotsearch.randomizedtesting.RandomizedRunner$5.evaluate(RandomizedRunner.java:745)
   [junit4]    > 	at com.carrotsearch.randomizedtesting.rules.SystemPropertiesRestoreRule$1.evaluate(SystemPropertiesRestoreRule.java:53)
   [junit4]    > 	at org.apache.lucene.util.AbstractBeforeAfterRule$1.evaluate(AbstractBeforeAfterRule.java:45)
   [junit4]    > 	at org.apache.lucene.util.TestRuleReportUncaughtExceptions$1.evaluate(TestRuleReportUncaughtExceptions.java:68)
   [junit4]    > 	at org.apache.lucene.util.TestRuleStoreClassName$1.evaluate(TestRuleStoreClassName.java:38)
   [junit4]    > 	at org.apache.lucene.util.TestRuleIcuHack$1.evaluate(TestRuleIcuHack.java:51)
   [junit4]    > 	at com.carrotsearch.randomizedtesting.rules.SystemPropertiesInvariantRule$1.evaluate(SystemPropertiesInvariantRule.java:55)
   [junit4]    > 	at org.apache.lucene.util.TestRuleNoInstanceHooksOverrides$1.evaluate(TestRuleNoInstanceHooksOverrides.java:53)
   [junit4]    > 	at org.apache.lucene.util.TestRuleNoStaticHooksShadowing$1.evaluate(TestRuleNoStaticHooksShadowing.java:52)
   [junit4]    > 	at org.apache.lucene.util.TestRuleAssertionsRequired$1.evaluate(TestRuleAssertionsRequired.java:36)
   [junit4]    > 	at org.apache.lucene.util.TestRuleMarkFailure$1.evaluate(TestRuleMarkFailure.java:48)
   [junit4]    > 	at org.apache.lucene.util.TestRuleIgnoreTestSuites$1.evaluate(TestRuleIgnoreTestSuites.java:56)
   [junit4]    > 	at com.carrotsearch.randomizedtesting.RandomizedRunner.runSuite(RandomizedRunner.java:605)
   [junit4]    > 	at com.carrotsearch.randomizedtesting.RandomizedRunner.access$400(RandomizedRunner.java:132)
   [junit4]    > 	at com.carrotsearch.randomizedtesting.RandomizedRunner$2.run(RandomizedRunner.java:551)
   [junit4]    > Caused by: org.apache.lucene.store.AlreadyClosedException: this IndexWriter
is closed
   [junit4]    > 	at org.apache.lucene.index.IndexWriter.ensureOpen(IndexWriter.java:552)
   [junit4]    > 	at org.apache.lucene.index.IndexWriter.ensureOpen(IndexWriter.java:557)
   [junit4]    > 	at org.apache.lucene.index.IndexWriter.deleteAll(IndexWriter.java:1826)
   [junit4]    > 	at org.apache.solr.update.DirectUpdateHandler2.deleteAll(DirectUpdateHandler2.java:140)
   [junit4]    > 	at org.apache.solr.update.DirectUpdateHandler2.deleteByQuery(DirectUpdateHandler2.java:292)
   [junit4]    > 	at org.apache.solr.update.processor.RunUpdateProcessor.processDelete(RunUpdateProcessorFactory.java:67)
   [junit4]    > 	at org.apache.solr.update.processor.UpdateRequestProcessor.processDelete(UpdateRequestProcessor.java:55)
   [junit4]    > 	at org.apache.solr.handler.dataimport.AbstractDataImportHandlerTestCase$TestUpdateRequestProcessor.processDelete(AbstractDataImportHandlerTestCase.java:364)
   [junit4]    > 	at org.apache.solr.handler.loader.XMLLoader.processDelete(XMLLoader.java:333)
   [junit4]    > 	at org.apache.solr.handler.loader.XMLLoader.processUpdate(XMLLoader.java:264)
   [junit4]    > 	at org.apache.solr.handler.loader.XMLLoader.load(XMLLoader.java:158)
   [junit4]    > 	at org.apache.solr.handler.UpdateRequestHandler$1.load(UpdateRequestHandler.java:92)
   [junit4]    > 	at org.apache.solr.handler.ContentStreamHandlerBase.handleRequestBody(ContentStreamHandlerBase.java:74)
   [junit4]    > 	at org.apache.solr.handler.RequestHandlerBase.handleRequest(RequestHandlerBase.java:129)
   [junit4]    > 	at org.apache.solr.core.SolrCore.execute(SolrCore.java:1555)
   [junit4]    > 	at org.apache.solr.servlet.DirectSolrConnection.request(DirectSolrConnection.java:131)
   [junit4]    > 	at org.apache.solr.util.TestHarness.update(TestHarness.java:256)
   [junit4]    > 	... 43 more
   [junit4]    > 
   [junit4]   2> 543 T81 C7 oasc.SolrException.log SEVERE org.apache.lucene.store.AlreadyClosedException:
this IndexWriter is closed
   [junit4]   2> 		at org.apache.lucene.index.IndexWriter.ensureOpen(IndexWriter.java:552)
   [junit4]   2> 		at org.apache.lucene.index.IndexWriter.ensureOpen(IndexWriter.java:557)
   [junit4]   2> 		at org.apache.lucene.index.IndexWriter.deleteAll(IndexWriter.java:1826)
   [junit4]   2> 		at org.apache.solr.update.DirectUpdateHandler2.deleteAll(DirectUpdateHandler2.java:140)
   [junit4]   2> 		at org.apache.solr.update.DirectUpdateHandler2.deleteByQuery(DirectUpdateHandler2.java:292)
   [junit4]   2> 		at org.apache.solr.update.processor.RunUpdateProcessor.processDelete(RunUpdateProcessorFactory.java:67)
   [junit4]   2> 		at org.apache.solr.update.processor.UpdateRequestProcessor.processDelete(UpdateRequestProcessor.java:55)
   [junit4]   2> 		at org.apache.solr.handler.dataimport.AbstractDataImportHandlerTestCase$TestUpdateRequestProcessor.processDelete(AbstractDataImportHandlerTestCase.java:364)
   [junit4]   2> 		at org.apache.solr.handler.loader.XMLLoader.processDelete(XMLLoader.java:333)
   [junit4]   2> 		at org.apache.solr.handler.loader.XMLLoader.processUpdate(XMLLoader.java:264)
   [junit4]   2> 		at org.apache.solr.handler.loader.XMLLoader.load(XMLLoader.java:158)
   [junit4]   2> 		at org.apache.solr.handler.UpdateRequestHandler$1.load(UpdateRequestHandler.java:92)
   [junit4]   2> 		at org.apache.solr.handler.ContentStreamHandlerBase.handleRequestBody(ContentStreamHandlerBase.java:74)
   [junit4]   2> 		at org.apache.solr.handler.RequestHandlerBase.handleRequest(RequestHandlerBase.java:129)
   [junit4]   2> 		at org.apache.solr.core.SolrCore.execute(SolrCore.java:1555)
   [junit4]   2> 		at org.apache.solr.servlet.DirectSolrConnection.request(DirectSolrConnection.java:131)
   [junit4]   2> 		at org.apache.solr.util.TestHarness.update(TestHarness.java:256)
   [junit4]   2> 		at org.apache.solr.util.TestHarness.checkUpdateStatus(TestHarness.java:304)
   [junit4]   2> 		at org.apache.solr.util.TestHarness.validateUpdate(TestHarness.java:274)
   [junit4]   2> 		at org.apache.solr.SolrTestCaseJ4.checkUpdateU(SolrTestCaseJ4.java:408)
   [junit4]   2> 		at org.apache.solr.SolrTestCaseJ4.assertU(SolrTestCaseJ4.java:387)
   [junit4]   2> 		at org.apache.solr.SolrTestCaseJ4.assertU(SolrTestCaseJ4.java:381)
   [junit4]   2> 		at org.apache.solr.SolrTestCaseJ4.clearIndex(SolrTestCaseJ4.java:753)
   [junit4]   2> 		at org.apache.solr.handler.dataimport.TestSqlEntityProcessorDelta2.setUp(TestSqlEntityProcessorDelta2.java:68)
   [junit4]   2> 		at sun.reflect.NativeMethodAccessorImpl.invoke0(Native Method)
   [junit4]   2> 		at sun.reflect.NativeMethodAccessorImpl.invoke(NativeMethodAccessorImpl.java:57)
   [junit4]   2> 		at sun.reflect.DelegatingMethodAccessorImpl.invoke(DelegatingMethodAccessorImpl.java:43)
   [junit4]   2> 		at java.lang.reflect.Method.invoke(Method.java:601)
   [junit4]   2> 		at com.carrotsearch.randomizedtesting.RandomizedRunner.invoke(RandomizedRunner.java:1969)
   [junit4]   2> 		at com.carrotsearch.randomizedtesting.RandomizedRunner.access$1100(RandomizedRunner.java:132)
   [junit4]   2> 		at com.carrotsearch.randomizedtesting.RandomizedRunner$7.evaluate(RandomizedRunner.java:873)
   [junit4]   2> 		at com.carrotsearch.randomizedtesting.RandomizedRunner$8.evaluate(RandomizedRunner.java:889)
   [junit4]   2> 		at com.carrotsearch.randomizedtesting.rules.SystemPropertiesRestoreRule$1.evaluate(SystemPropertiesRestoreRule.java:53)
   [junit4]   2> 		at org.apache.lucene.util.TestRuleSetupTeardownChained$1.evaluate(TestRuleSetupTeardownChained.java:50)
   [junit4]   2> 		at org.apache.lucene.util.TestRuleFieldCacheSanity$1.evaluate(TestRuleFieldCacheSanity.java:32)
   [junit4]   2> 		at org.apache.lucene.util.AbstractBeforeAfterRule$1.evaluate(AbstractBeforeAfterRule.java:45)
   [junit4]   2> 		at com.carrotsearch.randomizedtesting.rules.SystemPropertiesInvariantRule$1.evaluate(SystemPropertiesInvariantRule.java:55)
   [junit4]   2> 		at org.apache.lucene.util.TestRuleReportUncaughtExceptions$1.evaluate(TestRuleReportUncaughtExceptions.java:68)
   [junit4]   2> 		at org.apache.lucene.util.TestRuleThreadAndTestName$1.evaluate(TestRuleThreadAndTestName.java:48)
   [junit4]   2> 		at org.apache.lucene.util.TestRuleMarkFailure$1.evaluate(TestRuleMarkFailure.java:48)
   [junit4]   2> 		at com.carrotsearch.randomizedtesting.RandomizedRunner.runSingleTest(RandomizedRunner.java:821)
   [junit4]   2> 		at com.carrotsearch.randomizedtesting.RandomizedRunner.access$700(RandomizedRunner.java:132)
   [junit4]   2> 		at com.carrotsearch.randomizedtesting.RandomizedRunner$3$1.run(RandomizedRunner.java:669)
   [junit4]   2> 		at com.carrotsearch.randomizedtesting.RandomizedRunner$3.evaluate(RandomizedRunner.java:695)
   [junit4]   2> 		at com.carrotsearch.randomizedtesting.RandomizedRunner$4.evaluate(RandomizedRunner.java:734)
   [junit4]   2> 		at com.carrotsearch.randomizedtesting.RandomizedRunner$5.evaluate(RandomizedRunner.java:745)
   [junit4]   2> 		at com.carrotsearch.randomizedtesting.rules.SystemPropertiesRestoreRule$1.evaluate(SystemPropertiesRestoreRule.java:53)
   [junit4]   2> 		at org.apache.lucene.util.AbstractBeforeAfterRule$1.evaluate(AbstractBeforeAfterRule.java:45)
   [junit4]   2> 		at org.apache.lucene.util.TestRuleReportUncaughtExceptions$1.evaluate(TestRuleReportUncaughtExceptions.java:68)
   [junit4]   2> 		at org.apache.lucene.util.TestRuleStoreClassName$1.evaluate(TestRuleStoreClassName.java:38)
   [junit4]   2> 		at org.apache.lucene.util.TestRuleIcuHack$1.evaluate(TestRuleIcuHack.java:51)
   [junit4]   2> 		at com.carrotsearch.randomizedtesting.rules.SystemPropertiesInvariantRule$1.evaluate(SystemPropertiesInvariantRule.java:55)
   [junit4]   2> 		at org.apache.lucene.util.TestRuleNoInstanceHooksOverrides$1.evaluate(TestRuleNoInstanceHooksOverrides.java:53)
   [junit4]   2> 		at org.apache.lucene.util.TestRuleNoStaticHooksShadowing$1.evaluate(TestRuleNoStaticHooksShadowing.java:52)
   [junit4]   2> 		at org.apache.lucene.util.TestRuleAssertionsRequired$1.evaluate(TestRuleAssertionsRequired.java:36)
   [junit4]   2> 		at org.apache.lucene.util.TestRuleMarkFailure$1.evaluate(TestRuleMarkFailure.java:48)
   [junit4]   2> 		at org.apache.lucene.util.TestRuleIgnoreTestSuites$1.evaluate(TestRuleIgnoreTestSuites.java:56)
   [junit4]   2> 		at com.carrotsearch.randomizedtesting.RandomizedRunner.runSuite(RandomizedRunner.java:605)
   [junit4]   2> 		at com.carrotsearch.randomizedtesting.RandomizedRunner.access$400(RandomizedRunner.java:132)
   [junit4]   2> 		at com.carrotsearch.randomizedtesting.RandomizedRunner$2.run(RandomizedRunner.java:551)
   [junit4]   2> 	
   [junit4]   2> NOTE: reproduce with: ant test -Dtestcase=TestSqlEntityProcessorDelta2
-Dtests.method=testCompositePk_DeltaImport_replace_delete -Dtests.seed=50074E0E5BCCA2F3 -Dtests.locale=ar_SY
-Dtests.timezone=America/Jujuy -Dtests.multiplier=3 -Dargs="-Dfile.encoding=UTF-8"
   [junit4]   2>
   [junit4]    > (@AfterClass output)
   [junit4]   2> 564 T81 oasu.DefaultSolrCoreState.decref SEVERE Error during shutdown
of writer. java.lang.IllegalArgumentException: Unknown directory: MockDirWrapper(org.apache.lucene.store.RAMDirectory@68970cbc
lockFactory=org.apache.lucene.store.NativeFSLockFactory@21ff8346) {MockDirWrapper(org.apache.lucene.store.RAMDirectory@737b6ad4
lockFactory=org.apache.lucene.store.NativeFSLockFactory@49cc4e72)=org.apache.solr.core.CachingDirectoryFactory$CacheValue@407ec20c}
   [junit4]   2> 	at org.apache.solr.core.CachingDirectoryFactory.close(CachingDirectoryFactory.java:77)
   [junit4]   2> 	at org.apache.solr.core.CachingDirectoryFactory.release(CachingDirectoryFactory.java:184)
   [junit4]   2> 	at org.apache.solr.update.SolrIndexWriter.close(SolrIndexWriter.java:131)
   [junit4]   2> 	at org.apache.solr.update.DirectUpdateHandler2.closeWriter(DirectUpdateHandler2.java:613)
   [junit4]   2> 	at org.apache.solr.update.DefaultSolrCoreState.decref(DefaultSolrCoreState.java:73)
   [junit4]   2> 	at org.apache.solr.update.DirectUpdateHandler2.close(DirectUpdateHandler2.java:542)
   [junit4]   2> 	at org.apache.solr.core.SolrCore.close(SolrCore.java:773)
   [junit4]   2> 	at org.apache.solr.core.CoreContainer.shutdown(CoreContainer.java:563)
   [junit4]   2> 	at org.apache.solr.util.TestHarness.close(TestHarness.java:434)
   [junit4]   2> 	at org.apache.solr.SolrTestCaseJ4.deleteCore(SolrTestCaseJ4.java:354)
   [junit4]   2> 	at org.apache.solr.SolrTestCaseJ4.afterClass(SolrTestCaseJ4.java:80)
   [junit4]   2> 	at sun.reflect.NativeMethodAccessorImpl.invoke0(Native Method)
   [junit4]   2> 	at sun.reflect.NativeMethodAccessorImpl.invoke(NativeMethodAccessorImpl.java:57)
   [junit4]   2> 	at sun.reflect.DelegatingMethodAccessorImpl.invoke(DelegatingMethodAccessorImpl.java:43)
   [junit4]   2> 	at java.lang.reflect.Method.invoke(Method.java:601)
   [junit4]   2> 	at com.carrotsearch.randomizedtesting.RandomizedRunner.invoke(RandomizedRunner.java:1969)
   [junit4]   2> 	at com.carrotsearch.randomizedtesting.RandomizedRunner.access$1100(RandomizedRunner.java:132)
   [junit4]   2> 	at com.carrotsearch.randomizedtesting.RandomizedRunner$5.evaluate(RandomizedRunner.java:752)
   [junit4]   2> 	at com.carrotsearch.randomizedtesting.rules.SystemPropertiesRestoreRule$1.evaluate(SystemPropertiesRestoreRule.java:53)
   [junit4]   2> 	at org.apache.lucene.util.AbstractBeforeAfterRule$1.evaluate(AbstractBeforeAfterRule.java:45)
   [junit4]   2> 	at org.apache.lucene.util.TestRuleReportUncaughtExceptions$1.evaluate(TestRuleReportUncaughtExceptions.java:68)
   [junit4]   2> 	at org.apache.lucene.util.TestRuleStoreClassName$1.evaluate(TestRuleStoreClassName.java:38)
   [junit4]   2> 	at org.apache.lucene.util.TestRuleIcuHack$1.evaluate(TestRuleIcuHack.java:51)
   [junit4]   2> 	at com.carrotsearch.randomizedtesting.rules.SystemPropertiesInvariantRule$1.evaluate(SystemPropertiesInvariantRule.java:55)
   [junit4]   2> 	at org.apache.lucene.util.TestRuleNoInstanceHooksOverrides$1.evaluate(TestRuleNoInstanceHooksOverrides.java:53)
   [junit4]   2> 	at org.apache.lucene.util.TestRuleNoStaticHooksShadowing$1.evaluate(TestRuleNoStaticHooksShadowing.java:52)
   [junit4]   2> 	at org.apache.lucene.util.TestRuleAssertionsRequired$1.evaluate(TestRuleAssertionsRequired.java:36)
   [junit4]   2> 	at org.apache.lucene.util.TestRuleMarkFailure$1.evaluate(TestRuleMarkFailure.java:48)
   [junit4]   2> 	at org.apache.lucene.util.TestRuleIgnoreTestSuites$1.evaluate(TestRuleIgnoreTestSuites.java:56)
   [junit4]   2> 	at com.carrotsearch.randomizedtesting.RandomizedRunner.runSuite(RandomizedRunner.java:605)
   [junit4]   2> 	at com.carrotsearch.randomizedtesting.RandomizedRunner.access$400(RandomizedRunner.java:132)
   [junit4]   2> 	at com.carrotsearch.randomizedtesting.RandomizedRunner$2.run(RandomizedRunner.java:551)
   [junit4]   2> 
   [junit4]   2> NOTE: test params are: codec=Lucene40, sim=RandomSimilarityProvider(queryNorm=false,coord=true):
{}, locale=ar_SY, timezone=America/Jujuy
   [junit4]   2> NOTE: Linux 2.6.32-41-server amd64/Oracle Corporation 1.7.0_04 (64-bit)/cpus=8,threads=1,free=57634216,total=131072000
   [junit4]   2> NOTE: All tests run in this JVM: [TestDIHEndToEnd, TestSolrEntityProcessorEndToEnd,
TestSqlEntityProcessorDelta2]
   [junit4]   2> 
   [junit4] Completed on J0 in 0.62s, 8 tests, 6 errors <<< FAILURES!
   [junit4]  
   [junit4] Suite: org.apache.solr.handler.dataimport.TestScriptTransformer
   [junit4] Completed on J0 in 0.13s, 4 tests
   [junit4]  
   [junit4] Suite: org.apache.solr.handler.dataimport.TestSqlEntityProcessorDelta
   [junit4] Completed on J1 in 0.91s, 9 tests
   [junit4]  
   [junit4] Suite: org.apache.solr.handler.dataimport.TestDocBuilder
   [junit4] Completed on J0 in 0.07s, 6 tests
   [junit4]  
   [junit4] Suite: org.apache.solr.handler.dataimport.TestClobTransformer
   [junit4] Completed on J1 in 0.02s, 1 test
   [junit4]  
   [junit4] Suite: org.apache.solr.handler.dataimport.TestNumberFormatTransformer
   [junit4] Completed on J0 in 0.07s, 9 tests
   [junit4]  
   [junit4] Suite: org.apache.solr.handler.dataimport.TestSqlEntityProcessorDeltaPrefixedPk
   [junit4] Completed on J1 in 0.40s, 3 tests
   [junit4]  
   [junit4] Suite: org.apache.solr.handler.dataimport.TestSolrEntityProcessorUnit
   [junit4] Completed on J0 in 0.03s, 3 tests
   [junit4]  
   [junit4] Suite: org.apache.solr.handler.dataimport.TestDocBuilder2
   [junit4] IGNORED 0.00s J1 | TestDocBuilder2.testFileListEntityProcessor_lastIndexTime
   [junit4]    > Cause: Annotated @Ignore(Known Locale/TZ problems: see https://issues.apache.org/jira/browse/SOLR-1916)
   [junit4] Completed on J1 in 0.44s, 11 tests, 1 skipped
   [junit4]  
   [junit4] Suite: org.apache.solr.handler.dataimport.TestRegexTransformer
   [junit4] Completed on J1 in 0.03s, 5 tests
   [junit4]  
   [junit4] Suite: org.apache.solr.handler.dataimport.TestJdbcDataSource
   [junit4] IGNORED 0.00s J1 | TestJdbcDataSource.testBasic
   [junit4]    > Cause: Annotated @Ignore(Needs a Mock database server to work)
   [junit4] Completed on J1 in 0.08s, 4 tests, 1 skipped
   [junit4]  
   [junit4] Suite: org.apache.solr.handler.dataimport.TestSqlEntityProcessor
   [junit4] Completed on J0 in 0.04s, 4 tests
   [junit4]  
   [junit4] Suite: org.apache.solr.handler.dataimport.TestXPathRecordReader
   [junit4] Completed on J1 in 0.17s, 22 tests
   [junit4]  
   [junit4] Suite: org.apache.solr.handler.dataimport.TestTemplateTransformer
   [junit4] Completed on J1 in 0.01s, 1 test
   [junit4]  
   [junit4] Suite: org.apache.solr.handler.dataimport.TestFileListEntityProcessor
   [junit4] IGNORED 0.00s J1 | TestFileListEntityProcessor.testNTOT
   [junit4]    > Cause: Annotated @Ignore(Known Locale/TZ problems: see https://issues.apache.org/jira/browse/SOLR-1916)
   [junit4] Completed on J1 in 0.02s, 4 tests, 1 skipped
   [junit4]  
   [junit4] Suite: org.apache.solr.handler.dataimport.TestPlainTextEntityProcessor
   [junit4] Completed on J1 in 0.01s, 1 test
   [junit4]  
   [junit4] Suite: org.apache.solr.handler.dataimport.TestDateFormatTransformer
   [junit4] Completed on J1 in 0.02s, 2 tests
   [junit4]  
   [junit4] Suite: org.apache.solr.handler.dataimport.TestEvaluatorBag
   [junit4] IGNORED 0.00s J0 | TestEvaluatorBag.testGetDateFormatEvaluator
   [junit4]    > Cause: Annotated @Ignore(Known Locale/TZ problems: see https://issues.apache.org/jira/browse/SOLR-1916)
   [junit4] Completed on J0 in 0.03s, 5 tests, 1 skipped
   [junit4]  
   [junit4] Suite: org.apache.solr.handler.dataimport.TestTemplateString
   [junit4] Completed on J1 in 0.01s, 1 test
   [junit4]  
   [junit4] JVM J0:     0.60 ..    10.46 =     9.86s
   [junit4] JVM J1:     0.60 ..    10.69 =    10.08s
   [junit4] Execution time total: 10 seconds
   [junit4] Tests summary: 36 suites, 167 tests, 6 errors, 5 ignored

BUILD FAILED
/mnt/ssd/jenkins/workspace/Lucene-Solr-tests-only-trunk-java7/checkout/build.xml:29: The following
error occurred while executing this line:
/mnt/ssd/jenkins/workspace/Lucene-Solr-tests-only-trunk-java7/checkout/solr/build.xml:163:
The following error occurred while executing this line:
/mnt/ssd/jenkins/workspace/Lucene-Solr-tests-only-trunk-java7/checkout/solr/common-build.xml:358:
The following error occurred while executing this line:
/mnt/ssd/jenkins/workspace/Lucene-Solr-tests-only-trunk-java7/checkout/lucene/module-build.xml:62:
The following error occurred while executing this line:
/mnt/ssd/jenkins/workspace/Lucene-Solr-tests-only-trunk-java7/checkout/lucene/common-build.xml:1019:
The following error occurred while executing this line:
/mnt/ssd/jenkins/workspace/Lucene-Solr-tests-only-trunk-java7/checkout/lucene/common-build.xml:745:
There were test failures: 36 suites, 167 tests, 6 errors, 5 ignored

Total time: 26 minutes 34 seconds
Build step 'Execute shell' marked build as failure
Archiving artifacts
Recording test results

---------------------------------------------------------------------
To unsubscribe, e-mail: dev-unsubscribe@lucene.apache.org
For additional commands, e-mail: dev-help@lucene.apache.org


Mime
View raw message