lucene-dev mailing list archives

Site index · List index
Message view « Date » · « Thread »
Top « Date » · « Thread »
From jenk...@sd-datasolutions.de
Subject Build failed in Jenkins: Windows-Lucene-Solr-tests-only-trunk #19
Date Wed, 16 May 2012 18:30:24 GMT
See <http://jenkins.sd-datasolutions.de/job/Windows-Lucene-Solr-tests-only-trunk/19/>

------------------------------------------
[...truncated 10038 lines...]
   [junit4]  
   [junit4] Suite: org.apache.solr.search.TestSort
   [junit4] Completed in 4.24s, 2 tests
   [junit4]  
   [junit4] Suite: org.apache.solr.search.TestFiltering
   [junit4] Completed in 4.04s, 2 tests
   [junit4]  
   [junit4] Suite: org.apache.solr.TestTrie
   [junit4] Completed in 1.51s, 8 tests
   [junit4]  
   [junit4] Suite: org.apache.solr.core.SolrCoreTest
   [junit4] Completed in 5.62s, 5 tests
   [junit4]  
   [junit4] Suite: org.apache.solr.update.SolrCmdDistributorTest
   [junit4] Completed in 1.96s, 1 test
   [junit4]  
   [junit4] Suite: org.apache.solr.spelling.IndexBasedSpellCheckerTest
   [junit4] Completed in 1.33s, 5 tests
   [junit4]  
   [junit4] Suite: org.apache.solr.request.TestWriterPerf
   [junit4] Completed in 1.20s, 1 test
   [junit4]  
   [junit4] Suite: org.apache.solr.handler.component.TermsComponentTest
   [junit4] Completed in 1.21s, 13 tests
   [junit4]  
   [junit4] Suite: org.apache.solr.search.function.SortByFunctionTest
   [junit4] Completed in 2.10s, 2 tests
   [junit4]  
   [junit4] Suite: org.apache.solr.update.DocumentBuilderTest
   [junit4] Completed in 0.94s, 11 tests
   [junit4]  
   [junit4] Suite: org.apache.solr.request.TestBinaryResponseWriter
   [junit4] Completed in 1.51s, 2 tests
   [junit4]  
   [junit4] Suite: org.apache.solr.core.SolrCoreCheckLockOnStartupTest
   [junit4] Completed in 1.49s, 2 tests
   [junit4]  
   [junit4] Suite: org.apache.solr.spelling.suggest.SuggesterWFSTTest
   [junit4] Completed in 1.13s, 4 tests
   [junit4]  
   [junit4] Suite: org.apache.solr.core.TestSolrDeletionPolicy1
   [junit4]    > (@BeforeClass output)
   [junit4]   2> Creating dataDir: <http://jenkins.sd-datasolutions.de/job/Windows-Lucene-Solr-tests-only-trunk/ws/solr\build\solr-core\test\J0\.\solrtest-TestSolrDeletionPolicy1-1337192983032>
   [junit4]   2> 
   [junit4] FAILURE 0.20s | TestSolrDeletionPolicy1.testCommitAge
   [junit4]    > Throwable #1: java.lang.AssertionError
   [junit4]    > 	at __randomizedtesting.SeedInfo.seed([B376B350D5784EFA:6C82DCC94211BFA]:0)
   [junit4]    > 	at org.junit.Assert.fail(Assert.java:92)
   [junit4]    > 	at org.junit.Assert.assertTrue(Assert.java:43)
   [junit4]    > 	at org.junit.Assert.assertTrue(Assert.java:54)
   [junit4]    > 	at org.apache.solr.core.TestSolrDeletionPolicy1.testCommitAge(TestSolrDeletionPolicy1.java:129)
   [junit4]    > 	at sun.reflect.NativeMethodAccessorImpl.invoke0(Native Method)
   [junit4]    > 	at sun.reflect.NativeMethodAccessorImpl.invoke(NativeMethodAccessorImpl.java:39)
   [junit4]    > 	at sun.reflect.DelegatingMethodAccessorImpl.invoke(DelegatingMethodAccessorImpl.java:25)
   [junit4]    > 	at java.lang.reflect.Method.invoke(Method.java:597)
   [junit4]    > 	at com.carrotsearch.randomizedtesting.RandomizedRunner.invoke(RandomizedRunner.java:1969)
   [junit4]    > 	at com.carrotsearch.randomizedtesting.RandomizedRunner.access$1100(RandomizedRunner.java:132)
   [junit4]    > 	at com.carrotsearch.randomizedtesting.RandomizedRunner$6.evaluate(RandomizedRunner.java:814)
   [junit4]    > 	at com.carrotsearch.randomizedtesting.RandomizedRunner$7.evaluate(RandomizedRunner.java:875)
   [junit4]    > 	at com.carrotsearch.randomizedtesting.RandomizedRunner$8.evaluate(RandomizedRunner.java:889)
   [junit4]    > 	at com.carrotsearch.randomizedtesting.rules.SystemPropertiesRestoreRule$1.evaluate(SystemPropertiesRestoreRule.java:53)
   [junit4]    > 	at org.apache.lucene.util.TestRuleSetupTeardownChained$1.evaluate(TestRuleSetupTeardownChained.java:50)
   [junit4]    > 	at org.apache.lucene.util.TestRuleFieldCacheSanity$1.evaluate(TestRuleFieldCacheSanity.java:32)
   [junit4]    > 	at org.apache.lucene.util.AbstractBeforeAfterRule$1.evaluate(AbstractBeforeAfterRule.java:45)
   [junit4]    > 	at com.carrotsearch.randomizedtesting.rules.SystemPropertiesInvariantRule$1.evaluate(SystemPropertiesInvariantRule.java:55)
   [junit4]    > 	at org.apache.lucene.util.TestRuleReportUncaughtExceptions$1.evaluate(TestRuleReportUncaughtExceptions.java:68)
   [junit4]    > 	at org.apache.lucene.util.TestRuleThreadAndTestName$1.evaluate(TestRuleThreadAndTestName.java:48)
   [junit4]    > 	at org.apache.lucene.util.TestRuleMarkFailure$1.evaluate(TestRuleMarkFailure.java:48)
   [junit4]    > 	at com.carrotsearch.randomizedtesting.RandomizedRunner.runSingleTest(RandomizedRunner.java:821)
   [junit4]    > 	at com.carrotsearch.randomizedtesting.RandomizedRunner.access$700(RandomizedRunner.java:132)
   [junit4]    > 	at com.carrotsearch.randomizedtesting.RandomizedRunner$3$1.run(RandomizedRunner.java:669)
   [junit4]    > 	at com.carrotsearch.randomizedtesting.RandomizedRunner$3.evaluate(RandomizedRunner.java:695)
   [junit4]    > 	at com.carrotsearch.randomizedtesting.RandomizedRunner$4.evaluate(RandomizedRunner.java:734)
   [junit4]    > 	at com.carrotsearch.randomizedtesting.RandomizedRunner$5.evaluate(RandomizedRunner.java:745)
   [junit4]    > 	at com.carrotsearch.randomizedtesting.rules.SystemPropertiesRestoreRule$1.evaluate(SystemPropertiesRestoreRule.java:53)
   [junit4]    > 	at org.apache.lucene.util.AbstractBeforeAfterRule$1.evaluate(AbstractBeforeAfterRule.java:45)
   [junit4]    > 	at org.apache.lucene.util.TestRuleReportUncaughtExceptions$1.evaluate(TestRuleReportUncaughtExceptions.java:68)
   [junit4]    > 	at org.apache.lucene.util.TestRuleStoreClassName$1.evaluate(TestRuleStoreClassName.java:38)
   [junit4]    > 	at org.apache.lucene.util.TestRuleIcuHack$1.evaluate(TestRuleIcuHack.java:51)
   [junit4]    > 	at com.carrotsearch.randomizedtesting.rules.SystemPropertiesInvariantRule$1.evaluate(SystemPropertiesInvariantRule.java:55)
   [junit4]    > 	at org.apache.lucene.util.TestRuleNoInstanceHooksOverrides$1.evaluate(TestRuleNoInstanceHooksOverrides.java:53)
   [junit4]    > 	at org.apache.lucene.util.TestRuleNoStaticHooksShadowing$1.evaluate(TestRuleNoStaticHooksShadowing.java:52)
   [junit4]    > 	at org.apache.lucene.util.TestRuleAssertionsRequired$1.evaluate(TestRuleAssertionsRequired.java:36)
   [junit4]    > 	at org.apache.lucene.util.TestRuleMarkFailure$1.evaluate(TestRuleMarkFailure.java:48)
   [junit4]    > 	at com.carrotsearch.randomizedtesting.RandomizedRunner.runSuite(RandomizedRunner.java:605)
   [junit4]    > 	at com.carrotsearch.randomizedtesting.RandomizedRunner.access$400(RandomizedRunner.java:132)
   [junit4]    > 	at com.carrotsearch.randomizedtesting.RandomizedRunner$2.run(RandomizedRunner.java:551)
   [junit4]    > 
   [junit4]   2> NOTE: reproduce with: ant test -Dtestcase=TestSolrDeletionPolicy1 -Dtests.method=testCommitAge
-Dtests.seed=B376B350D5784EFA -Dtests.locale=tr -Dtests.timezone=Europe/Istanbul -Dargs="-Dfile.encoding=Cp1252"
   [junit4]   2>
   [junit4]    > (@AfterClass output)
   [junit4]   2> NOTE: test params are: codec=Lucene40, sim=RandomSimilarityProvider(queryNorm=false,coord=false):
{}, locale=tr, timezone=Europe/Istanbul
   [junit4]   2> NOTE: Windows 7 6.1 amd64/Sun Microsystems Inc. 1.6.0_32 (64-bit)/cpus=2,threads=1,free=167013520,total=210370560
   [junit4]   2> NOTE: All tests run in this JVM: [TestKeepFilterFactory, TestGermanLightStemFilterFactory,
TestRealTimeGet, TestDistributedSearch, TestBulgarianStemFilterFactory, OverseerTest, TestPatternTokenizerFactory,
SolrInfoMBeanTest, BasicDistributedZkTest, StandardRequestHandlerTest, UUIDFieldTest, DistributedQueryElevationComponentTest,
TestPseudoReturnFields, TestElisionFilterFactory, DistanceFunctionTest, TestGalicianStemFilterFactory,
TestValueSourceCache, TestExtendedDismaxParser, TestLatvianStemFilterFactory, LoggingHandlerTest,
TestIBSimilarityFactory, ResourceLoaderTest, TestHashPartitioner, TestMappingCharFilterFactory,
TestGreekLowerCaseFilterFactory, TestSolrCoreProperties, TestNorwegianMinimalStemFilterFactory,
RequiredFieldsTest, DirectUpdateHandlerOptimizeTest, TestArabicFilters, TestCJKBigramFilterFactory,
SuggesterTSTTest, TestSlowSynonymFilter, TestPluginEnable, TestSynonymFilterFactory, SearchHandlerTest,
PluginInfoTest, OpenExchangeRatesOrgProviderTest, SpatialFilterTest, TestCoreContainer, TestRussianLightStemFilterFactory,
UpdateParamsTest, TestBM25SimilarityFactory, TestCodecSupport, TestCJKTokenizerFactory, BadIndexSchemaTest,
TestDelimitedPayloadTokenFilterFactory, TestLuceneMatchVersion, TestPropInject, CloudStateTest,
TestPerFieldSimilarity, HighlighterTest, TestLMDirichletSimilarityFactory, CommonGramsQueryFilterFactoryTest,
TestChineseTokenizerFactory, BasicFunctionalityTest, CacheHeaderTest, TestKeywordMarkerFilterFactory,
TestReverseStringFilterFactory, TestHunspellStemFilterFactory, DirectSolrConnectionTest, SOLR749Test,
SimpleFacetsTest, TestCJKWidthFilterFactory, CloudStateUpdateTest, LegacyHTMLStripCharFilterTest,
TestReversedWildcardFilterFactory, TestBinaryField, TestRangeQuery, TestPhraseSuggestions,
TestIrishLowerCaseFilterFactory, TestSolrDeletionPolicy2, ZkControllerTest, TestJoin, TestIndonesianStemFilterFactory,
ShowFileRequestHandlerTest, StatsComponentTest, IndexReaderFactoryTest, TestCollationKeyFilterFactory,
TestCollationKeyRangeQueries, TestSolrQueryParser, SuggesterTest, URLClassifyProcessorTest,
FileBasedSpellCheckerTest, TestUtils, TestFunctionQuery, TestLRUCache, SpellCheckComponentTest,
SpellCheckCollatorTest, TestRemoteStreaming, NoCacheHeaderTest, TestQuerySenderNoQuery, TestGermanNormalizationFilterFactory,
TestJapanesePartOfSpeechStopFilterFactory, TestCzechStemFilterFactory, SuggesterFSTTest, TestHTMLStripCharFilterFactory,
CSVRequestHandlerTest, AutoCommitTest, UniqFieldsUpdateProcessorFactoryTest, FieldMutatingUpdateProcessorTest,
TestOmitPositions, BasicZkTest, TestGroupingSearch, QueryElevationComponentTest, PrimUtilsTest,
NumericFieldsTest, DisMaxRequestHandlerTest, TestSpanishLightStemFilterFactory, TestGermanStemFilterFactory,
TestStopFilterFactory, TestRemoveDuplicatesTokenFilterFactory, FileUtilsTest, TestItalianLightStemFilterFactory,
SolrPluginUtilsTest, TestPHPSerializedResponseWriter, SpellingQueryConverterTest, TestPortugueseMinimalStemFilterFactory,
SnowballPorterFilterFactoryTest, TestBrazilianStemFilterFactory, DirectSolrSpellCheckerTest,
EchoParamsTest, TimeZoneUtilsTest, TestIndexingPerformance, TestLMJelinekMercerSimilarityFactory,
TestJapaneseBaseFormFilterFactory, CopyFieldTest, DistributedTermsComponentTest, TestFoldingMultitermQuery,
TestTrimFilterFactory, TestPhoneticFilterFactory, TestCapitalizationFilterFactory, TestSurroundQueryParser,
TestQuerySenderListener, IndexSchemaTest, LukeRequestHandlerTest, TestQueryTypes, TestPatternReplaceFilterFactory,
DOMUtilTest, TestNumberUtils, SoftAutoCommitTest, PolyFieldTest, TestSynonymMap, TestPortugueseLightStemFilterFactory,
TestTurkishLowerCaseFilterFactory, BadComponentTest, NotRequiredUniqueKeyTest, XsltUpdateRequestHandlerTest,
TestUAX29URLEmailTokenizerFactory, DateMathParserTest, CurrencyFieldTest, TestDFRSimilarityFactory,
PingRequestHandlerTest, PrimitiveFieldTypeTest, TestUpdate, SolrIndexConfigTest, DistributedSpellCheckComponentTest,
SignatureUpdateProcessorFactoryTest, ConvertedLegacyTest, TestWordDelimiterFilterFactory,
TestJapaneseTokenizerFactory, TestFastLRUCache, FieldAnalysisRequestHandlerTest, RAMDirectoryFactoryTest,
DirectUpdateHandlerTest, TestReplicationHandler, TermVectorComponentTest, SolrRequestParserTest,
TestStandardFactories, TestGalicianMinimalStemFilterFactory, TestDocSet, XmlUpdateRequestHandlerTest,
ZkNodePropsTest, TestCSVResponseWriter, TestSystemIdResolver, TestIndexSearcher, TestHindiFilters,
TestJmxIntegration, TestHyphenationCompoundWordTokenFilterFactory, UpdateRequestProcessorFactoryTest,
TestWikipediaTokenizerFactory, TestShingleFilterFactory, FastVectorHighlighterTest, OutputWriterTest,
TestChineseFilterFactory, TestArbitraryIndexDir, MoreLikeThisHandlerTest, TestEnglishMinimalStemFilterFactory,
TestCSVLoader, TestDefaultSimilarityFactory, IndexSchemaRuntimeFieldTest, SampleTest, TestSearchPerf,
TestXIncludeConfig, CommonGramsFilterFactoryTest, DocumentAnalysisRequestHandlerTest, CoreAdminHandlerTest,
TestNGramFilters, BinaryUpdateRequestHandlerTest, TestPatternReplaceCharFilterFactory, DateFieldTest,
RequestHandlersTest, ReturnFieldsTest, TestLFUCache, TestQueryUtils, FullSolrCloudDistribCmdsTest,
LeaderElectionTest, RecoveryZkTest, LeaderElectionIntegrationTest, NodeStateWatcherTest, ZkSolrClientTest,
TestDistributedGrouping, TestRecovery, TestFaceting, TestMultiCoreConfBootstrap, PeerSyncTest,
TestSort, TestFiltering, TestTrie, SolrCoreTest, SolrCmdDistributorTest, IndexBasedSpellCheckerTest,
TestWriterPerf, TermsComponentTest, SortByFunctionTest, DocumentBuilderTest, TestBinaryResponseWriter,
SolrCoreCheckLockOnStartupTest, SuggesterWFSTTest, TestSolrDeletionPolicy1]
   [junit4]   2> 
   [junit4] Completed in 1.11s, 3 tests, 1 failure <<< FAILURES!
   [junit4]  
   [junit4] Suite: org.apache.solr.internal.csv.CSVPrinterTest
   [junit4] Completed in 0.38s, 6 tests
   [junit4]  
   [junit4] Suite: org.apache.solr.handler.component.DebugComponentTest
   [junit4] Completed in 0.89s, 2 tests
   [junit4]  
   [junit4] Suite: org.apache.solr.handler.JsonLoaderTest
   [junit4] Completed in 0.75s, 5 tests
   [junit4]  
   [junit4] Suite: org.apache.solr.highlight.HighlighterConfigTest
   [junit4] Completed in 0.64s, 1 test
   [junit4]  
   [junit4] Suite: org.apache.solr.request.JSONWriterTest
   [junit4] Completed in 0.68s, 3 tests
   [junit4]  
   [junit4] Suite: org.apache.solr.schema.TestCollationField
   [junit4] Completed in 0.35s, 8 tests
   [junit4]  
   [junit4] Suite: org.apache.solr.core.TestPropInjectDefaults
   [junit4] Completed in 0.63s, 2 tests
   [junit4]  
   [junit4] Suite: org.apache.solr.search.QueryParsingTest
   [junit4] Completed in 0.69s, 3 tests
   [junit4]  
   [junit4] Suite: org.apache.solr.core.AlternateDirectoryTest
   [junit4] Completed in 0.65s, 1 test
   [junit4]  
   [junit4] Suite: org.apache.solr.handler.admin.MBeansHandlerTest
   [junit4] Completed in 0.69s, 1 test
   [junit4]  
   [junit4] Suite: org.apache.solr.schema.MultiTermTest
   [junit4] Completed in 0.34s, 3 tests
   [junit4]  
   [junit4] Suite: org.apache.solr.core.TestMergePolicyConfig
   [junit4] Completed in 0.63s, 1 test
   [junit4]  
   [junit4] Suite: org.apache.solr.analysis.TestBeiderMorseFilterFactory
   [junit4] Completed in 0.27s, 3 tests
   [junit4]  
   [junit4] Suite: org.apache.solr.core.TestJmxMonitoredMap
   [junit4] Completed in 0.13s, 2 tests
   [junit4]  
   [junit4] Suite: org.apache.solr.MinimalSchemaTest
   [junit4] Completed in 0.27s, 3 tests
   [junit4]  
   [junit4] Suite: org.apache.solr.analysis.TestKStemFilterFactory
   [junit4] Completed in 0.13s, 1 test
   [junit4]  
   [junit4] Suite: org.apache.solr.core.TestConfig
   [junit4] Completed in 0.35s, 8 tests
   [junit4]  
   [junit4] Suite: org.apache.solr.core.TestSolrXMLSerializer
   [junit4] Completed in 0.02s, 1 test
   [junit4]  
   [junit4] Suite: org.apache.solr.spelling.SpellPossibilityIteratorTest
   [junit4] Completed in 0.06s, 2 tests
   [junit4]  
   [junit4] Suite: org.apache.solr.analysis.TestThaiWordFilterFactory
   [junit4] Completed in 0.03s, 1 test
   [junit4]  
   [junit4] Suite: org.apache.solr.internal.csv.CSVStrategyTest
   [junit4] Completed in 0.01s, 5 tests
   [junit4]  
   [junit4] Suite: org.apache.solr.internal.csv.CharBufferTest
   [junit4] Completed in 0.02s, 13 tests
   [junit4]  
   [junit4] Suite: org.apache.solr.analysis.TestPortugueseStemFilterFactory
   [junit4] Completed in 0.01s, 1 test
   [junit4]  
   [junit4] Suite: org.apache.solr.analysis.TestMultiWordSynonyms
   [junit4] Completed in 0.02s, 2 tests
   [junit4]  
   [junit4] Suite: org.apache.solr.analysis.DoubleMetaphoneFilterFactoryTest
   [junit4] Completed in 0.01s, 3 tests
   [junit4]  
   [junit4] Suite: org.apache.solr.analysis.TestNorwegianLightStemFilterFactory
   [junit4] Completed in 0.01s, 1 test
   [junit4]  
   [junit4] Suite: org.apache.solr.analysis.TestFrenchLightStemFilterFactory
   [junit4] Completed in 0.01s, 1 test
   [junit4]  
   [junit4] Suite: org.apache.solr.analysis.TestSwedishLightStemFilterFactory
   [junit4] Completed in 0.01s, 1 test
   [junit4]  
   [junit4] Suite: org.apache.solr.analysis.TestTypeTokenFilterFactory
   [junit4] Completed in 0.02s, 4 tests
   [junit4]  
   [junit4] Suite: org.apache.solr.analysis.TestDictionaryCompoundWordTokenFilterFactory
   [junit4] Completed in 0.01s, 1 test
   [junit4]  
   [junit4] Suite: org.apache.solr.analysis.TestHungarianLightStemFilterFactory
   [junit4] Completed in 0.01s, 1 test
   [junit4]  
   [junit4] Suite: org.apache.solr.spelling.TestSuggestSpellingConverter
   [junit4] Completed in 0.01s, 2 tests
   [junit4]  
   [junit4] Suite: org.apache.solr.analysis.LengthFilterTest
   [junit4] Completed in 0.01s, 1 test
   [junit4]  
   [junit4] Suite: org.apache.solr.analysis.TestFinnishLightStemFilterFactory
   [junit4] Completed in 0.01s, 1 test
   [junit4]  
   [junit4] Suite: org.apache.solr.analysis.TestGreekStemFilterFactory
   [junit4] Completed in 0.01s, 1 test
   [junit4]  
   [junit4] Suite: org.apache.solr.analysis.TestPorterStemFilterFactory
   [junit4] Completed in 0.01s, 1 test
   [junit4]  
   [junit4] Suite: org.apache.solr.core.TestBadConfig
   [junit4] Completed in 0.01s, 1 test
   [junit4]  
   [junit4] Suite: org.apache.solr.analysis.TestFrenchMinimalStemFilterFactory
   [junit4] Completed in 0.01s, 1 test
   [junit4]  
   [junit4] Suite: org.apache.solr.analysis.TestPersianNormalizationFilterFactory
   [junit4] Completed in 0.01s, 1 test
   [junit4]  
   [junit4] Suite: org.apache.solr.analysis.TestStemmerOverrideFilterFactory
   [junit4] Completed in 0.01s, 2 tests
   [junit4]  
   [junit4] Suite: org.apache.solr.internal.csv.writer.CSVConfigGuesserTest
   [junit4] Completed in 0.01s, 3 tests
   [junit4]  
   [junit4] Suite: org.apache.solr.analysis.TestGermanMinimalStemFilterFactory
   [junit4] Completed in 0.01s, 1 test
   [junit4]  
   [junit4] Suite: org.apache.solr.analysis.TestRussianFilters
   [junit4] Completed in 0.01s, 1 test
   [junit4]  
   [junit4] Suite: org.apache.solr.handler.admin.SystemInfoHandlerTest
   [junit4] Completed in 0.01s, 1 test
   [junit4]  
   [junit4] Suite: org.apache.solr.cloud.ChaosMonkeySafeLeaderTest
   [junit4] Completed in 0.00s, 0 tests
   [junit4]  
   [junit4] Suite: org.apache.solr.TestRandomFaceting
   [junit4] Completed in 12.04s, 1 test
   [junit4]  
   [junit4] JVM J0:     1.17 ..   931.72 =   930.55s
   [junit4] Execution time total: 15 minutes 31 seconds
   [junit4] Tests summary: 286 suites, 967 tests, 1 failure, 6 ignored (1 assumption)

BUILD FAILED
<http://jenkins.sd-datasolutions.de/job/Windows-Lucene-Solr-tests-only-trunk/ws/build.xml>:29:
The following error occurred while executing this line:
<http://jenkins.sd-datasolutions.de/job/Windows-Lucene-Solr-tests-only-trunk/ws/solr\build.xml>:144:
The following error occurred while executing this line:
<http://jenkins.sd-datasolutions.de/job/Windows-Lucene-Solr-tests-only-trunk/ws/lucene\module-build.xml>:62:
The following error occurred while executing this line:
<http://jenkins.sd-datasolutions.de/job/Windows-Lucene-Solr-tests-only-trunk/ws/lucene\common-build.xml>:1019:
The following error occurred while executing this line:
<http://jenkins.sd-datasolutions.de/job/Windows-Lucene-Solr-tests-only-trunk/ws/lucene\common-build.xml>:745:
There were test failures: 286 suites, 967 tests, 1 failure, 6 ignored (1 assumption)

Total time: 36 minutes 59 seconds
Build step 'Invoke Ant' marked build as failure
Recording test results

---------------------------------------------------------------------
To unsubscribe, e-mail: dev-unsubscribe@lucene.apache.org
For additional commands, e-mail: dev-help@lucene.apache.org


Mime
View raw message