lucene-dev mailing list archives

Site index · List index
Message view « Date » · « Thread »
Top « Date » · « Thread »
From jenk...@sd-datasolutions.de
Subject Build failed in Jenkins: Lucene-Solr-trunk-Linux-Java7-64 #70
Date Sun, 20 May 2012 21:20:30 GMT
See <http://jenkins.sd-datasolutions.de/job/Lucene-Solr-trunk-Linux-Java7-64/70/changes>

Changes:

[markrmiller] add a couple cloud props to multicore example solr.xml

------------------------------------------
[...truncated 11949 lines...]
   [junit4]   2> 	at org.apache.solr.cloud.RecoveryStrategy.doRecovery(RecoveryStrategy.java:267)
   [junit4]   2> 	at org.apache.solr.cloud.RecoveryStrategy.run(RecoveryStrategy.java:207)
   [junit4]   2> Caused by: org.apache.zookeeper.KeeperException$SessionExpiredException:
KeeperErrorCode = Session expired for /node_states/127.0.0.1:56302_solr
   [junit4]   2> 	at org.apache.zookeeper.KeeperException.create(KeeperException.java:118)
   [junit4]   2> 	at org.apache.zookeeper.KeeperException.create(KeeperException.java:42)
   [junit4]   2> 	at org.apache.zookeeper.ZooKeeper.setData(ZooKeeper.java:1044)
   [junit4]   2> 	at org.apache.solr.common.cloud.SolrZkClient$8.execute(SolrZkClient.java:312)
   [junit4]   2> 	at org.apache.solr.common.cloud.SolrZkClient$8.execute(SolrZkClient.java:309)
   [junit4]   2> 	at org.apache.solr.common.cloud.ZkCmdExecutor.retryOperation(ZkCmdExecutor.java:65)
   [junit4]   2> 	at org.apache.solr.common.cloud.SolrZkClient.setData(SolrZkClient.java:309)
   [junit4]   2> 	at org.apache.solr.common.cloud.SolrZkClient.setData(SolrZkClient.java:545)
   [junit4]   2> 	at org.apache.solr.cloud.ZkController.publishState(ZkController.java:1058)
   [junit4]   2> 	... 5 more
   [junit4]   2> 
   [junit4]   2> 114322 T1093 C4 P56302 oasc.RecoveryStrategy.doRecovery SEVERE Recovery
failed - trying again...
   [junit4]   2>  C4_STATE=coll:oneInstanceCollection2 core:oneInstanceCollection22 props:{shard=slice2,
roles=none, state=recovering, core=oneInstanceCollection22, collection=oneInstanceCollection2,
node_name=127.0.0.1:56302_solr, base_url=http://127.0.0.1:56302/solr}
   [junit4]   2> 118422 T1093 C4 P56302 oasc.RecoveryStrategy.doRecovery SEVERE Error while
trying to recover. org.apache.solr.common.cloud.ZooKeeperException: could not publish node
state
   [junit4]   2> 	at org.apache.solr.cloud.ZkController.publishState(ZkController.java:1062)
   [junit4]   2> 	at org.apache.solr.cloud.ZkController.doPublish(ZkController.java:1038)
   [junit4]   2> 	at org.apache.solr.cloud.ZkController.publishState(ZkController.java:1021)
   [junit4]   2> 	at org.apache.solr.cloud.ZkController.publish(ZkController.java:781)
   [junit4]   2> 	at org.apache.solr.cloud.RecoveryStrategy.doRecovery(RecoveryStrategy.java:267)
   [junit4]   2> 	at org.apache.solr.cloud.RecoveryStrategy.run(RecoveryStrategy.java:207)
   [junit4]   2> Caused by: org.apache.zookeeper.KeeperException$SessionExpiredException:
KeeperErrorCode = Session expired for /node_states/127.0.0.1:56302_solr
   [junit4]   2> 	at org.apache.zookeeper.KeeperException.create(KeeperException.java:118)
   [junit4]   2> 	at org.apache.zookeeper.KeeperException.create(KeeperException.java:42)
   [junit4]   2> 	at org.apache.zookeeper.ZooKeeper.setData(ZooKeeper.java:1044)
   [junit4]   2> 	at org.apache.solr.common.cloud.SolrZkClient$8.execute(SolrZkClient.java:312)
   [junit4]   2> 	at org.apache.solr.common.cloud.SolrZkClient$8.execute(SolrZkClient.java:309)
   [junit4]   2> 	at org.apache.solr.common.cloud.ZkCmdExecutor.retryOperation(ZkCmdExecutor.java:65)
   [junit4]   2> 	at org.apache.solr.common.cloud.SolrZkClient.setData(SolrZkClient.java:309)
   [junit4]   2> 	at org.apache.solr.common.cloud.SolrZkClient.setData(SolrZkClient.java:545)
   [junit4]   2> 	at org.apache.solr.cloud.ZkController.publishState(ZkController.java:1058)
   [junit4]   2> 	... 5 more
   [junit4]   2> 
   [junit4]   2> 118423 T1093 C4 P56302 oasc.RecoveryStrategy.doRecovery SEVERE Recovery
failed - trying again...
   [junit4]   2>  C4_STATE=coll:oneInstanceCollection2 core:oneInstanceCollection22 props:{shard=slice2,
roles=none, state=recovering, core=oneInstanceCollection22, collection=oneInstanceCollection2,
node_name=127.0.0.1:56302_solr, base_url=http://127.0.0.1:56302/solr}
   [junit4]   2> 122624 T1093 C4 P56302 oasc.RecoveryStrategy.doRecovery SEVERE Error while
trying to recover. org.apache.solr.common.cloud.ZooKeeperException: could not publish node
state
   [junit4]   2> 	at org.apache.solr.cloud.ZkController.publishState(ZkController.java:1062)
   [junit4]   2> 	at org.apache.solr.cloud.ZkController.doPublish(ZkController.java:1038)
   [junit4]   2> 	at org.apache.solr.cloud.ZkController.publishState(ZkController.java:1021)
   [junit4]   2> 	at org.apache.solr.cloud.ZkController.publish(ZkController.java:781)
   [junit4]   2> 	at org.apache.solr.cloud.RecoveryStrategy.doRecovery(RecoveryStrategy.java:267)
   [junit4]   2> 	at org.apache.solr.cloud.RecoveryStrategy.run(RecoveryStrategy.java:207)
   [junit4]   2> Caused by: org.apache.zookeeper.KeeperException$SessionExpiredException:
KeeperErrorCode = Session expired for /node_states/127.0.0.1:56302_solr
   [junit4]   2> 	at org.apache.zookeeper.KeeperException.create(KeeperException.java:118)
   [junit4]   2> 	at org.apache.zookeeper.KeeperException.create(KeeperException.java:42)
   [junit4]   2> 	at org.apache.zookeeper.ZooKeeper.setData(ZooKeeper.java:1044)
   [junit4]   2> 	at org.apache.solr.common.cloud.SolrZkClient$8.execute(SolrZkClient.java:312)
   [junit4]   2> 	at org.apache.solr.common.cloud.SolrZkClient$8.execute(SolrZkClient.java:309)
   [junit4]   2> 	at org.apache.solr.common.cloud.ZkCmdExecutor.retryOperation(ZkCmdExecutor.java:65)
   [junit4]   2> 	at org.apache.solr.common.cloud.SolrZkClient.setData(SolrZkClient.java:309)
   [junit4]   2> 	at org.apache.solr.common.cloud.SolrZkClient.setData(SolrZkClient.java:545)
   [junit4]   2> 	at org.apache.solr.cloud.ZkController.publishState(ZkController.java:1058)
   [junit4]   2> 	... 5 more
   [junit4]   2> 
   [junit4]   2> 122625 T1093 C4 P56302 oasc.RecoveryStrategy.doRecovery SEVERE Recovery
failed - trying again...
   [junit4]   2>  C4_STATE=coll:oneInstanceCollection2 core:oneInstanceCollection22 props:{shard=slice2,
roles=none, state=recovering, core=oneInstanceCollection22, collection=oneInstanceCollection2,
node_name=127.0.0.1:56302_solr, base_url=http://127.0.0.1:56302/solr}
   [junit4]   2> 126925 T1093 C4 P56302 oasc.RecoveryStrategy.doRecovery SEVERE Error while
trying to recover. org.apache.solr.common.cloud.ZooKeeperException: could not publish node
state
   [junit4]   2> 	at org.apache.solr.cloud.ZkController.publishState(ZkController.java:1062)
   [junit4]   2> 	at org.apache.solr.cloud.ZkController.doPublish(ZkController.java:1038)
   [junit4]   2> 	at org.apache.solr.cloud.ZkController.publishState(ZkController.java:1021)
   [junit4]   2> 	at org.apache.solr.cloud.ZkController.publish(ZkController.java:781)
   [junit4]   2> 	at org.apache.solr.cloud.RecoveryStrategy.doRecovery(RecoveryStrategy.java:267)
   [junit4]   2> 	at org.apache.solr.cloud.RecoveryStrategy.run(RecoveryStrategy.java:207)
   [junit4]   2> Caused by: org.apache.zookeeper.KeeperException$SessionExpiredException:
KeeperErrorCode = Session expired for /node_states/127.0.0.1:56302_solr
   [junit4]   2> 	at org.apache.zookeeper.KeeperException.create(KeeperException.java:118)
   [junit4]   2> 	at org.apache.zookeeper.KeeperException.create(KeeperException.java:42)
   [junit4]   2> 	at org.apache.zookeeper.ZooKeeper.setData(ZooKeeper.java:1044)
   [junit4]   2> 	at org.apache.solr.common.cloud.SolrZkClient$8.execute(SolrZkClient.java:312)
   [junit4]   2> 	at org.apache.solr.common.cloud.SolrZkClient$8.execute(SolrZkClient.java:309)
   [junit4]   2> 	at org.apache.solr.common.cloud.ZkCmdExecutor.retryOperation(ZkCmdExecutor.java:65)
   [junit4]   2> 	at org.apache.solr.common.cloud.SolrZkClient.setData(SolrZkClient.java:309)
   [junit4]   2> 	at org.apache.solr.common.cloud.SolrZkClient.setData(SolrZkClient.java:545)
   [junit4]   2> 	at org.apache.solr.cloud.ZkController.publishState(ZkController.java:1058)
   [junit4]   2> 	... 5 more
   [junit4]   2> 
   [junit4]   2> 126926 T1093 C4 P56302 oasc.RecoveryStrategy.doRecovery SEVERE Recovery
failed - trying again...
   [junit4]   2>  C4_STATE=coll:oneInstanceCollection2 core:oneInstanceCollection22 props:{shard=slice2,
roles=none, state=recovering, core=oneInstanceCollection22, collection=oneInstanceCollection2,
node_name=127.0.0.1:56302_solr, base_url=http://127.0.0.1:56302/solr}
   [junit4]   2> 131326 T1093 C4 P56302 oasc.RecoveryStrategy.doRecovery SEVERE Error while
trying to recover. org.apache.solr.common.cloud.ZooKeeperException: could not publish node
state
   [junit4]   2> 	at org.apache.solr.cloud.ZkController.publishState(ZkController.java:1062)
   [junit4]   2> 	at org.apache.solr.cloud.ZkController.doPublish(ZkController.java:1038)
   [junit4]   2> 	at org.apache.solr.cloud.ZkController.publishState(ZkController.java:1021)
   [junit4]   2> 	at org.apache.solr.cloud.ZkController.publish(ZkController.java:781)
   [junit4]   2> 	at org.apache.solr.cloud.RecoveryStrategy.doRecovery(RecoveryStrategy.java:267)
   [junit4]   2> 	at org.apache.solr.cloud.RecoveryStrategy.run(RecoveryStrategy.java:207)
   [junit4]   2> Caused by: org.apache.zookeeper.KeeperException$SessionExpiredException:
KeeperErrorCode = Session expired for /node_states/127.0.0.1:56302_solr
   [junit4]   2> 	at org.apache.zookeeper.KeeperException.create(KeeperException.java:118)
   [junit4]   2> 	at org.apache.zookeeper.KeeperException.create(KeeperException.java:42)
   [junit4]   2> 	at org.apache.zookeeper.ZooKeeper.setData(ZooKeeper.java:1044)
   [junit4]   2> 	at org.apache.solr.common.cloud.SolrZkClient$8.execute(SolrZkClient.java:312)
   [junit4]   2> 	at org.apache.solr.common.cloud.SolrZkClient$8.execute(SolrZkClient.java:309)
   [junit4]   2> 	at org.apache.solr.common.cloud.ZkCmdExecutor.retryOperation(ZkCmdExecutor.java:65)
   [junit4]   2> 	at org.apache.solr.common.cloud.SolrZkClient.setData(SolrZkClient.java:309)
   [junit4]   2> 	at org.apache.solr.common.cloud.SolrZkClient.setData(SolrZkClient.java:545)
   [junit4]   2> 	at org.apache.solr.cloud.ZkController.publishState(ZkController.java:1058)
   [junit4]   2> 	... 5 more
   [junit4]   2> 
   [junit4]   2> 131327 T1093 C4 P56302 oasc.RecoveryStrategy.doRecovery SEVERE Recovery
failed - trying again...
   [junit4]   2>  C4_STATE=coll:oneInstanceCollection2 core:oneInstanceCollection22 props:{shard=slice2,
roles=none, state=recovering, core=oneInstanceCollection22, collection=oneInstanceCollection2,
node_name=127.0.0.1:56302_solr, base_url=http://127.0.0.1:56302/solr}
   [junit4]   2> 135827 T1093 C4 P56302 oasc.RecoveryStrategy.doRecovery SEVERE Error while
trying to recover. org.apache.solr.common.cloud.ZooKeeperException: could not publish node
state
   [junit4]   2> 	at org.apache.solr.cloud.ZkController.publishState(ZkController.java:1062)
   [junit4]   2> 	at org.apache.solr.cloud.ZkController.doPublish(ZkController.java:1038)
   [junit4]   2> 	at org.apache.solr.cloud.ZkController.publishState(ZkController.java:1021)
   [junit4]   2> 	at org.apache.solr.cloud.ZkController.publish(ZkController.java:781)
   [junit4]   2> 	at org.apache.solr.cloud.RecoveryStrategy.doRecovery(RecoveryStrategy.java:267)
   [junit4]   2> 	at org.apache.solr.cloud.RecoveryStrategy.run(RecoveryStrategy.java:207)
   [junit4]   2> Caused by: org.apache.zookeeper.KeeperException$SessionExpiredException:
KeeperErrorCode = Session expired for /node_states/127.0.0.1:56302_solr
   [junit4]   2> 	at org.apache.zookeeper.KeeperException.create(KeeperException.java:118)
   [junit4]   2> 	at org.apache.zookeeper.KeeperException.create(KeeperException.java:42)
   [junit4]   2> 	at org.apache.zookeeper.ZooKeeper.setData(ZooKeeper.java:1044)
   [junit4]   2> 	at org.apache.solr.common.cloud.SolrZkClient$8.execute(SolrZkClient.java:312)
   [junit4]   2> 	at org.apache.solr.common.cloud.SolrZkClient$8.execute(SolrZkClient.java:309)
   [junit4]   2> 	at org.apache.solr.common.cloud.ZkCmdExecutor.retryOperation(ZkCmdExecutor.java:65)
   [junit4]   2> 	at org.apache.solr.common.cloud.SolrZkClient.setData(SolrZkClient.java:309)
   [junit4]   2> 	at org.apache.solr.common.cloud.SolrZkClient.setData(SolrZkClient.java:545)
   [junit4]   2> 	at org.apache.solr.cloud.ZkController.publishState(ZkController.java:1058)
   [junit4]   2> 	... 5 more
   [junit4]   2> 
   [junit4]   2> 135828 T1093 C4 P56302 oasc.RecoveryStrategy.doRecovery SEVERE Recovery
failed - trying again...
   [junit4]   2>  C4_STATE=coll:oneInstanceCollection2 core:oneInstanceCollection22 props:{shard=slice2,
roles=none, state=recovering, core=oneInstanceCollection22, collection=oneInstanceCollection2,
node_name=127.0.0.1:56302_solr, base_url=http://127.0.0.1:56302/solr}
   [junit4]   2> 140429 T1093 C4 P56302 oasc.RecoveryStrategy.doRecovery SEVERE Error while
trying to recover. org.apache.solr.common.cloud.ZooKeeperException: could not publish node
state
   [junit4]   2> 	at org.apache.solr.cloud.ZkController.publishState(ZkController.java:1062)
   [junit4]   2> 	at org.apache.solr.cloud.ZkController.doPublish(ZkController.java:1038)
   [junit4]   2> 	at org.apache.solr.cloud.ZkController.publishState(ZkController.java:1021)
   [junit4]   2> 	at org.apache.solr.cloud.ZkController.publish(ZkController.java:781)
   [junit4]   2> 	at org.apache.solr.cloud.RecoveryStrategy.doRecovery(RecoveryStrategy.java:267)
   [junit4]   2> 	at org.apache.solr.cloud.RecoveryStrategy.run(RecoveryStrategy.java:207)
   [junit4]   2> Caused by: org.apache.zookeeper.KeeperException$SessionExpiredException:
KeeperErrorCode = Session expired for /node_states/127.0.0.1:56302_solr
   [junit4]   2> 	at org.apache.zookeeper.KeeperException.create(KeeperException.java:118)
   [junit4]   2> 	at org.apache.zookeeper.KeeperException.create(KeeperException.java:42)
   [junit4]   2> 	at org.apache.zookeeper.ZooKeeper.setData(ZooKeeper.java:1044)
   [junit4]   2> 	at org.apache.solr.common.cloud.SolrZkClient$8.execute(SolrZkClient.java:312)
   [junit4]   2> 	at org.apache.solr.common.cloud.SolrZkClient$8.execute(SolrZkClient.java:309)
   [junit4]   2> 	at org.apache.solr.common.cloud.ZkCmdExecutor.retryOperation(ZkCmdExecutor.java:65)
   [junit4]   2> 	at org.apache.solr.common.cloud.SolrZkClient.setData(SolrZkClient.java:309)
   [junit4]   2> 	at org.apache.solr.common.cloud.SolrZkClient.setData(SolrZkClient.java:545)
   [junit4]   2> 	at org.apache.solr.cloud.ZkController.publishState(ZkController.java:1058)
   [junit4]   2> 	... 5 more
   [junit4]   2> 
   [junit4]   2> 140429 T1093 C4 P56302 oasc.RecoveryStrategy.doRecovery SEVERE Recovery
failed - trying again...
   [junit4]   2>  C4_STATE=coll:oneInstanceCollection2 core:oneInstanceCollection22 props:{shard=slice2,
roles=none, state=recovering, core=oneInstanceCollection22, collection=oneInstanceCollection2,
node_name=127.0.0.1:56302_solr, base_url=http://127.0.0.1:56302/solr}
   [junit4]   2> 145130 T1093 C4 P56302 oasc.RecoveryStrategy.doRecovery SEVERE Error while
trying to recover. org.apache.solr.common.cloud.ZooKeeperException: could not publish node
state
   [junit4]   2> 	at org.apache.solr.cloud.ZkController.publishState(ZkController.java:1062)
   [junit4]   2> 	at org.apache.solr.cloud.ZkController.doPublish(ZkController.java:1038)
   [junit4]   2> 	at org.apache.solr.cloud.ZkController.publishState(ZkController.java:1021)
   [junit4]   2> 	at org.apache.solr.cloud.ZkController.publish(ZkController.java:781)
   [junit4]   2> 	at org.apache.solr.cloud.RecoveryStrategy.doRecovery(RecoveryStrategy.java:267)
   [junit4]   2> 	at org.apache.solr.cloud.RecoveryStrategy.run(RecoveryStrategy.java:207)
   [junit4]   2> Caused by: org.apache.zookeeper.KeeperException$SessionExpiredException:
KeeperErrorCode = Session expired for /node_states/127.0.0.1:56302_solr
   [junit4]   2> 	at org.apache.zookeeper.KeeperException.create(KeeperException.java:118)
   [junit4]   2> 	at org.apache.zookeeper.KeeperException.create(KeeperException.java:42)
   [junit4]   2> 	at org.apache.zookeeper.ZooKeeper.setData(ZooKeeper.java:1044)
   [junit4]   2> 	at org.apache.solr.common.cloud.SolrZkClient$8.execute(SolrZkClient.java:312)
   [junit4]   2> 	at org.apache.solr.common.cloud.SolrZkClient$8.execute(SolrZkClient.java:309)
   [junit4]   2> 	at org.apache.solr.common.cloud.ZkCmdExecutor.retryOperation(ZkCmdExecutor.java:65)
   [junit4]   2> 	at org.apache.solr.common.cloud.SolrZkClient.setData(SolrZkClient.java:309)
   [junit4]   2> 	at org.apache.solr.common.cloud.SolrZkClient.setData(SolrZkClient.java:545)
   [junit4]   2> 	at org.apache.solr.cloud.ZkController.publishState(ZkController.java:1058)
   [junit4]   2> 	... 5 more
   [junit4]   2> 
   [junit4]   2> 145131 T1093 C4 P56302 oasc.RecoveryStrategy.doRecovery SEVERE Recovery
failed - trying again...
   [junit4]   2>  C4_STATE=coll:oneInstanceCollection2 core:oneInstanceCollection22 props:{shard=slice2,
roles=none, state=recovering, core=oneInstanceCollection22, collection=oneInstanceCollection2,
node_name=127.0.0.1:56302_solr, base_url=http://127.0.0.1:56302/solr}
   [junit4]   2> 149931 T1093 C4 P56302 oasc.RecoveryStrategy.doRecovery SEVERE Error while
trying to recover. org.apache.solr.common.cloud.ZooKeeperException: could not publish node
state
   [junit4]   2> 	at org.apache.solr.cloud.ZkController.publishState(ZkController.java:1062)
   [junit4]   2> 	at org.apache.solr.cloud.ZkController.doPublish(ZkController.java:1038)
   [junit4]   2> 	at org.apache.solr.cloud.ZkController.publishState(ZkController.java:1021)
   [junit4]   2> 	at org.apache.solr.cloud.ZkController.publish(ZkController.java:781)
   [junit4]   2> 	at org.apache.solr.cloud.RecoveryStrategy.doRecovery(RecoveryStrategy.java:267)
   [junit4]   2> 	at org.apache.solr.cloud.RecoveryStrategy.run(RecoveryStrategy.java:207)
   [junit4]   2> Caused by: org.apache.zookeeper.KeeperException$SessionExpiredException:
KeeperErrorCode = Session expired for /node_states/127.0.0.1:56302_solr
   [junit4]   2> 	at org.apache.zookeeper.KeeperException.create(KeeperException.java:118)
   [junit4]   2> 	at org.apache.zookeeper.KeeperException.create(KeeperException.java:42)
   [junit4]   2> 	at org.apache.zookeeper.ZooKeeper.setData(ZooKeeper.java:1044)
   [junit4]   2> 	at org.apache.solr.common.cloud.SolrZkClient$8.execute(SolrZkClient.java:312)
   [junit4]   2> 	at org.apache.solr.common.cloud.SolrZkClient$8.execute(SolrZkClient.java:309)
   [junit4]   2> 	at org.apache.solr.common.cloud.ZkCmdExecutor.retryOperation(ZkCmdExecutor.java:65)
   [junit4]   2> 	at org.apache.solr.common.cloud.SolrZkClient.setData(SolrZkClient.java:309)
   [junit4]   2> 	at org.apache.solr.common.cloud.SolrZkClient.setData(SolrZkClient.java:545)
   [junit4]   2> 	at org.apache.solr.cloud.ZkController.publishState(ZkController.java:1058)
   [junit4]   2> 	... 5 more
   [junit4]   2> 
   [junit4]   2> 149932 T1093 C4 P56302 oasc.RecoveryStrategy.doRecovery SEVERE Recovery
failed - trying again...
   [junit4]   2> 153771 T944 oas.SolrTestCaseJ4.endTrackingSearchers SEVERE ERROR: SolrIndexSearcher
opens=80 closes=79
   [junit4]   2> NOTE: test params are: codec=Lucene40, sim=RandomSimilarityProvider(queryNorm=false,coord=true):
{}, locale=is, timezone=America/St_Lucia
   [junit4]   2> NOTE: Linux 2.6.32-41-server amd64/Oracle Corporation 1.7.0_04 (64-bit)/cpus=8,threads=3,free=121968264,total=277872640
   [junit4]   2> NOTE: All tests run in this JVM: [TestStandardFactories, TestBinaryField,
SolrCmdDistributorTest, EchoParamsTest, PolyFieldTest, TestJapanesePartOfSpeechStopFilterFactory,
DocumentBuilderTest, ConvertedLegacyTest, TestBM25SimilarityFactory, TestRussianFilters, TestWikipediaTokenizerFactory,
TestGalicianStemFilterFactory, SuggesterFSTTest, TestPortugueseStemFilterFactory, CommonGramsFilterFactoryTest,
LoggingHandlerTest, TestUtils, TestPortugueseLightStemFilterFactory, PrimitiveFieldTypeTest,
TestJoin, TestTrie, TestIndonesianStemFilterFactory, TestBadConfig, URLClassifyProcessorTest,
LeaderElectionIntegrationTest, FieldMutatingUpdateProcessorTest, TestPerFieldSimilarity, TestMergePolicyConfig,
TermVectorComponentTest, TestCJKBigramFilterFactory, TestPseudoReturnFields, TestElisionFilterFactory,
TestNumberUtils, TestPropInject, DirectSolrConnectionTest, TestChineseFilterFactory, RequestHandlersTest,
TestFoldingMultitermQuery, TestPatternReplaceFilterFactory, TestLatvianStemFilterFactory,
TestQuerySenderNoQuery, CloudStateUpdateTest, HighlighterTest, BadIndexSchemaTest, DisMaxRequestHandlerTest,
HighlighterConfigTest, NotRequiredUniqueKeyTest, TestFunctionQuery, DistributedSpellCheckComponentTest,
TestJmxMonitoredMap, TestDistributedSearch, FastVectorHighlighterTest, TestGermanNormalizationFilterFactory,
TestTrimFilterFactory, TestDocSet, FieldAnalysisRequestHandlerTest, PeerSyncTest, ZkNodePropsTest,
TestSystemIdResolver, TestLRUCache, MBeansHandlerTest, TestLMDirichletSimilarityFactory, ShowFileRequestHandlerTest,
BasicZkTest, TestSpanishLightStemFilterFactory, BinaryUpdateRequestHandlerTest, TestItalianLightStemFilterFactory,
TestCSVResponseWriter, IndexSchemaRuntimeFieldTest, TestPluginEnable, TestPhoneticFilterFactory,
SpatialFilterTest, TestFinnishLightStemFilterFactory, TestBulgarianStemFilterFactory, TestQuerySenderListener,
TestCzechStemFilterFactory, TestCSVLoader, TestBeiderMorseFilterFactory, TestCollationKeyRangeQueries,
LukeRequestHandlerTest, TestPortugueseMinimalStemFilterFactory, TestRemoveDuplicatesTokenFilterFactory,
TestCodecSupport, TestPropInjectDefaults, MultiTermTest, SpellCheckComponentTest, ResourceLoaderTest,
UniqFieldsUpdateProcessorFactoryTest, TestFrenchLightStemFilterFactory, TestPatternReplaceCharFilterFactory,
BasicFunctionalityTest, TestRandomFaceting, TestGermanLightStemFilterFactory, JsonLoaderTest,
TestPatternTokenizerFactory, TestWordDelimiterFilterFactory, FullSolrCloudDistribCmdsTest,
TestThaiWordFilterFactory, BasicDistributedZkTest]
   [junit4]   2> NOTE: reproduce with: ant test -Dtestcase=BasicDistributedZkTest -Dtests.seed=1C8C56207AE4071B
-Dtests.locale=is -Dtests.timezone=America/St_Lucia -Dtests.multiplier=3 -Dargs="-Dfile.encoding=UTF-8"
   [junit4]   2> 
   [junit4] ERROR   0.00s J0 | BasicDistributedZkTest (suite)
   [junit4]    > Throwable #1: java.lang.AssertionError: ERROR: SolrIndexSearcher opens=80
closes=79
   [junit4]    > 	at __randomizedtesting.SeedInfo.seed([1C8C56207AE4071B]:0)
   [junit4]    > 	at org.junit.Assert.fail(Assert.java:93)
   [junit4]    > 	at org.apache.solr.SolrTestCaseJ4.endTrackingSearchers(SolrTestCaseJ4.java:185)
   [junit4]    > 	at org.apache.solr.SolrTestCaseJ4.afterClass(SolrTestCaseJ4.java:82)
   [junit4]    > 	at sun.reflect.GeneratedMethodAccessor15.invoke(Unknown Source)
   [junit4]    > 	at sun.reflect.DelegatingMethodAccessorImpl.invoke(DelegatingMethodAccessorImpl.java:43)
   [junit4]    > 	at java.lang.reflect.Method.invoke(Method.java:601)
   [junit4]    > 	at com.carrotsearch.randomizedtesting.RandomizedRunner.invoke(RandomizedRunner.java:1969)
   [junit4]    > 	at com.carrotsearch.randomizedtesting.RandomizedRunner.access$1100(RandomizedRunner.java:132)
   [junit4]    > 	at com.carrotsearch.randomizedtesting.RandomizedRunner$5.evaluate(RandomizedRunner.java:752)
   [junit4]    > 	at com.carrotsearch.randomizedtesting.rules.SystemPropertiesRestoreRule$1.evaluate(SystemPropertiesRestoreRule.java:53)
   [junit4]    > 	at org.apache.lucene.util.AbstractBeforeAfterRule$1.evaluate(AbstractBeforeAfterRule.java:45)
   [junit4]    > 	at org.apache.lucene.util.TestRuleReportUncaughtExceptions$1.evaluate(TestRuleReportUncaughtExceptions.java:68)
   [junit4]    > 	at org.apache.lucene.util.TestRuleStoreClassName$1.evaluate(TestRuleStoreClassName.java:38)
   [junit4]    > 	at org.apache.lucene.util.TestRuleIcuHack$1.evaluate(TestRuleIcuHack.java:51)
   [junit4]    > 	at com.carrotsearch.randomizedtesting.rules.SystemPropertiesInvariantRule$1.evaluate(SystemPropertiesInvariantRule.java:55)
   [junit4]    > 	at org.apache.lucene.util.TestRuleNoInstanceHooksOverrides$1.evaluate(TestRuleNoInstanceHooksOverrides.java:53)
   [junit4]    > 	at org.apache.lucene.util.TestRuleNoStaticHooksShadowing$1.evaluate(TestRuleNoStaticHooksShadowing.java:52)
   [junit4]    > 	at org.apache.lucene.util.TestRuleAssertionsRequired$1.evaluate(TestRuleAssertionsRequired.java:36)
   [junit4]    > 	at org.apache.lucene.util.TestRuleMarkFailure$1.evaluate(TestRuleMarkFailure.java:48)
   [junit4]    > 	at org.apache.lucene.util.TestRuleIgnoreTestSuites$1.evaluate(TestRuleIgnoreTestSuites.java:56)
   [junit4]    > 	at com.carrotsearch.randomizedtesting.RandomizedRunner.runSuite(RandomizedRunner.java:605)
   [junit4]    > 	at com.carrotsearch.randomizedtesting.RandomizedRunner.access$400(RandomizedRunner.java:132)
   [junit4]    > 	at com.carrotsearch.randomizedtesting.RandomizedRunner$2.run(RandomizedRunner.java:551)
   [junit4]    >
   [junit4] Completed on J0 in 153.80s, 1 test, 1 failure <<< FAILURES!
   [junit4]  
   [junit4] Suite: org.apache.solr.update.DirectUpdateHandlerOptimizeTest
   [junit4] Completed on J0 in 0.55s, 1 test
   [junit4]  
   [junit4] Suite: org.apache.solr.analysis.TestCapitalizationFilterFactory
   [junit4] Completed on J0 in 0.02s, 7 tests
   [junit4]  
   [junit4] Suite: org.apache.solr.update.UpdateParamsTest
   [junit4] Completed on J0 in 0.55s, 1 test
   [junit4]  
   [junit4] Suite: org.apache.solr.response.TestPHPSerializedResponseWriter
   [junit4] Completed on J0 in 0.50s, 2 tests
   [junit4]  
   [junit4] Suite: org.apache.solr.spelling.TestSuggestSpellingConverter
   [junit4] Completed on J0 in 0.01s, 2 tests
   [junit4]  
   [junit4] JVM J0:     0.60 ..   388.71 =   388.11s
   [junit4] JVM J1:     0.60 ..   347.03 =   346.44s
   [junit4] Execution time total: 6 minutes 28 seconds
   [junit4] Tests summary: 286 suites, 968 tests, 1 suite-level error, 5 ignored

BUILD FAILED
/mnt/ssd/jenkins/workspace/Lucene-Solr-trunk-Linux-Java7-64/checkout/build.xml:29: The following
error occurred while executing this line:
/mnt/ssd/jenkins/workspace/Lucene-Solr-trunk-Linux-Java7-64/checkout/solr/build.xml:144: The
following error occurred while executing this line:
/mnt/ssd/jenkins/workspace/Lucene-Solr-trunk-Linux-Java7-64/checkout/lucene/module-build.xml:62:
The following error occurred while executing this line:
/mnt/ssd/jenkins/workspace/Lucene-Solr-trunk-Linux-Java7-64/checkout/lucene/common-build.xml:1019:
The following error occurred while executing this line:
/mnt/ssd/jenkins/workspace/Lucene-Solr-trunk-Linux-Java7-64/checkout/lucene/common-build.xml:745:
There were test failures: 286 suites, 968 tests, 1 suite-level error, 5 ignored

Total time: 22 minutes 18 seconds
Build step 'Execute shell' marked build as failure
Archiving artifacts
Recording test results

---------------------------------------------------------------------
To unsubscribe, e-mail: dev-unsubscribe@lucene.apache.org
For additional commands, e-mail: dev-help@lucene.apache.org


Mime
View raw message