lucene-dev mailing list archives

Site index · List index
Message view « Date » · « Thread »
Top « Date » · « Thread »
From jenk...@sd-datasolutions.de
Subject Build failed in Jenkins: Windows-Lucene-Solr-tests-only-trunk-java7 #20
Date Thu, 17 May 2012 05:01:07 GMT
See <http://jenkins.sd-datasolutions.de/job/Windows-Lucene-Solr-tests-only-trunk-java7/20/>

------------------------------------------
[...truncated 10969 lines...]
   [junit4]  
   [junit4] Suite: org.apache.solr.spelling.IndexBasedSpellCheckerTest
   [junit4] Completed in 1.31s, 5 tests
   [junit4]  
   [junit4] Suite: org.apache.solr.update.processor.SignatureUpdateProcessorFactoryTest
   [junit4] Completed in 1.72s, 6 tests
   [junit4]  
   [junit4] Suite: org.apache.solr.core.TestCoreContainer
   [junit4] Completed in 3.25s, 1 test
   [junit4]  
   [junit4] Suite: org.apache.solr.search.similarities.TestLMDirichletSimilarityFactory
   [junit4] Completed in 0.18s, 2 tests
   [junit4]  
   [junit4] Suite: org.apache.solr.handler.admin.ShowFileRequestHandlerTest
   [junit4] Completed in 1.19s, 2 tests
   [junit4]  
   [junit4] Suite: org.apache.solr.highlight.HighlighterTest
   [junit4] Completed in 2.11s, 27 tests
   [junit4]  
   [junit4] Suite: org.apache.solr.search.function.SortByFunctionTest
   [junit4] Completed in 1.95s, 2 tests
   [junit4]  
   [junit4] Suite: org.apache.solr.spelling.SpellCheckCollatorTest
   [junit4] Completed in 1.31s, 5 tests
   [junit4]  
   [junit4] Suite: org.apache.solr.handler.XsltUpdateRequestHandlerTest
   [junit4] Completed in 0.89s, 1 test
   [junit4]  
   [junit4] Suite: org.apache.solr.servlet.NoCacheHeaderTest
   [junit4] Completed in 1.20s, 3 tests
   [junit4]  
   [junit4] Suite: org.apache.solr.servlet.CacheHeaderTest
   [junit4] Completed in 0.89s, 5 tests
   [junit4]  
   [junit4] Suite: org.apache.solr.core.TestSolrDeletionPolicy1
   [junit4]    > (@BeforeClass output)
   [junit4]   2> Creating dataDir: <http://jenkins.sd-datasolutions.de/job/Windows-Lucene-Solr-tests-only-trunk-java7/ws/solr\build\solr-core\test\J0\.\solrtest-TestSolrDeletionPolicy1-1337230834710>
   [junit4]   2> 
   [junit4] FAILURE 0.19s | TestSolrDeletionPolicy1.testCommitAge
   [junit4]    > Throwable #1: java.lang.AssertionError
   [junit4]    > 	at __randomizedtesting.SeedInfo.seed([382136BE80254659:8D9FA822C17C1359]:0)
   [junit4]    > 	at org.junit.Assert.fail(Assert.java:92)
   [junit4]    > 	at org.junit.Assert.assertTrue(Assert.java:43)
   [junit4]    > 	at org.junit.Assert.assertTrue(Assert.java:54)
   [junit4]    > 	at org.apache.solr.core.TestSolrDeletionPolicy1.testCommitAge(TestSolrDeletionPolicy1.java:129)
   [junit4]    > 	at sun.reflect.NativeMethodAccessorImpl.invoke0(Native Method)
   [junit4]    > 	at sun.reflect.NativeMethodAccessorImpl.invoke(NativeMethodAccessorImpl.java:57)
   [junit4]    > 	at sun.reflect.DelegatingMethodAccessorImpl.invoke(DelegatingMethodAccessorImpl.java:43)
   [junit4]    > 	at java.lang.reflect.Method.invoke(Method.java:601)
   [junit4]    > 	at com.carrotsearch.randomizedtesting.RandomizedRunner.invoke(RandomizedRunner.java:1969)
   [junit4]    > 	at com.carrotsearch.randomizedtesting.RandomizedRunner.access$1100(RandomizedRunner.java:132)
   [junit4]    > 	at com.carrotsearch.randomizedtesting.RandomizedRunner$6.evaluate(RandomizedRunner.java:814)
   [junit4]    > 	at com.carrotsearch.randomizedtesting.RandomizedRunner$7.evaluate(RandomizedRunner.java:875)
   [junit4]    > 	at com.carrotsearch.randomizedtesting.RandomizedRunner$8.evaluate(RandomizedRunner.java:889)
   [junit4]    > 	at com.carrotsearch.randomizedtesting.rules.SystemPropertiesRestoreRule$1.evaluate(SystemPropertiesRestoreRule.java:53)
   [junit4]    > 	at org.apache.lucene.util.TestRuleSetupTeardownChained$1.evaluate(TestRuleSetupTeardownChained.java:50)
   [junit4]    > 	at org.apache.lucene.util.TestRuleFieldCacheSanity$1.evaluate(TestRuleFieldCacheSanity.java:32)
   [junit4]    > 	at org.apache.lucene.util.AbstractBeforeAfterRule$1.evaluate(AbstractBeforeAfterRule.java:45)
   [junit4]    > 	at com.carrotsearch.randomizedtesting.rules.SystemPropertiesInvariantRule$1.evaluate(SystemPropertiesInvariantRule.java:55)
   [junit4]    > 	at org.apache.lucene.util.TestRuleReportUncaughtExceptions$1.evaluate(TestRuleReportUncaughtExceptions.java:68)
   [junit4]    > 	at org.apache.lucene.util.TestRuleThreadAndTestName$1.evaluate(TestRuleThreadAndTestName.java:48)
   [junit4]    > 	at org.apache.lucene.util.TestRuleMarkFailure$1.evaluate(TestRuleMarkFailure.java:48)
   [junit4]    > 	at com.carrotsearch.randomizedtesting.RandomizedRunner.runSingleTest(RandomizedRunner.java:821)
   [junit4]    > 	at com.carrotsearch.randomizedtesting.RandomizedRunner.access$700(RandomizedRunner.java:132)
   [junit4]    > 	at com.carrotsearch.randomizedtesting.RandomizedRunner$3$1.run(RandomizedRunner.java:669)
   [junit4]    > 	at com.carrotsearch.randomizedtesting.RandomizedRunner$3.evaluate(RandomizedRunner.java:695)
   [junit4]    > 	at com.carrotsearch.randomizedtesting.RandomizedRunner$4.evaluate(RandomizedRunner.java:734)
   [junit4]    > 	at com.carrotsearch.randomizedtesting.RandomizedRunner$5.evaluate(RandomizedRunner.java:745)
   [junit4]    > 	at com.carrotsearch.randomizedtesting.rules.SystemPropertiesRestoreRule$1.evaluate(SystemPropertiesRestoreRule.java:53)
   [junit4]    > 	at org.apache.lucene.util.AbstractBeforeAfterRule$1.evaluate(AbstractBeforeAfterRule.java:45)
   [junit4]    > 	at org.apache.lucene.util.TestRuleReportUncaughtExceptions$1.evaluate(TestRuleReportUncaughtExceptions.java:68)
   [junit4]    > 	at org.apache.lucene.util.TestRuleStoreClassName$1.evaluate(TestRuleStoreClassName.java:38)
   [junit4]    > 	at org.apache.lucene.util.TestRuleIcuHack$1.evaluate(TestRuleIcuHack.java:51)
   [junit4]    > 	at com.carrotsearch.randomizedtesting.rules.SystemPropertiesInvariantRule$1.evaluate(SystemPropertiesInvariantRule.java:55)
   [junit4]    > 	at org.apache.lucene.util.TestRuleNoInstanceHooksOverrides$1.evaluate(TestRuleNoInstanceHooksOverrides.java:53)
   [junit4]    > 	at org.apache.lucene.util.TestRuleNoStaticHooksShadowing$1.evaluate(TestRuleNoStaticHooksShadowing.java:52)
   [junit4]    > 	at org.apache.lucene.util.TestRuleAssertionsRequired$1.evaluate(TestRuleAssertionsRequired.java:36)
   [junit4]    > 	at org.apache.lucene.util.TestRuleMarkFailure$1.evaluate(TestRuleMarkFailure.java:48)
   [junit4]    > 	at com.carrotsearch.randomizedtesting.RandomizedRunner.runSuite(RandomizedRunner.java:605)
   [junit4]    > 	at com.carrotsearch.randomizedtesting.RandomizedRunner.access$400(RandomizedRunner.java:132)
   [junit4]    > 	at com.carrotsearch.randomizedtesting.RandomizedRunner$2.run(RandomizedRunner.java:551)
   [junit4]    > 
   [junit4]   2> NOTE: reproduce with: ant test -Dtestcase=TestSolrDeletionPolicy1 -Dtests.method=testCommitAge
-Dtests.seed=382136BE80254659 -Dtests.locale=fr_FR -Dtests.timezone=Asia/Yerevan -Dargs="-Dfile.encoding=Cp1252"
   [junit4]   2>
   [junit4]    > (@AfterClass output)
   [junit4]   2> NOTE: test params are: codec=Lucene40, sim=RandomSimilarityProvider(queryNorm=true,coord=true):
{}, locale=fr_FR, timezone=Asia/Yerevan
   [junit4]   2> NOTE: Windows 7 6.1 amd64/Oracle Corporation 1.7.0_04 (64-bit)/cpus=2,threads=1,free=153218056,total=275513344
   [junit4]   2> NOTE: All tests run in this JVM: [TestLFUCache, TestMergePolicyConfig,
SolrIndexConfigTest, TestStandardFactories, TestPortugueseLightStemFilterFactory, TestRealTimeGet,
TestDistributedSearch, DOMUtilTest, TestBeiderMorseFilterFactory, URLClassifyProcessorTest,
TestPseudoReturnFields, UpdateParamsTest, RequiredFieldsTest, TestOmitPositions, MultiTermTest,
TestSpanishLightStemFilterFactory, TestCJKWidthFilterFactory, TestCJKTokenizerFactory, TestNorwegianMinimalStemFilterFactory,
TestMultiCoreConfBootstrap, PingRequestHandlerTest, TestSystemIdResolver, TestLuceneMatchVersion,
AutoCommitTest, LengthFilterTest, TestSolrCoreProperties, SolrCoreCheckLockOnStartupTest,
TestValueSourceCache, TestCJKBigramFilterFactory, TestGalicianStemFilterFactory, TestGermanLightStemFilterFactory,
TestBM25SimilarityFactory, BasicZkTest, TestShingleFilterFactory, OverseerTest, CommonGramsFilterFactoryTest,
SimpleFacetsTest, DirectUpdateHandlerOptimizeTest, CopyFieldTest, HighlighterConfigTest, TestQuerySenderNoQuery,
TestBrazilianStemFilterFactory, FileUtilsTest, StatsComponentTest, DirectSolrSpellCheckerTest,
FastVectorHighlighterTest, TestHashPartitioner, TestHunspellStemFilterFactory, TestCSVLoader,
PolyFieldTest, ConvertedLegacyTest, DistributedSpellCheckComponentTest, BinaryUpdateRequestHandlerTest,
SearchHandlerTest, DirectUpdateHandlerTest, TestExtendedDismaxParser, TestDictionaryCompoundWordTokenFilterFactory,
DistributedQueryElevationComponentTest, PrimitiveFieldTypeTest, RecoveryZkTest, TestConfig,
AlternateDirectoryTest, SnowballPorterFilterFactoryTest, LeaderElectionIntegrationTest, TestGreekLowerCaseFilterFactory,
SolrPluginUtilsTest, TestLRUCache, DistributedTermsComponentTest, CloudStateUpdateTest, CoreAdminHandlerTest,
TestKeepFilterFactory, DateFieldTest, TestPortugueseMinimalStemFilterFactory, TestRecovery,
BasicFunctionalityTest, TestThaiWordFilterFactory, TestSlowSynonymFilter, DocumentBuilderTest,
TestChineseTokenizerFactory, TestFoldingMultitermQuery, TestQueryTypes, IndexSchemaRuntimeFieldTest,
TestHindiFilters, TestSolrDeletionPolicy2, TestRussianLightStemFilterFactory, TestGermanMinimalStemFilterFactory,
NumericFieldsTest, TermsComponentTest, TestSwedishLightStemFilterFactory, TestSynonymMap,
PrimUtilsTest, TestCollationKeyFilterFactory, BadComponentTest, TestFunctionQuery, SpellPossibilityIteratorTest,
TestCollationKeyRangeQueries, TestBulgarianStemFilterFactory, SoftAutoCommitTest, TestStopFilterFactory,
TestMappingCharFilterFactory, TestKStemFilterFactory, TestNumberUtils, TestPropInject, TestWikipediaTokenizerFactory,
DistanceFunctionTest, TestRemoteStreaming, FieldAnalysisRequestHandlerTest, PeerSyncTest,
TestSynonymFilterFactory, TestIndonesianStemFilterFactory, TestNorwegianLightStemFilterFactory,
DateMathParserTest, TestDFRSimilarityFactory, UpdateRequestProcessorFactoryTest, DebugComponentTest,
TestCSVResponseWriter, TestSurroundQueryParser, TestCapitalizationFilterFactory, TestSolrXMLSerializer,
TestUAX29URLEmailTokenizerFactory, TestBinaryField, TestHyphenationCompoundWordTokenFilterFactory,
TestIndexSearcher, CommonGramsQueryFilterFactoryTest, SuggesterTSTTest, TimeZoneUtilsTest,
SystemInfoHandlerTest, DocumentAnalysisRequestHandlerTest, SampleTest, TestElisionFilterFactory,
TestPorterStemFilterFactory, TestFrenchLightStemFilterFactory, TestGroupingSearch, SolrRequestParserTest,
TestReversedWildcardFilterFactory, TestLMJelinekMercerSimilarityFactory, ReturnFieldsTest,
TestJmxIntegration, TestWordDelimiterFilterFactory, TestCzechStemFilterFactory, TestBadConfig,
DoubleMetaphoneFilterFactoryTest, QueryElevationComponentTest, SuggesterWFSTTest, TestQuerySenderListener,
SOLR749Test, TestSolrQueryParser, SpellCheckComponentTest, TestEnglishMinimalStemFilterFactory,
MBeansHandlerTest, TestMultiWordSynonyms, SuggesterFSTTest, LukeRequestHandlerTest, SpellingQueryConverterTest,
UniqFieldsUpdateProcessorFactoryTest, ZkNodePropsTest, TestSort, TestRussianFilters, TestGermanNormalizationFilterFactory,
LegacyHTMLStripCharFilterTest, TestReplicationHandler, TestJmxMonitoredMap, PluginInfoTest,
JSONWriterTest, IndexReaderFactoryTest, TestPropInjectDefaults, IndexSchemaTest, TestCodecSupport,
TestTypeTokenFilterFactory, FullSolrCloudDistribCmdsTest, SuggesterTest, TestPersianNormalizationFilterFactory,
SpatialFilterTest, TestTrimFilterFactory, TestKeywordMarkerFilterFactory, StandardRequestHandlerTest,
TestRandomFaceting, TestIBSimilarityFactory, LoggingHandlerTest, TestWriterPerf, CurrencyFieldTest,
TestGermanStemFilterFactory, TermVectorComponentTest, CSVRequestHandlerTest, TestIndexingPerformance,
TestDocSet, TestPluginEnable, BasicDistributedZkTest, TestPerFieldSimilarity, TestBinaryResponseWriter,
ZkControllerTest, TestPortugueseStemFilterFactory, DirectSolrConnectionTest, NodeStateWatcherTest,
OutputWriterTest, SolrCoreTest, TestTrie, CloudStateTest, TestPatternReplaceFilterFactory,
SolrCmdDistributorTest, TestTurkishLowerCaseFilterFactory, TestFinnishLightStemFilterFactory,
TestArabicFilters, LeaderElectionTest, ZkSolrClientTest, TestPhoneticFilterFactory, TestDistributedGrouping,
TestJoin, TestFaceting, TestRangeQuery, MoreLikeThisHandlerTest, TestFiltering, BadIndexSchemaTest,
SolrInfoMBeanTest, IndexBasedSpellCheckerTest, SignatureUpdateProcessorFactoryTest, TestCoreContainer,
TestLMDirichletSimilarityFactory, ShowFileRequestHandlerTest, HighlighterTest, SortByFunctionTest,
SpellCheckCollatorTest, XsltUpdateRequestHandlerTest, NoCacheHeaderTest, CacheHeaderTest,
TestSolrDeletionPolicy1]
   [junit4]   2> 
   [junit4] Completed in 0.99s, 3 tests, 1 failure <<< FAILURES!
   [junit4]  
   [junit4] Suite: org.apache.solr.update.processor.FieldMutatingUpdateProcessorTest
   [junit4] Completed in 0.67s, 20 tests
   [junit4]  
   [junit4] Suite: org.apache.solr.core.RequestHandlersTest
   [junit4] Completed in 0.79s, 3 tests
   [junit4]  
   [junit4] Suite: org.apache.solr.handler.XmlUpdateRequestHandlerTest
   [junit4] Completed in 0.73s, 3 tests
   [junit4]  
   [junit4] Suite: org.apache.solr.spelling.FileBasedSpellCheckerTest
   [junit4] Completed in 0.86s, 3 tests
   [junit4]  
   [junit4] Suite: org.apache.solr.search.TestQueryUtils
   [junit4] Completed in 0.87s, 1 test
   [junit4]  
   [junit4] Suite: org.apache.solr.response.TestPHPSerializedResponseWriter
   [junit4] Completed in 0.76s, 2 tests
   [junit4]  
   [junit4] Suite: org.apache.solr.DisMaxRequestHandlerTest
   [junit4] Completed in 0.94s, 3 tests
   [junit4]  
   [junit4] Suite: org.apache.solr.handler.JsonLoaderTest
   [junit4] Completed in 0.86s, 5 tests
   [junit4]  
   [junit4] Suite: org.apache.solr.core.TestArbitraryIndexDir
   [junit4] Completed in 0.80s, 1 test
   [junit4]  
   [junit4] Suite: org.apache.solr.schema.TestCollationField
   [junit4] Completed in 0.30s, 8 tests
   [junit4]  
   [junit4] Suite: org.apache.solr.search.QueryParsingTest
   [junit4] Completed in 0.72s, 3 tests
   [junit4]  
   [junit4] Suite: org.apache.solr.core.TestXIncludeConfig
   [junit4] Completed in 0.71s, 1 test
   [junit4]  
   [junit4] Suite: org.apache.solr.schema.UUIDFieldTest
   [junit4] Completed in 0.01s, 1 test
   [junit4]  
   [junit4] Suite: org.apache.solr.search.TestSearchPerf
   [junit4] Completed in 0.42s, 1 test
   [junit4]  
   [junit4] Suite: org.apache.solr.analysis.TestJapaneseBaseFormFilterFactory
   [junit4] Completed in 0.21s, 1 test
   [junit4]  
   [junit4] Suite: org.apache.solr.analysis.TestJapanesePartOfSpeechStopFilterFactory
   [junit4] Completed in 0.01s, 1 test
   [junit4]  
   [junit4] Suite: org.apache.solr.analysis.TestJapaneseTokenizerFactory
   [junit4] Completed in 0.02s, 4 tests
   [junit4]  
   [junit4] Suite: org.apache.solr.MinimalSchemaTest
   [junit4] Completed in 0.30s, 3 tests
   [junit4]  
   [junit4] Suite: org.apache.solr.search.similarities.TestDefaultSimilarityFactory
   [junit4] Completed in 0.13s, 1 test
   [junit4]  
   [junit4] Suite: org.apache.solr.schema.NotRequiredUniqueKeyTest
   [junit4] Completed in 0.23s, 1 test
   [junit4]  
   [junit4] Suite: org.apache.solr.spelling.suggest.TestPhraseSuggestions
   [junit4] Completed in 0.18s, 1 test
   [junit4]  
   [junit4] Suite: org.apache.solr.EchoParamsTest
   [junit4] Completed in 0.14s, 1 test
   [junit4]  
   [junit4] Suite: org.apache.solr.search.TestFastLRUCache
   [junit4] Completed in 0.05s, 7 tests
   [junit4]  
   [junit4] Suite: org.apache.solr.analysis.TestHTMLStripCharFilterFactory
   [junit4] Completed in 0.02s, 6 tests
   [junit4]  
   [junit4] Suite: org.apache.solr.core.ResourceLoaderTest
   [junit4] Completed in 0.03s, 4 tests
   [junit4]  
   [junit4] Suite: org.apache.solr.schema.OpenExchangeRatesOrgProviderTest
   [junit4] Completed in 0.02s, 5 tests
   [junit4]  
   [junit4] Suite: org.apache.solr.analysis.TestNGramFilters
   [junit4] Completed in 0.05s, 10 tests
   [junit4]  
   [junit4] Suite: org.apache.solr.analysis.TestPatternReplaceCharFilterFactory
   [junit4] Completed in 0.06s, 3 tests
   [junit4]  
   [junit4] Suite: org.apache.solr.analysis.TestGalicianMinimalStemFilterFactory
   [junit4] Completed in 0.01s, 1 test
   [junit4]  
   [junit4] Suite: org.apache.solr.internal.csv.CSVUtilsTest
   [junit4] Completed in 0.03s, 14 tests
   [junit4]  
   [junit4] Suite: org.apache.solr.analysis.TestLatvianStemFilterFactory
   [junit4] Completed in 0.01s, 1 test
   [junit4]  
   [junit4] Suite: org.apache.solr.util.TestUtils
   [junit4] Completed in 0.02s, 3 tests
   [junit4]  
   [junit4] Suite: org.apache.solr.analysis.TestHungarianLightStemFilterFactory
   [junit4] Completed in 0.01s, 1 test
   [junit4]  
   [junit4] Suite: org.apache.solr.spelling.TestSuggestSpellingConverter
   [junit4] Completed in 0.01s, 2 tests
   [junit4]  
   [junit4] Suite: org.apache.solr.analysis.TestGreekStemFilterFactory
   [junit4] Completed in 0.01s, 1 test
   [junit4]  
   [junit4] Suite: org.apache.solr.analysis.TestFrenchMinimalStemFilterFactory
   [junit4] Completed in 0.01s, 1 test
   [junit4]  
   [junit4] Suite: org.apache.solr.analysis.TestIrishLowerCaseFilterFactory
   [junit4] Completed in 0.01s, 1 test
   [junit4]  
   [junit4] Suite: org.apache.solr.analysis.TestPatternTokenizerFactory
   [junit4] Completed in 0.01s, 1 test
   [junit4]  
   [junit4] Suite: org.apache.solr.analysis.TestStemmerOverrideFilterFactory
   [junit4] Completed in 0.01s, 2 tests
   [junit4]  
   [junit4] Suite: org.apache.solr.analysis.TestDelimitedPayloadTokenFilterFactory
   [junit4] Completed in 0.01s, 2 tests
   [junit4]  
   [junit4] Suite: org.apache.solr.analysis.TestChineseFilterFactory
   [junit4] Completed in 0.01s, 1 test
   [junit4]  
   [junit4] Suite: org.apache.solr.analysis.TestItalianLightStemFilterFactory
   [junit4] Completed in 0.02s, 1 test
   [junit4]  
   [junit4] Suite: org.apache.solr.analysis.TestReverseStringFilterFactory
   [junit4] Completed in 0.01s, 1 test
   [junit4]  
   [junit4] Suite: org.apache.solr.core.RAMDirectoryFactoryTest
   [junit4] Completed in 0.01s, 1 test
   [junit4]  
   [junit4] Suite: org.apache.solr.internal.csv.writer.CSVFieldTest
   [junit4] Completed in 0.00s, 2 tests
   [junit4]  
   [junit4] Suite: org.apache.solr.analysis.TestRemoveDuplicatesTokenFilterFactory
   [junit4] Completed in 0.01s, 1 test
   [junit4]  
   [junit4] Suite: org.apache.solr.cloud.ChaosMonkeySafeLeaderTest
   [junit4] Completed in 0.00s, 0 tests
   [junit4]  
   [junit4] Suite: org.apache.solr.update.TestUpdate
   [junit4] Completed in 0.86s, 1 test
   [junit4]  
   [junit4] JVM J0:     1.32 ..   957.97 =   956.64s
   [junit4] Execution time total: 15 minutes 58 seconds
   [junit4] Tests summary: 286 suites, 967 tests, 1 failure, 7 ignored (2 assumptions)

BUILD FAILED
<http://jenkins.sd-datasolutions.de/job/Windows-Lucene-Solr-tests-only-trunk-java7/ws/build.xml>:29:
The following error occurred while executing this line:
<http://jenkins.sd-datasolutions.de/job/Windows-Lucene-Solr-tests-only-trunk-java7/ws/solr\build.xml>:144:
The following error occurred while executing this line:
<http://jenkins.sd-datasolutions.de/job/Windows-Lucene-Solr-tests-only-trunk-java7/ws/lucene\module-build.xml>:62:
The following error occurred while executing this line:
<http://jenkins.sd-datasolutions.de/job/Windows-Lucene-Solr-tests-only-trunk-java7/ws/lucene\common-build.xml>:1019:
The following error occurred while executing this line:
<http://jenkins.sd-datasolutions.de/job/Windows-Lucene-Solr-tests-only-trunk-java7/ws/lucene\common-build.xml>:745:
There were test failures: 286 suites, 967 tests, 1 failure, 7 ignored (2 assumptions)

Total time: 37 minutes 17 seconds
Build step 'Invoke Ant' marked build as failure
Recording test results

---------------------------------------------------------------------
To unsubscribe, e-mail: dev-unsubscribe@lucene.apache.org
For additional commands, e-mail: dev-help@lucene.apache.org


Mime
View raw message