lucene-dev mailing list archives

Site index · List index
Message view « Date » · « Thread »
Top « Date » · « Thread »
From jenk...@sd-datasolutions.de
Subject Build failed in Jenkins: Lucene-Solr-trunk-Linux-Java7-64 #94
Date Tue, 22 May 2012 21:20:02 GMT
See <http://jenkins.sd-datasolutions.de/job/Lucene-Solr-trunk-Linux-Java7-64/94/>

------------------------------------------
[...truncated 11516 lines...]
clover.info:
     [echo] 
     [echo]       Clover not found. Code coverage reports disabled.
     [echo]   	

clover:

common.compile-core:

compile-core:

compile-test-framework:

ivy-availability-check:

ivy-fail:

ivy-configure:

resolve:
[ivy:retrieve] :: loading settings :: url = jar:file:/var/lib/jenkins/.ant/lib/ivy-2.2.0.jar!/org/apache/ivy/core/settings/ivysettings.xml

init:

compile-lucene-core:

compile-core:

common.compile-test:
    [mkdir] Created dir: /mnt/ssd/jenkins/workspace/Lucene-Solr-trunk-Linux-Java7-64/checkout/solr/build/solr-solrj/classes/test
    [javac] Compiling 47 source files to /mnt/ssd/jenkins/workspace/Lucene-Solr-trunk-Linux-Java7-64/checkout/solr/build/solr-solrj/classes/test
    [javac] warning: [options] bootstrap class path not set in conjunction with -source 1.6
    [javac] Note: /mnt/ssd/jenkins/workspace/Lucene-Solr-trunk-Linux-Java7-64/checkout/solr/solrj/src/test/org/apache/solr/client/solrj/SolrQueryTest.java
uses or overrides a deprecated API.
    [javac] Note: Recompile with -Xlint:deprecation for details.
    [javac] Note: Some input files use unchecked or unsafe operations.
    [javac] Note: Recompile with -Xlint:unchecked for details.
    [javac] 1 warning

compile-test:

install-junit4-taskdef:

compile-tools:

ivy-availability-check:

ivy-fail:

ivy-configure:
[ivy:configure] :: loading settings :: file = /mnt/ssd/jenkins/workspace/Lucene-Solr-trunk-Linux-Java7-64/checkout/lucene/ivy-settings.xml

resolve:

init:

compile-core:

validate:

common.test:
    [mkdir] Created dir: /mnt/ssd/jenkins/workspace/Lucene-Solr-trunk-Linux-Java7-64/checkout/solr/build/solr-solrj/test
   [junit4] <JUnit4> says hello! Master seed: 9FD08EA239599611
   [junit4] Executing 40 suites with 2 JVMs.
   [junit4] Suite: org.apache.solr.common.util.NamedListTest
   [junit4] Completed on J0 in 0.23s, 1 test
   [junit4]  
   [junit4] Suite: org.apache.solr.client.solrj.beans.TestDocumentObjectBinder
   [junit4] Completed on J1 in 0.38s, 5 tests
   [junit4]  
   [junit4] Suite: org.apache.solr.client.solrj.TestBatchUpdate
   [junit4] Completed on J1 in 4.84s, 3 tests
   [junit4]  
   [junit4] Suite: org.apache.solr.common.params.ModifiableSolrParamsTest
   [junit4] Completed on J1 in 0.05s, 5 tests
   [junit4]  
   [junit4] Suite: org.apache.solr.client.solrj.response.DocumentAnalysisResponseTest
   [junit4] Completed on J1 in 0.03s, 1 test
   [junit4]  
   [junit4] Suite: org.apache.solr.client.solrj.SolrExceptionTest
   [junit4] Completed on J1 in 0.02s, 1 test
   [junit4]  
   [junit4] Suite: org.apache.solr.common.util.TestNamedListCodec
   [junit4] Completed on J1 in 0.53s, 4 tests
   [junit4]  
   [junit4] Suite: org.apache.solr.client.solrj.embedded.LargeVolumeBinaryJettyTest
   [junit4] Completed on J1 in 1.21s, 1 test
   [junit4]  
   [junit4] Suite: org.apache.solr.client.solrj.embedded.LargeVolumeJettyTest
   [junit4] Completed on J1 in 1.11s, 1 test
   [junit4]  
   [junit4] Suite: org.apache.solr.client.solrj.embedded.TestEmbeddedSolrServer
   [junit4] Completed on J1 in 0.76s, 2 tests
   [junit4]  
   [junit4] Suite: org.apache.solr.client.solrj.embedded.SolrExampleStreamingTest
   [junit4] Completed on J0 in 15.71s, 21 tests
   [junit4]  
   [junit4] Suite: org.apache.solr.client.solrj.response.TermsResponseTest
   [junit4] Completed on J0 in 0.92s, 1 test
   [junit4]  
   [junit4] Suite: org.apache.solr.client.solrj.impl.BasicHttpSolrServerTest
   [junit4] Completed on J0 in 3.08s, 7 tests
   [junit4]  
   [junit4] Suite: org.apache.solr.client.solrj.response.TestSpellCheckResponse
   [junit4] Completed on J0 in 0.99s, 3 tests
   [junit4]  
   [junit4] Suite: org.apache.solr.client.solrj.embedded.SolrExampleStreamingBinaryTest
   [junit4] Completed on J1 in 12.68s, 21 tests
   [junit4]  
   [junit4] Suite: org.apache.solr.common.params.SolrParamTest
   [junit4] Completed on J1 in 0.01s, 1 test
   [junit4]  
   [junit4] Suite: org.apache.solr.common.util.TestHash
   [junit4] Completed on J1 in 0.09s, 2 tests
   [junit4]  
   [junit4] Suite: org.apache.solr.client.solrj.response.AnlysisResponseBaseTest
   [junit4] Completed on J1 in 0.01s, 2 tests
   [junit4]  
   [junit4] Suite: org.apache.solr.client.solrj.SolrQueryTest
   [junit4] Completed on J1 in 0.04s, 9 tests
   [junit4]  
   [junit4] Suite: org.apache.solr.client.solrj.embedded.MultiCoreEmbeddedTest
   [junit4] Completed on J0 in 0.49s, 1 test
   [junit4]  
   [junit4] Suite: org.apache.solr.client.solrj.embedded.MultiCoreExampleJettyTest
   [junit4] Completed on J0 in 1.29s, 2 tests
   [junit4]  
   [junit4] Suite: org.apache.solr.common.util.TestJavaBinCodec
   [junit4] Completed on J0 in 0.35s, 1 test
   [junit4]  
   [junit4] Suite: org.apache.solr.client.solrj.response.FacetFieldTest
   [junit4] Completed on J1 in 0.01s, 1 test
   [junit4]  
   [junit4] Suite: org.apache.solr.client.solrj.embedded.JettyWebappTest
   [junit4] Completed on J1 in 1.22s, 1 test
   [junit4]  
   [junit4] Suite: org.apache.solr.client.solrj.embedded.SolrExampleJettyTest
   [junit4] Completed on J0 in 4.92s, 22 tests
   [junit4]  
   [junit4] Suite: org.apache.solr.common.util.TestFastInputStream
   [junit4] Completed on J0 in 0.01s, 1 test
   [junit4]  
   [junit4] Suite: org.apache.solr.client.solrj.TestLBHttpSolrServer
   [junit4] Completed on J1 in 5.28s, 3 tests
   [junit4]  
   [junit4] Suite: org.apache.solr.client.solrj.embedded.SolrExampleEmbeddedTest
   [junit4] Completed on J1 in 4.11s, 21 tests
   [junit4]  
   [junit4] Suite: org.apache.solr.client.solrj.SolrExampleBinaryTest
   [junit4] Completed on J0 in 4.76s, 21 tests
   [junit4]  
   [junit4] Suite: org.apache.solr.client.solrj.embedded.LargeVolumeEmbeddedTest
   [junit4] Completed on J1 in 0.89s, 1 test
   [junit4]  
   [junit4] Suite: org.apache.solr.client.solrj.embedded.TestSolrProperties
   [junit4] Completed on J0 in 1.25s, 1 test
   [junit4]  
   [junit4] Suite: org.apache.solr.client.solrj.embedded.MergeIndexesEmbeddedTest
   [junit4] Completed on J0 in 0.73s, 2 tests
   [junit4]  
   [junit4] Suite: org.apache.solr.common.SolrDocumentTest
   [junit4] Completed on J0 in 0.01s, 5 tests
   [junit4]  
   [junit4] Suite: org.apache.solr.common.util.TestXMLEscaping
   [junit4] Completed on J0 in 0.02s, 7 tests
   [junit4]  
   [junit4] Suite: org.apache.solr.common.util.ContentStreamTest
   [junit4] FAILURE 0.76s J1 | ContentStreamTest.testURLStream
   [junit4]    > Throwable #1: java.lang.AssertionError
   [junit4]    > 	at __randomizedtesting.SeedInfo.seed([9FD08EA239599611:AF54998BCDED4095]:0)
   [junit4]    > 	at org.junit.Assert.fail(Assert.java:92)
   [junit4]    > 	at org.junit.Assert.assertTrue(Assert.java:43)
   [junit4]    > 	at org.junit.Assert.assertTrue(Assert.java:54)
   [junit4]    > 	at org.apache.solr.common.util.ContentStreamTest.testURLStream(ContentStreamTest.java:109)
   [junit4]    > 	at sun.reflect.NativeMethodAccessorImpl.invoke0(Native Method)
   [junit4]    > 	at sun.reflect.NativeMethodAccessorImpl.invoke(NativeMethodAccessorImpl.java:57)
   [junit4]    > 	at sun.reflect.DelegatingMethodAccessorImpl.invoke(DelegatingMethodAccessorImpl.java:43)
   [junit4]    > 	at java.lang.reflect.Method.invoke(Method.java:601)
   [junit4]    > 	at com.carrotsearch.randomizedtesting.RandomizedRunner.invoke(RandomizedRunner.java:1969)
   [junit4]    > 	at com.carrotsearch.randomizedtesting.RandomizedRunner.access$1100(RandomizedRunner.java:132)
   [junit4]    > 	at com.carrotsearch.randomizedtesting.RandomizedRunner$6.evaluate(RandomizedRunner.java:814)
   [junit4]    > 	at com.carrotsearch.randomizedtesting.RandomizedRunner$7.evaluate(RandomizedRunner.java:875)
   [junit4]    > 	at com.carrotsearch.randomizedtesting.RandomizedRunner$8.evaluate(RandomizedRunner.java:889)
   [junit4]    > 	at org.apache.lucene.util.TestRuleSetupTeardownChained$1.evaluate(TestRuleSetupTeardownChained.java:50)
   [junit4]    > 	at org.apache.lucene.util.TestRuleFieldCacheSanity$1.evaluate(TestRuleFieldCacheSanity.java:32)
   [junit4]    > 	at org.apache.lucene.util.AbstractBeforeAfterRule$1.evaluate(AbstractBeforeAfterRule.java:45)
   [junit4]    > 	at com.carrotsearch.randomizedtesting.rules.SystemPropertiesInvariantRule$1.evaluate(SystemPropertiesInvariantRule.java:55)
   [junit4]    > 	at org.apache.lucene.util.TestRuleReportUncaughtExceptions$1.evaluate(TestRuleReportUncaughtExceptions.java:68)
   [junit4]    > 	at org.apache.lucene.util.TestRuleThreadAndTestName$1.evaluate(TestRuleThreadAndTestName.java:48)
   [junit4]    > 	at org.apache.lucene.util.TestRuleMarkFailure$1.evaluate(TestRuleMarkFailure.java:48)
   [junit4]    > 	at com.carrotsearch.randomizedtesting.RandomizedRunner.runSingleTest(RandomizedRunner.java:821)
   [junit4]    > 	at com.carrotsearch.randomizedtesting.RandomizedRunner.access$700(RandomizedRunner.java:132)
   [junit4]    > 	at com.carrotsearch.randomizedtesting.RandomizedRunner$3$1.run(RandomizedRunner.java:669)
   [junit4]    > 	at com.carrotsearch.randomizedtesting.RandomizedRunner$3.evaluate(RandomizedRunner.java:695)
   [junit4]    > 	at com.carrotsearch.randomizedtesting.RandomizedRunner$4.evaluate(RandomizedRunner.java:734)
   [junit4]    > 	at com.carrotsearch.randomizedtesting.RandomizedRunner$5.evaluate(RandomizedRunner.java:745)
   [junit4]    > 	at org.apache.lucene.util.AbstractBeforeAfterRule$1.evaluate(AbstractBeforeAfterRule.java:45)
   [junit4]    > 	at org.apache.lucene.util.TestRuleReportUncaughtExceptions$1.evaluate(TestRuleReportUncaughtExceptions.java:68)
   [junit4]    > 	at org.apache.lucene.util.TestRuleStoreClassName$1.evaluate(TestRuleStoreClassName.java:38)
   [junit4]    > 	at org.apache.lucene.util.TestRuleIcuHack$1.evaluate(TestRuleIcuHack.java:51)
   [junit4]    > 	at com.carrotsearch.randomizedtesting.rules.SystemPropertiesInvariantRule$1.evaluate(SystemPropertiesInvariantRule.java:55)
   [junit4]    > 	at org.apache.lucene.util.TestRuleNoInstanceHooksOverrides$1.evaluate(TestRuleNoInstanceHooksOverrides.java:53)
   [junit4]    > 	at org.apache.lucene.util.TestRuleNoStaticHooksShadowing$1.evaluate(TestRuleNoStaticHooksShadowing.java:52)
   [junit4]    > 	at org.apache.lucene.util.TestRuleAssertionsRequired$1.evaluate(TestRuleAssertionsRequired.java:36)
   [junit4]    > 	at org.apache.lucene.util.TestRuleMarkFailure$1.evaluate(TestRuleMarkFailure.java:48)
   [junit4]    > 	at org.apache.lucene.util.TestRuleIgnoreTestSuites$1.evaluate(TestRuleIgnoreTestSuites.java:56)
   [junit4]    > 	at com.carrotsearch.randomizedtesting.RandomizedRunner.runSuite(RandomizedRunner.java:605)
   [junit4]    > 	at com.carrotsearch.randomizedtesting.RandomizedRunner.access$400(RandomizedRunner.java:132)
   [junit4]    > 	at com.carrotsearch.randomizedtesting.RandomizedRunner$2.run(RandomizedRunner.java:551)
   [junit4]    > 
   [junit4]   2> NOTE: reproduce with: ant test -Dtestcase=ContentStreamTest -Dtests.method=testURLStream
-Dtests.seed=9FD08EA239599611 -Dtests.locale=sl -Dtests.timezone=Asia/Kuala_Lumpur -Dtests.multiplier=3
-Dargs="-Dfile.encoding=UTF-8"
   [junit4]   2>
   [junit4]    > (@AfterClass output)
   [junit4]   2> NOTE: test params are: codec=Lucene40, sim=RandomSimilarityProvider(queryNorm=true,coord=true):
{}, locale=sl, timezone=Asia/Kuala_Lumpur
   [junit4]   2> NOTE: Linux 2.6.32-41-server amd64/Oracle Corporation 1.7.0_04 (64-bit)/cpus=8,threads=1,free=51402640,total=131072000
   [junit4]   2> NOTE: All tests run in this JVM: [TestDocumentObjectBinder, TestBatchUpdate,
ModifiableSolrParamsTest, DocumentAnalysisResponseTest, SolrExceptionTest, TestNamedListCodec,
LargeVolumeBinaryJettyTest, LargeVolumeJettyTest, TestEmbeddedSolrServer, SolrExampleStreamingBinaryTest,
SolrParamTest, TestHash, AnlysisResponseBaseTest, SolrQueryTest, FacetFieldTest, JettyWebappTest,
TestLBHttpSolrServer, SolrExampleEmbeddedTest, LargeVolumeEmbeddedTest, ContentStreamTest]
   [junit4]   2> 
   [junit4] Completed on J1 in 0.77s, 3 tests, 1 failure <<< FAILURES!
   [junit4]  
   [junit4] Suite: org.apache.solr.client.solrj.response.QueryResponseTest
   [junit4] Completed on J0 in 0.02s, 3 tests
   [junit4]  
   [junit4] Suite: org.apache.solr.common.util.IteratorChainTest
   [junit4] Completed on J1 in 0.02s, 7 tests
   [junit4]  
   [junit4] Suite: org.apache.solr.client.solrj.request.TestUpdateRequestCodec
   [junit4] Completed on J0 in 0.01s, 2 tests
   [junit4]  
   [junit4] Suite: org.apache.solr.client.solrj.util.ClientUtilsTest
   [junit4] Completed on J1 in 0.01s, 1 test
   [junit4]  
   [junit4] Suite: org.apache.solr.client.solrj.response.FieldAnalysisResponseTest
   [junit4] Completed on J0 in 0.01s, 1 test
   [junit4]  
   [junit4] JVM J0:     0.59 ..    36.77 =    36.18s
   [junit4] JVM J1:     0.59 ..    36.74 =    36.15s
   [junit4] Execution time total: 36 seconds
   [junit4] Tests summary: 40 suites, 198 tests, 1 failure

BUILD FAILED
/mnt/ssd/jenkins/workspace/Lucene-Solr-trunk-Linux-Java7-64/checkout/build.xml:29: The following
error occurred while executing this line:
/mnt/ssd/jenkins/workspace/Lucene-Solr-trunk-Linux-Java7-64/checkout/solr/build.xml:151: The
following error occurred while executing this line:
/mnt/ssd/jenkins/workspace/Lucene-Solr-trunk-Linux-Java7-64/checkout/lucene/module-build.xml:62:
The following error occurred while executing this line:
/mnt/ssd/jenkins/workspace/Lucene-Solr-trunk-Linux-Java7-64/checkout/lucene/common-build.xml:1019:
The following error occurred while executing this line:
/mnt/ssd/jenkins/workspace/Lucene-Solr-trunk-Linux-Java7-64/checkout/lucene/common-build.xml:745:
There were test failures: 40 suites, 198 tests, 1 failure

Total time: 18 minutes 9 seconds
Build step 'Execute shell' marked build as failure
Archiving artifacts
Recording test results

---------------------------------------------------------------------
To unsubscribe, e-mail: dev-unsubscribe@lucene.apache.org
For additional commands, e-mail: dev-help@lucene.apache.org


Mime
View raw message