lucene-dev mailing list archives

Site index · List index
Message view « Date » · « Thread »
Top « Date » · « Thread »
From jenk...@sd-datasolutions.de
Subject Build failed in Jenkins: Lucene-Solr-trunk-Windows-Java6-64 #351
Date Thu, 31 May 2012 21:54:52 GMT
See <http://jenkins.sd-datasolutions.de/job/Lucene-Solr-trunk-Windows-Java6-64/351/>

------------------------------------------
[...truncated 10516 lines...]
   [junit4]   2> 	at sun.nio.ch.SocketChannelImpl.finishConnect(SocketChannelImpl.java:599)
   [junit4]   2> 	at org.apache.zookeeper.ClientCnxn$SendThread.run(ClientCnxn.java:1146)
   [junit4]   2> 
   [junit4]   2> 168401 T3160 oas.SolrTestCaseJ4.endTrackingSearchers SEVERE ERROR: SolrIndexSearcher
opens=430 closes=429
   [junit4]   2> NOTE: test params are: codec=Lucene40: {}, sim=RandomSimilarityProvider(queryNorm=false,coord=true):
{}, locale=is, timezone=Europe/Vienna
   [junit4]   2> NOTE: Windows 7 6.1 amd64/Sun Microsystems Inc. 1.6.0_32 (64-bit)/cpus=2,threads=2,free=161686656,total=259457024
   [junit4]   2> NOTE: All tests run in this JVM: [SpellCheckCollatorTest, TestIndexingPerformance,
CloudStateUpdateTest, TestRussianLightStemFilterFactory, TestValueSourceCache, IndexBasedSpellCheckerTest,
OutputWriterTest, TestQueryUtils, TestRecovery, TestHindiFilters, TestPropInjectDefaults,
TestPseudoReturnFields, TermVectorComponentTest, ConvertedLegacyTest, PrimUtilsTest, TestIndonesianStemFilterFactory,
TestDelimitedPayloadTokenFilterFactory, NoCacheHeaderTest, TestCJKWidthFilterFactory, TestNorwegianLightStemFilterFactory,
TestHTMLStripCharFilterFactory, TestThaiWordFilterFactory, TestGroupingSearch, TestHungarianLightStemFilterFactory,
BasicZkTest, TestPatternTokenizerFactory, BadComponentTest, TestFunctionQuery, TestJmxIntegration,
QueryParsingTest, TestRemoveDuplicatesTokenFilterFactory, TestPhraseSuggestions, TestDocSet,
DirectSolrConnectionTest, TestSwedishLightStemFilterFactory, TestConfig, TestNGramFilters,
TestJoin, TestSolrCoreProperties, LukeRequestHandlerTest, TestSolrDeletionPolicy1, PolyFieldTest,
NotRequiredUniqueKeyTest, TestTypeTokenFilterFactory, TestQueryTypes, XsltUpdateRequestHandlerTest,
TestMappingCharFilterFactory, TestElisionFilterFactory, TestFoldingMultitermQuery, CommonGramsFilterFactoryTest,
QueryElevationComponentTest, LengthFilterTest, TestMergePolicyConfig, SolrCoreTest, ShowFileRequestHandlerTest,
TestKStemFilterFactory, SuggesterWFSTTest, TestItalianLightStemFilterFactory, TestLuceneMatchVersion,
LeaderElectionTest, LegacyHTMLStripCharFilterTest, TestSuggestSpellingConverter, TestIndexSearcher,
TestSolrXMLSerializer, DateFieldTest, TestMultiCoreConfBootstrap, TestBinaryResponseWriter,
TestSolrQueryParser, SystemInfoHandlerTest, TestFastLRUCache, TestGreekStemFilterFactory,
TestPersianNormalizationFilterFactory, TestCapitalizationFilterFactory, TestCollationField,
TestDistributedGrouping, TestShingleFilterFactory, TestDefaultSimilarityFactory, TestFiltering,
TestLRUCache, TestSolrDeletionPolicy2, DoubleMetaphoneFilterFactoryTest, MultiTermTest, TestStopFilterFactory,
ZkControllerTest, TestLMJelinekMercerSimilarityFactory, TestCodecSupport, FieldMutatingUpdateProcessorTest,
StatsComponentTest, FullSolrCloudTest, TestGalicianStemFilterFactory, SimpleFacetsTest, TestJapaneseBaseFormFilterFactory,
TestPatternReplaceCharFilterFactory, TestPorterStemFilterFactory, TestPropInject, TestBadConfig,
PrimitiveFieldTypeTest, TestPortugueseStemFilterFactory, EchoParamsTest, UpdateRequestProcessorFactoryTest,
SignatureUpdateProcessorFactoryTest, DocumentAnalysisRequestHandlerTest, TestPortugueseMinimalStemFilterFactory,
TestBeiderMorseFilterFactory, TestWriterPerf, UpdateParamsTest, TestQuerySenderNoQuery, SolrCoreCheckLockOnStartupTest,
TestXIncludeConfig, PluginInfoTest, TestBM25SimilarityFactory, DocumentBuilderTest, ZkSolrClientTest,
ZkNodePropsTest, SnowballPorterFilterFactoryTest, TestJapanesePartOfSpeechStopFilterFactory,
SuggesterFSTTest, TestFrenchLightStemFilterFactory, FileBasedSpellCheckerTest, CloudStateTest,
TestSearchPerf, TestPortugueseLightStemFilterFactory, TestHunspellStemFilterFactory, TestHashPartitioner,
LeaderElectionIntegrationTest, MBeansHandlerTest, TestSurroundQueryParser, TermsComponentTest,
TestEnglishMinimalStemFilterFactory, TestDFRSimilarityFactory, AlternateDirectoryTest, FastVectorHighlighterTest,
OverseerTest, TestJmxMonitoredMap, JSONWriterTest, PingRequestHandlerTest, TestSynonymFilterFactory,
TestHyphenationCompoundWordTokenFilterFactory, TestOmitPositions, CoreAdminHandlerTest, TestPhoneticFilterFactory,
DirectUpdateHandlerTest, TestWordDelimiterFilterFactory, CacheHeaderTest, SoftAutoCommitTest,
DistributedSpellCheckComponentTest, TestGermanStemFilterFactory, TestReplicationHandler, TestPerFieldSimilarity,
MoreLikeThisHandlerTest, TestQuerySenderListener, TestCoreContainer, TestKeywordMarkerFilterFactory,
SpellPossibilityIteratorTest, TestGreekLowerCaseFilterFactory, NumericFieldsTest, TestLFUCache,
JsonLoaderTest, TestStandardFactories, BadIndexSchemaTest, TestReverseStringFilterFactory,
SolrRequestParserTest, UniqFieldsUpdateProcessorFactoryTest, SolrPluginUtilsTest, TestWikipediaTokenizerFactory,
SOLR749Test, TestDistributedSearch, CopyFieldTest, SolrCmdDistributorTest, TestGalicianMinimalStemFilterFactory,
TestFinnishLightStemFilterFactory, TestRemoteStreaming, DOMUtilTest, TestGermanLightStemFilterFactory,
TestCSVLoader, FullSolrCloudDistribCmdsTest, TestRandomFaceting, TestStemmerOverrideFilterFactory,
TestFaceting, OpenExchangeRatesOrgProviderTest, TestGermanNormalizationFilterFactory, TestIBSimilarityFactory,
TestRangeQuery, CurrencyFieldTest, TestTrimFilterFactory, TestTurkishLowerCaseFilterFactory,
TestNumberUtils, TestArabicFilters, HighlighterTest, URLClassifyProcessorTest, DistanceFunctionTest,
TestReversedWildcardFilterFactory, SortByFunctionTest, ReturnFieldsTest, TimeZoneUtilsTest,
RAMDirectoryFactoryTest, CSVRequestHandlerTest, TestKeepFilterFactory, TestRealTimeGet, RecoveryZkTest,
NodeStateWatcherTest, BasicDistributedZkTest]
   [junit4]   2> NOTE: reproduce with: ant test  -Dtestcase=BasicDistributedZkTest -Dtests.seed=534030036491D074
-Dtests.locale=is -Dtests.timezone=Europe/Vienna -Dargs="-Dfile.encoding=Cp1252"
   [junit4]   2> 
   [junit4] ERROR   0.00s | BasicDistributedZkTest (suite)
   [junit4]    > Throwable #1: java.lang.AssertionError: ERROR: SolrIndexSearcher opens=430
closes=429
   [junit4]    > 	at __randomizedtesting.SeedInfo.seed([534030036491D074]:0)
   [junit4]    > 	at org.junit.Assert.fail(Assert.java:93)
   [junit4]    > 	at org.apache.solr.SolrTestCaseJ4.endTrackingSearchers(SolrTestCaseJ4.java:190)
   [junit4]    > 	at org.apache.solr.SolrTestCaseJ4.afterClass(SolrTestCaseJ4.java:82)
   [junit4]    > 	at sun.reflect.GeneratedMethodAccessor15.invoke(Unknown Source)
   [junit4]    > 	at sun.reflect.DelegatingMethodAccessorImpl.invoke(DelegatingMethodAccessorImpl.java:25)
   [junit4]    > 	at java.lang.reflect.Method.invoke(Method.java:597)
   [junit4]    > 	at com.carrotsearch.randomizedtesting.RandomizedRunner.invoke(RandomizedRunner.java:1969)
   [junit4]    > 	at com.carrotsearch.randomizedtesting.RandomizedRunner.access$1100(RandomizedRunner.java:132)
   [junit4]    > 	at com.carrotsearch.randomizedtesting.RandomizedRunner$5.evaluate(RandomizedRunner.java:752)
   [junit4]    > 	at com.carrotsearch.randomizedtesting.rules.SystemPropertiesRestoreRule$1.evaluate(SystemPropertiesRestoreRule.java:53)
   [junit4]    > 	at org.apache.lucene.util.AbstractBeforeAfterRule$1.evaluate(AbstractBeforeAfterRule.java:45)
   [junit4]    > 	at org.apache.lucene.util.TestRuleReportUncaughtExceptions$1.evaluate(TestRuleReportUncaughtExceptions.java:68)
   [junit4]    > 	at org.apache.lucene.util.TestRuleStoreClassName$1.evaluate(TestRuleStoreClassName.java:38)
   [junit4]    > 	at org.apache.lucene.util.TestRuleIcuHack$1.evaluate(TestRuleIcuHack.java:51)
   [junit4]    > 	at com.carrotsearch.randomizedtesting.rules.SystemPropertiesInvariantRule$1.evaluate(SystemPropertiesInvariantRule.java:55)
   [junit4]    > 	at org.apache.lucene.util.TestRuleNoInstanceHooksOverrides$1.evaluate(TestRuleNoInstanceHooksOverrides.java:53)
   [junit4]    > 	at org.apache.lucene.util.TestRuleNoStaticHooksShadowing$1.evaluate(TestRuleNoStaticHooksShadowing.java:52)
   [junit4]    > 	at org.apache.lucene.util.TestRuleAssertionsRequired$1.evaluate(TestRuleAssertionsRequired.java:36)
   [junit4]    > 	at org.apache.lucene.util.TestRuleMarkFailure$1.evaluate(TestRuleMarkFailure.java:48)
   [junit4]    > 	at org.apache.lucene.util.TestRuleIgnoreTestSuites$1.evaluate(TestRuleIgnoreTestSuites.java:56)
   [junit4]    > 	at com.carrotsearch.randomizedtesting.RandomizedRunner.runSuite(RandomizedRunner.java:605)
   [junit4]    > 	at com.carrotsearch.randomizedtesting.RandomizedRunner.access$400(RandomizedRunner.java:132)
   [junit4]    > 	at com.carrotsearch.randomizedtesting.RandomizedRunner$2.run(RandomizedRunner.java:551)
   [junit4]    >
   [junit4] Completed in 168.42s, 1 test, 1 failure <<< FAILURES!
   [junit4]  
   [junit4] Suite: org.apache.solr.handler.component.DistributedTermsComponentTest
   [junit4] Completed in 13.71s, 1 test
   [junit4]  
   [junit4] Suite: org.apache.solr.update.AutoCommitTest
   [junit4] Completed in 9.82s, 3 tests
   [junit4]  
   [junit4] Suite: org.apache.solr.handler.component.SpellCheckComponentTest
   [junit4] Completed in 4.29s, 9 tests
   [junit4]  
   [junit4] Suite: org.apache.solr.update.PeerSyncTest
   [junit4] Completed in 4.36s, 1 test
   [junit4]  
   [junit4] Suite: org.apache.solr.handler.component.DistributedQueryElevationComponentTest
   [junit4] Completed in 4.28s, 1 test
   [junit4]  
   [junit4] Suite: org.apache.solr.search.TestSort
   [junit4] Completed in 3.22s, 2 tests
   [junit4]  
   [junit4] Suite: org.apache.solr.TestTrie
   [junit4] Completed in 1.49s, 8 tests
   [junit4]  
   [junit4] Suite: org.apache.solr.handler.StandardRequestHandlerTest
   [junit4] Completed in 0.98s, 1 test
   [junit4]  
   [junit4] Suite: org.apache.solr.spelling.suggest.SuggesterTest
   [junit4] Completed in 1.33s, 4 tests
   [junit4]  
   [junit4] Suite: org.apache.solr.BasicFunctionalityTest
   [junit4] IGNORED 0.00s | BasicFunctionalityTest.testDeepPaging
   [junit4]    > Cause: Annotated @Ignore(See SOLR-1726)
   [junit4] Completed in 2.69s, 23 tests, 1 skipped
   [junit4]  
   [junit4] Suite: org.apache.solr.SolrInfoMBeanTest
   [junit4] Completed in 0.98s, 1 test
   [junit4]  
   [junit4] Suite: org.apache.solr.search.similarities.TestLMDirichletSimilarityFactory
   [junit4] Completed in 0.16s, 2 tests
   [junit4]  
   [junit4] Suite: org.apache.solr.spelling.DirectSolrSpellCheckerTest
   [junit4] Completed in 1.03s, 2 tests
   [junit4]  
   [junit4] Suite: org.apache.solr.spelling.suggest.SuggesterTSTTest
   [junit4] Completed in 1.34s, 4 tests
   [junit4]  
   [junit4] Suite: org.apache.solr.search.SpatialFilterTest
   [junit4] Completed in 1.69s, 3 tests
   [junit4]  
   [junit4] Suite: org.apache.solr.core.RequestHandlersTest
   [junit4] Completed in 1.01s, 3 tests
   [junit4]  
   [junit4] Suite: org.apache.solr.update.SolrIndexConfigTest
   [junit4] Completed in 1.71s, 2 tests
   [junit4]  
   [junit4] Suite: org.apache.solr.handler.XmlUpdateRequestHandlerTest
   [junit4] Completed in 1.16s, 3 tests
   [junit4]  
   [junit4] Suite: org.apache.solr.handler.component.DebugComponentTest
   [junit4] Completed in 1.08s, 2 tests
   [junit4]  
   [junit4] Suite: org.apache.solr.response.TestPHPSerializedResponseWriter
   [junit4] Completed in 0.90s, 2 tests
   [junit4]  
   [junit4] Suite: org.apache.solr.DisMaxRequestHandlerTest
   [junit4] Completed in 1.08s, 3 tests
   [junit4]  
   [junit4] Suite: org.apache.solr.schema.RequiredFieldsTest
   [junit4] Completed in 0.78s, 3 tests
   [junit4]  
   [junit4] Suite: org.apache.solr.response.TestCSVResponseWriter
   [junit4] Completed in 0.85s, 1 test
   [junit4]  
   [junit4] Suite: org.apache.solr.core.IndexReaderFactoryTest
   [junit4] Completed in 0.84s, 1 test
   [junit4]  
   [junit4] Suite: org.apache.solr.update.DirectUpdateHandlerOptimizeTest
   [junit4] Completed in 0.93s, 1 test
   [junit4]  
   [junit4] Suite: org.apache.solr.highlight.HighlighterConfigTest
   [junit4] Completed in 0.87s, 1 test
   [junit4]  
   [junit4] Suite: org.apache.solr.search.TestExtendedDismaxParser
   [junit4] Completed in 7.73s, 8 tests
   [junit4]  
   [junit4] Suite: org.apache.solr.core.TestArbitraryIndexDir
   [junit4] Completed in 0.94s, 1 test
   [junit4]  
   [junit4] Suite: org.apache.solr.schema.IndexSchemaTest
   [junit4] Completed in 0.98s, 3 tests
   [junit4]  
   [junit4] Suite: org.apache.solr.handler.FieldAnalysisRequestHandlerTest
   [junit4] Completed in 0.93s, 4 tests
   [junit4]  
   [junit4] Suite: org.apache.solr.handler.BinaryUpdateRequestHandlerTest
   [junit4] Completed in 1.01s, 1 test
   [junit4]  
   [junit4] Suite: org.apache.solr.schema.IndexSchemaRuntimeFieldTest
   [junit4] Completed in 1.03s, 1 test
   [junit4]  
   [junit4] Suite: org.apache.solr.handler.component.SearchHandlerTest
   [junit4] Completed in 0.99s, 1 test
   [junit4]  
   [junit4] Suite: org.apache.solr.schema.UUIDFieldTest
   [junit4] Completed in 0.01s, 1 test
   [junit4]  
   [junit4] Suite: org.apache.solr.schema.TestBinaryField
   [junit4] Completed in 0.38s, 1 test
   [junit4]  
   [junit4] Suite: org.apache.solr.SampleTest
   [junit4] Completed in 0.35s, 2 tests
   [junit4]  
   [junit4] Suite: org.apache.solr.analysis.TestJapaneseTokenizerFactory
   [junit4] Completed in 0.03s, 4 tests
   [junit4]  
   [junit4] Suite: org.apache.solr.MinimalSchemaTest
   [junit4] Completed in 0.38s, 3 tests
   [junit4]  
   [junit4] Suite: org.apache.solr.TestPluginEnable
   [junit4] Completed in 0.17s, 1 test
   [junit4]  
   [junit4] Suite: org.apache.solr.analysis.TestUAX29URLEmailTokenizerFactory
   [junit4] Completed in 0.07s, 8 tests
   [junit4]  
   [junit4] Suite: org.apache.solr.util.DateMathParserTest
   [junit4] Completed in 0.07s, 8 tests
   [junit4]  
   [junit4] Suite: org.apache.solr.core.ResourceLoaderTest
   [junit4] Completed in 0.02s, 4 tests
   [junit4]  
   [junit4] Suite: org.apache.solr.internal.csv.CSVStrategyTest
   [junit4] Completed in 0.01s, 5 tests
   [junit4]  
   [junit4] Suite: org.apache.solr.util.TestSystemIdResolver
   [junit4] Completed in 0.01s, 1 test
   [junit4]  
   [junit4] Suite: org.apache.solr.analysis.TestMultiWordSynonyms
   [junit4] Completed in 0.01s, 1 test
   [junit4]  
   [junit4] Suite: org.apache.solr.analysis.TestLatvianStemFilterFactory
   [junit4] Completed in 0.01s, 1 test
   [junit4]  
   [junit4] Suite: org.apache.solr.util.TestUtils
   [junit4] Completed in 0.01s, 3 tests
   [junit4]  
   [junit4] Suite: org.apache.solr.analysis.CommonGramsQueryFilterFactoryTest
   [junit4] Completed in 0.02s, 2 tests
   [junit4]  
   [junit4] Suite: org.apache.solr.analysis.TestDictionaryCompoundWordTokenFilterFactory
   [junit4] Completed in 0.01s, 1 test
   [junit4]  
   [junit4] Suite: org.apache.solr.analysis.TestNorwegianMinimalStemFilterFactory
   [junit4] Completed in 0.01s, 1 test
   [junit4]  
   [junit4] Suite: org.apache.solr.spelling.SpellingQueryConverterTest
   [junit4] Completed in 0.02s, 4 tests
   [junit4]  
   [junit4] Suite: org.apache.solr.analysis.TestBrazilianStemFilterFactory
   [junit4] Completed in 0.01s, 1 test
   [junit4]  
   [junit4] Suite: org.apache.solr.analysis.TestPatternReplaceFilterFactory
   [junit4] Completed in 0.01s, 1 test
   [junit4]  
   [junit4] Suite: org.apache.solr.analysis.TestFrenchMinimalStemFilterFactory
   [junit4] Completed in 0.01s, 1 test
   [junit4]  
   [junit4] Suite: org.apache.solr.analysis.TestIrishLowerCaseFilterFactory
   [junit4] Completed in 0.01s, 1 test
   [junit4]  
   [junit4] Suite: org.apache.solr.analysis.TestSpanishLightStemFilterFactory
   [junit4] Completed in 0.01s, 1 test
   [junit4]  
   [junit4] Suite: org.apache.solr.analysis.TestBulgarianStemFilterFactory
   [junit4] Completed in 0.01s, 1 test
   [junit4]  
   [junit4] Suite: org.apache.solr.analysis.TestCJKBigramFilterFactory
   [junit4] Completed in 0.01s, 2 tests
   [junit4]  
   [junit4] Suite: org.apache.solr.analysis.TestCzechStemFilterFactory
   [junit4] Completed in 0.01s, 1 test
   [junit4]  
   [junit4] Suite: org.apache.solr.analysis.TestGermanMinimalStemFilterFactory
   [junit4] Completed in 0.01s, 1 test
   [junit4]  
   [junit4] Suite: org.apache.solr.util.FileUtilsTest
   [junit4] Completed in 0.01s, 1 test
   [junit4]  
   [junit4] Suite: org.apache.solr.cloud.ChaosMonkeyNothingIsSafeTest
   [junit4] Completed in 0.00s, 0 tests
   [junit4]  
   [junit4] Suite: org.apache.solr.cloud.ChaosMonkeySafeLeaderTest
   [junit4] Completed in 0.00s, 0 tests
   [junit4]  
   [junit4] Suite: org.apache.solr.handler.admin.LoggingHandlerTest
   [junit4] Completed in 0.90s, 1 test
   [junit4]  
   [junit4] Suite: org.apache.solr.update.TestUpdate
   [junit4] Completed in 0.97s, 1 test
   [junit4]  
   [junit4] JVM J0:     0.83 ..  1015.12 =  1014.28s
   [junit4] Execution time total: 16 minutes 55 seconds
   [junit4] Tests summary: 278 suites, 941 tests, 1 suite-level error, 10 ignored (5 assumptions)

BUILD FAILED
<http://jenkins.sd-datasolutions.de/job/Lucene-Solr-trunk-Windows-Java6-64/ws/build.xml>:29:
The following error occurred while executing this line:
<http://jenkins.sd-datasolutions.de/job/Lucene-Solr-trunk-Windows-Java6-64/ws/solr\build.xml>:144:
The following error occurred while executing this line:
<http://jenkins.sd-datasolutions.de/job/Lucene-Solr-trunk-Windows-Java6-64/ws/lucene\module-build.xml>:62:
The following error occurred while executing this line:
<http://jenkins.sd-datasolutions.de/job/Lucene-Solr-trunk-Windows-Java6-64/ws/lucene\common-build.xml>:1019:
The following error occurred while executing this line:
<http://jenkins.sd-datasolutions.de/job/Lucene-Solr-trunk-Windows-Java6-64/ws/lucene\common-build.xml>:745:
There were test failures: 278 suites, 941 tests, 1 suite-level error, 10 ignored (5 assumptions)

Total time: 32 minutes 25 seconds
Build step 'Invoke Ant' marked build as failure
Recording test results

---------------------------------------------------------------------
To unsubscribe, e-mail: dev-unsubscribe@lucene.apache.org
For additional commands, e-mail: dev-help@lucene.apache.org


Mime
View raw message