lucene-dev mailing list archives

Site index · List index
Message view « Date » · « Thread »
Top « Date » · « Thread »
From jenk...@sd-datasolutions.de
Subject Build failed in Jenkins: Lucene-Solr-tests-only-trunk #240
Date Fri, 18 May 2012 04:04:44 GMT
See <http://jenkins.sd-datasolutions.de/job/Lucene-Solr-tests-only-trunk/240/>

------------------------------------------
[...truncated 10633 lines...]
resolve:

init:

compile-core:

validate:

common.test:
    [mkdir] Created dir: /mnt/ssd/jenkins/workspace/Lucene-Solr-tests-only-trunk/checkout/solr/build/solr-solrj/test
   [junit4] <JUnit4> says hi! Master seed: 7D3FFAC7D929E032
   [junit4] Executing 40 suites with 2 JVMs.
   [junit4] Suite: org.apache.solr.client.solrj.embedded.MergeIndexesEmbeddedTest
   [junit4] Completed on J0 in 2.38s, 2 tests
   [junit4]  
   [junit4] Suite: org.apache.solr.client.solrj.response.TermsResponseTest
   [junit4] Completed on J0 in 1.26s, 1 test
   [junit4]  
   [junit4] Suite: org.apache.solr.client.solrj.SolrExampleBinaryTest
   [junit4] Completed on J0 in 5.68s, 21 tests
   [junit4]  
   [junit4] Suite: org.apache.solr.client.solrj.impl.BasicHttpSolrServerTest
   [junit4] Completed on J0 in 2.87s, 7 tests
   [junit4]  
   [junit4] Suite: org.apache.solr.client.solrj.response.FieldAnalysisResponseTest
   [junit4] Completed on J0 in 0.01s, 1 test
   [junit4]  
   [junit4] Suite: org.apache.solr.client.solrj.embedded.TestSolrProperties
   [junit4] Completed on J0 in 1.01s, 1 test
   [junit4]  
   [junit4] Suite: org.apache.solr.common.util.NamedListTest
   [junit4] Completed on J0 in 0.01s, 1 test
   [junit4]  
   [junit4] Suite: org.apache.solr.common.util.TestFastInputStream
   [junit4] Completed on J0 in 0.01s, 1 test
   [junit4]  
   [junit4] Suite: org.apache.solr.common.SolrDocumentTest
   [junit4] Completed on J0 in 0.02s, 5 tests
   [junit4]  
   [junit4] Suite: org.apache.solr.client.solrj.embedded.SolrExampleStreamingBinaryTest
   [junit4] Completed on J1 in 14.40s, 21 tests
   [junit4]  
   [junit4] Suite: org.apache.solr.client.solrj.response.TestSpellCheckResponse
   [junit4] Completed on J0 in 0.88s, 3 tests
   [junit4]  
   [junit4] Suite: org.apache.solr.common.util.TestJavaBinCodec
   [junit4] Completed on J0 in 0.26s, 1 test
   [junit4]  
   [junit4] Suite: org.apache.solr.common.util.ContentStreamTest
   [junit4] Completed on J0 in 0.76s, 3 tests
   [junit4]  
   [junit4] Suite: org.apache.solr.client.solrj.response.AnlysisResponseBaseTest
   [junit4] Completed on J1 in 0.01s, 2 tests
   [junit4]  
   [junit4] Suite: org.apache.solr.client.solrj.embedded.LargeVolumeJettyTest
   [junit4] Completed on J1 in 1.31s, 1 test
   [junit4]  
   [junit4] Suite: org.apache.solr.common.util.TestNamedListCodec
   [junit4] Completed on J1 in 0.59s, 4 tests
   [junit4]  
   [junit4] Suite: org.apache.solr.client.solrj.beans.TestDocumentObjectBinder
   [junit4] Completed on J1 in 0.04s, 5 tests
   [junit4]  
   [junit4] Suite: org.apache.solr.client.solrj.request.TestUpdateRequestCodec
   [junit4] Completed on J1 in 0.02s, 2 tests
   [junit4]  
   [junit4] Suite: org.apache.solr.client.solrj.embedded.LargeVolumeEmbeddedTest
   [junit4] Completed on J1 in 0.91s, 1 test
   [junit4]  
   [junit4] Suite: org.apache.solr.client.solrj.embedded.LargeVolumeBinaryJettyTest
   [junit4] Completed on J1 in 1.59s, 1 test
   [junit4]  
   [junit4] Suite: org.apache.solr.client.solrj.embedded.SolrExampleEmbeddedTest
   [junit4] Completed on J0 in 4.50s, 21 tests
   [junit4]  
   [junit4] Suite: org.apache.solr.common.util.TestXMLEscaping
   [junit4] Completed on J0 in 0.02s, 7 tests
   [junit4]  
   [junit4] Suite: org.apache.solr.client.solrj.util.ClientUtilsTest
   [junit4] Completed on J0 in 0.02s, 1 test
   [junit4]  
   [junit4] Suite: org.apache.solr.client.solrj.embedded.TestEmbeddedSolrServer
   [junit4] Completed on J1 in 0.66s, 2 tests
   [junit4]  
   [junit4] Suite: org.apache.solr.client.solrj.embedded.JettyWebappTest
   [junit4] Completed on J1 in 1.08s, 1 test
   [junit4]  
   [junit4] Suite: org.apache.solr.client.solrj.TestLBHttpSolrServer
   [junit4] Completed on J1 in 5.00s, 3 tests
   [junit4]  
   [junit4] Suite: org.apache.solr.client.solrj.SolrExceptionTest
   [junit4] Completed on J1 in 0.01s, 1 test
   [junit4]  
   [junit4] Suite: org.apache.solr.common.params.SolrParamTest
   [junit4] Completed on J1 in 0.01s, 1 test
   [junit4]  
   [junit4] Suite: org.apache.solr.client.solrj.TestBatchUpdate
   [junit4] Completed on J1 in 1.33s, 3 tests
   [junit4]  
   [junit4] Suite: org.apache.solr.common.params.ModifiableSolrParamsTest
   [junit4] Completed on J1 in 0.01s, 5 tests
   [junit4]  
   [junit4] Suite: org.apache.solr.client.solrj.SolrQueryTest
   [junit4] Completed on J1 in 0.04s, 9 tests
   [junit4]  
   [junit4] Suite: org.apache.solr.client.solrj.embedded.SolrExampleStreamingTest
   [junit4] Completed on J0 in 11.62s, 21 tests
   [junit4]  
   [junit4] Suite: org.apache.solr.client.solrj.embedded.SolrExampleJettyTest
   [junit4] Completed on J1 in 4.67s, 22 tests
   [junit4]  
   [junit4] Suite: org.apache.solr.client.solrj.embedded.MultiCoreEmbeddedTest
   [junit4] Completed on J1 in 0.45s, 1 test
   [junit4]  
   [junit4] Suite: org.apache.solr.client.solrj.embedded.MultiCoreExampleJettyTest
   [junit4] ERROR   0.41s J0 | MultiCoreExampleJettyTest.testDistributed
   [junit4]    > Throwable #1: org.apache.solr.common.SolrException: Server at http://localhost:49619/example/core0
returned non ok status:500, message:Server Error
   [junit4]    > 	at __randomizedtesting.SeedInfo.seed([7D3FFAC7D929E032:120D4D2FA891BE5D]:0)
   [junit4]    > 	at org.apache.solr.client.solrj.impl.HttpSolrServer.request(HttpSolrServer.java:403)
   [junit4]    > 	at org.apache.solr.client.solrj.impl.HttpSolrServer.request(HttpSolrServer.java:209)
   [junit4]    > 	at org.apache.solr.client.solrj.request.AbstractUpdateRequest.process(AbstractUpdateRequest.java:104)
   [junit4]    > 	at org.apache.solr.client.solrj.embedded.MultiCoreExampleJettyTest.testDistributed(MultiCoreExampleJettyTest.java:117)
   [junit4]    > 	at sun.reflect.NativeMethodAccessorImpl.invoke0(Native Method)
   [junit4]    > 	at sun.reflect.NativeMethodAccessorImpl.invoke(NativeMethodAccessorImpl.java:39)
   [junit4]    > 	at sun.reflect.DelegatingMethodAccessorImpl.invoke(DelegatingMethodAccessorImpl.java:25)
   [junit4]    > 	at java.lang.reflect.Method.invoke(Method.java:597)
   [junit4]    > 	at com.carrotsearch.randomizedtesting.RandomizedRunner.invoke(RandomizedRunner.java:1969)
   [junit4]    > 	at com.carrotsearch.randomizedtesting.RandomizedRunner.access$1100(RandomizedRunner.java:132)
   [junit4]    > 	at com.carrotsearch.randomizedtesting.RandomizedRunner$6.evaluate(RandomizedRunner.java:814)
   [junit4]    > 	at com.carrotsearch.randomizedtesting.RandomizedRunner$7.evaluate(RandomizedRunner.java:875)
   [junit4]    > 	at com.carrotsearch.randomizedtesting.RandomizedRunner$8.evaluate(RandomizedRunner.java:889)
   [junit4]    > 	at com.carrotsearch.randomizedtesting.rules.SystemPropertiesRestoreRule$1.evaluate(SystemPropertiesRestoreRule.java:53)
   [junit4]    > 	at org.apache.lucene.util.TestRuleSetupTeardownChained$1.evaluate(TestRuleSetupTeardownChained.java:50)
   [junit4]    > 	at org.apache.lucene.util.TestRuleFieldCacheSanity$1.evaluate(TestRuleFieldCacheSanity.java:32)
   [junit4]    > 	at org.apache.lucene.util.AbstractBeforeAfterRule$1.evaluate(AbstractBeforeAfterRule.java:45)
   [junit4]    > 	at com.carrotsearch.randomizedtesting.rules.SystemPropertiesInvariantRule$1.evaluate(SystemPropertiesInvariantRule.java:55)
   [junit4]    > 	at org.apache.lucene.util.TestRuleReportUncaughtExceptions$1.evaluate(TestRuleReportUncaughtExceptions.java:68)
   [junit4]    > 	at org.apache.lucene.util.TestRuleThreadAndTestName$1.evaluate(TestRuleThreadAndTestName.java:48)
   [junit4]    > 	at org.apache.lucene.util.TestRuleMarkFailure$1.evaluate(TestRuleMarkFailure.java:48)
   [junit4]    > 	at com.carrotsearch.randomizedtesting.RandomizedRunner.runSingleTest(RandomizedRunner.java:821)
   [junit4]    > 	at com.carrotsearch.randomizedtesting.RandomizedRunner.access$700(RandomizedRunner.java:132)
   [junit4]    > 	at com.carrotsearch.randomizedtesting.RandomizedRunner$3$1.run(RandomizedRunner.java:669)
   [junit4]    > 	at com.carrotsearch.randomizedtesting.RandomizedRunner$3.evaluate(RandomizedRunner.java:695)
   [junit4]    > 	at com.carrotsearch.randomizedtesting.RandomizedRunner$4.evaluate(RandomizedRunner.java:734)
   [junit4]    > 	at com.carrotsearch.randomizedtesting.RandomizedRunner$5.evaluate(RandomizedRunner.java:745)
   [junit4]    > 	at com.carrotsearch.randomizedtesting.rules.SystemPropertiesRestoreRule$1.evaluate(SystemPropertiesRestoreRule.java:53)
   [junit4]    > 	at org.apache.lucene.util.AbstractBeforeAfterRule$1.evaluate(AbstractBeforeAfterRule.java:45)
   [junit4]    > 	at org.apache.lucene.util.TestRuleReportUncaughtExceptions$1.evaluate(TestRuleReportUncaughtExceptions.java:68)
   [junit4]    > 	at org.apache.lucene.util.TestRuleStoreClassName$1.evaluate(TestRuleStoreClassName.java:38)
   [junit4]    > 	at org.apache.lucene.util.TestRuleIcuHack$1.evaluate(TestRuleIcuHack.java:51)
   [junit4]    > 	at com.carrotsearch.randomizedtesting.rules.SystemPropertiesInvariantRule$1.evaluate(SystemPropertiesInvariantRule.java:55)
   [junit4]    > 	at org.apache.lucene.util.TestRuleNoInstanceHooksOverrides$1.evaluate(TestRuleNoInstanceHooksOverrides.java:53)
   [junit4]    > 	at org.apache.lucene.util.TestRuleNoStaticHooksShadowing$1.evaluate(TestRuleNoStaticHooksShadowing.java:52)
   [junit4]    > 	at org.apache.lucene.util.TestRuleAssertionsRequired$1.evaluate(TestRuleAssertionsRequired.java:36)
   [junit4]    > 	at org.apache.lucene.util.TestRuleMarkFailure$1.evaluate(TestRuleMarkFailure.java:48)
   [junit4]    > 	at com.carrotsearch.randomizedtesting.RandomizedRunner.runSuite(RandomizedRunner.java:605)
   [junit4]    > 	at com.carrotsearch.randomizedtesting.RandomizedRunner.access$400(RandomizedRunner.java:132)
   [junit4]    > 	at com.carrotsearch.randomizedtesting.RandomizedRunner$2.run(RandomizedRunner.java:551)
   [junit4]    > 
   [junit4]   2> ASYNC  NEW_CORE C0 name=core0 org.apache.solr.core.SolrCore@bdf6623
   [junit4]   2> 12684 T128 C0 oasu.TransactionLog.<init> SEVERE New transaction
log already exists:/mnt/ssd/jenkins/workspace/Lucene-Solr-tests-only-trunk/checkout/solr/example/multicore/core0/data/tlog/tlog.0000000000000000003
size=67
   [junit4]   2> 12686 T128 C0 oasc.SolrException.log SEVERE null:java.lang.RuntimeException:
java.lang.AssertionError
   [junit4]   2> 		at org.apache.solr.servlet.SolrDispatchFilter.sendError(SolrDispatchFilter.java:456)
   [junit4]   2> 		at org.apache.solr.servlet.SolrDispatchFilter.doFilter(SolrDispatchFilter.java:284)
   [junit4]   2> 		at org.eclipse.jetty.servlet.ServletHandler$CachedChain.doFilter(ServletHandler.java:1337)
   [junit4]   2> 		at org.eclipse.jetty.servlet.ServletHandler.doHandle(ServletHandler.java:484)
   [junit4]   2> 		at org.eclipse.jetty.server.session.SessionHandler.doHandle(SessionHandler.java:231)
   [junit4]   2> 		at org.eclipse.jetty.server.handler.ScopedHandler.handle(ScopedHandler.java:119)
   [junit4]   2> 		at org.eclipse.jetty.server.handler.GzipHandler.handle(GzipHandler.java:267)
   [junit4]   2> 		at org.eclipse.jetty.server.handler.ContextHandler.doHandle(ContextHandler.java:1067)
   [junit4]   2> 		at org.eclipse.jetty.servlet.ServletHandler.doScope(ServletHandler.java:413)
   [junit4]   2> 		at org.eclipse.jetty.server.session.SessionHandler.doScope(SessionHandler.java:192)
   [junit4]   2> 		at org.eclipse.jetty.server.handler.ContextHandler.doScope(ContextHandler.java:999)
   [junit4]   2> 		at org.eclipse.jetty.server.handler.ScopedHandler.handle(ScopedHandler.java:117)
   [junit4]   2> 		at org.eclipse.jetty.server.handler.HandlerWrapper.handle(HandlerWrapper.java:111)
   [junit4]   2> 		at org.eclipse.jetty.server.Server.handle(Server.java:351)
   [junit4]   2> 		at org.eclipse.jetty.server.AbstractHttpConnection.handleRequest(AbstractHttpConnection.java:454)
   [junit4]   2> 		at org.eclipse.jetty.server.BlockingHttpConnection.handleRequest(BlockingHttpConnection.java:47)
   [junit4]   2> 		at org.eclipse.jetty.server.AbstractHttpConnection.content(AbstractHttpConnection.java:900)
   [junit4]   2> 		at org.eclipse.jetty.server.AbstractHttpConnection$RequestHandler.content(AbstractHttpConnection.java:954)
   [junit4]   2> 		at org.eclipse.jetty.http.HttpParser.parseNext(HttpParser.java:952)
   [junit4]   2> 		at org.eclipse.jetty.http.HttpParser.parseAvailable(HttpParser.java:235)
   [junit4]   2> 		at org.eclipse.jetty.server.BlockingHttpConnection.handle(BlockingHttpConnection.java:66)
   [junit4]   2> 		at org.eclipse.jetty.server.bio.SocketConnector$ConnectorEndPoint.run(SocketConnector.java:254)
   [junit4]   2> 		at org.eclipse.jetty.util.thread.QueuedThreadPool.runJob(QueuedThreadPool.java:599)
   [junit4]   2> 		at org.eclipse.jetty.util.thread.QueuedThreadPool$3.run(QueuedThreadPool.java:534)
   [junit4]   2> 		at java.lang.Thread.run(Thread.java:662)
   [junit4]   2> 	Caused by: java.lang.AssertionError
   [junit4]   2> 		at org.apache.solr.update.TransactionLog.<init>(TransactionLog.java:163)
   [junit4]   2> 		at org.apache.solr.update.TransactionLog.<init>(TransactionLog.java:133)
   [junit4]   2> 		at org.apache.solr.update.UpdateLog.ensureLog(UpdateLog.java:619)
   [junit4]   2> 		at org.apache.solr.update.UpdateLog.deleteByQuery(UpdateLog.java:328)
   [junit4]   2> 		at org.apache.solr.update.DirectUpdateHandler2.deleteByQuery(DirectUpdateHandler2.java:297)
   [junit4]   2> 		at org.apache.solr.update.processor.RunUpdateProcessor.processDelete(RunUpdateProcessorFactory.java:67)
   [junit4]   2> 		at org.apache.solr.update.processor.UpdateRequestProcessor.processDelete(UpdateRequestProcessor.java:55)
   [junit4]   2> 		at org.apache.solr.update.processor.DistributedUpdateProcessor.doLocalDelete(DistributedUpdateProcessor.java:365)
   [junit4]   2> 		at org.apache.solr.update.processor.DistributedUpdateProcessor.doDeleteByQuery(DistributedUpdateProcessor.java:723)
   [junit4]   2> 		at org.apache.solr.update.processor.DistributedUpdateProcessor.processDelete(DistributedUpdateProcessor.java:566)
   [junit4]   2> 		at org.apache.solr.handler.loader.XMLLoader.processDelete(XMLLoader.java:333)
   [junit4]   2> 		at org.apache.solr.handler.loader.XMLLoader.processUpdate(XMLLoader.java:264)
   [junit4]   2> 		at org.apache.solr.handler.loader.XMLLoader.load(XMLLoader.java:158)
   [junit4]   2> 		at org.apache.solr.handler.UpdateRequestHandler$1.load(UpdateRequestHandler.java:92)
   [junit4]   2> 		at org.apache.solr.handler.ContentStreamHandlerBase.handleRequestBody(ContentStreamHandlerBase.java:74)
   [junit4]   2> 		at org.apache.solr.handler.RequestHandlerBase.handleRequest(RequestHandlerBase.java:129)
   [junit4]   2> 		at org.apache.solr.core.SolrCore.execute(SolrCore.java:1555)
   [junit4]   2> 		at org.apache.solr.servlet.SolrDispatchFilter.execute(SolrDispatchFilter.java:442)
   [junit4]   2> 		at org.apache.solr.servlet.SolrDispatchFilter.doFilter(SolrDispatchFilter.java:263)
   [junit4]   2> 		... 23 more
   [junit4]   2> 	
   [junit4]   2> NOTE: reproduce with: ant test -Dtestcase=MultiCoreExampleJettyTest -Dtests.method=testDistributed
-Dtests.seed=7D3FFAC7D929E032 -Dtests.locale=zh_CN -Dtests.timezone=Antarctica/Vostok -Dtests.multiplier=3
-Dargs="-Dfile.encoding=UTF-8"
   [junit4]   2>
   [junit4]    > (@AfterClass output)
   [junit4]   2> NOTE: test params are: codec=Lucene40, sim=DefaultSimilarity, locale=zh_CN,
timezone=Antarctica/Vostok
   [junit4]   2> NOTE: Linux 2.6.32-41-server amd64/Sun Microsystems Inc. 1.6.0_32 (64-bit)/cpus=8,threads=1,free=77925904,total=208011264
   [junit4]   2> NOTE: All tests run in this JVM: [MergeIndexesEmbeddedTest, TermsResponseTest,
SolrExampleBinaryTest, BasicHttpSolrServerTest, FieldAnalysisResponseTest, TestSolrProperties,
NamedListTest, TestFastInputStream, SolrDocumentTest, TestSpellCheckResponse, TestJavaBinCodec,
ContentStreamTest, SolrExampleEmbeddedTest, TestXMLEscaping, ClientUtilsTest, SolrExampleStreamingTest,
MultiCoreExampleJettyTest]
   [junit4]   2> 
   [junit4] Completed on J0 in 1.01s, 2 tests, 1 error <<< FAILURES!
   [junit4]  
   [junit4] Suite: org.apache.solr.common.util.TestHash
   [junit4] Completed on J1 in 0.25s, 2 tests
   [junit4]  
   [junit4] Suite: org.apache.solr.client.solrj.response.QueryResponseTest
   [junit4] Completed on J0 in 0.05s, 3 tests
   [junit4]  
   [junit4] Suite: org.apache.solr.common.util.IteratorChainTest
   [junit4] Completed on J1 in 0.03s, 7 tests
   [junit4]  
   [junit4] Suite: org.apache.solr.client.solrj.response.DocumentAnalysisResponseTest
   [junit4] Completed on J0 in 0.01s, 1 test
   [junit4]  
   [junit4] Suite: org.apache.solr.client.solrj.response.FacetFieldTest
   [junit4] Completed on J1 in 0.01s, 1 test
   [junit4]  
   [junit4] JVM J0:     0.59 ..    34.35 =    33.75s
   [junit4] JVM J1:     0.58 ..    34.38 =    33.80s
   [junit4] Execution time total: 34 seconds
   [junit4] Tests summary: 40 suites, 198 tests, 1 error

BUILD FAILED
/mnt/ssd/jenkins/workspace/Lucene-Solr-tests-only-trunk/checkout/build.xml:29: The following
error occurred while executing this line:
/mnt/ssd/jenkins/workspace/Lucene-Solr-tests-only-trunk/checkout/solr/build.xml:151: The following
error occurred while executing this line:
/mnt/ssd/jenkins/workspace/Lucene-Solr-tests-only-trunk/checkout/lucene/module-build.xml:62:
The following error occurred while executing this line:
/mnt/ssd/jenkins/workspace/Lucene-Solr-tests-only-trunk/checkout/lucene/common-build.xml:1019:
The following error occurred while executing this line:
/mnt/ssd/jenkins/workspace/Lucene-Solr-tests-only-trunk/checkout/lucene/common-build.xml:745:
There were test failures: 40 suites, 198 tests, 1 error

Total time: 19 minutes 54 seconds
Build step 'Execute shell' marked build as failure
Archiving artifacts
Recording test results

---------------------------------------------------------------------
To unsubscribe, e-mail: dev-unsubscribe@lucene.apache.org
For additional commands, e-mail: dev-help@lucene.apache.org


Mime
View raw message