lucene-dev mailing list archives

Site index · List index
Message view « Date » · « Thread »
Top « Date » · « Thread »
From jenk...@sd-datasolutions.de
Subject Build failed in Jenkins: Lucene-Solr-trunk-Windows-Java6-64 #93
Date Sun, 20 May 2012 06:13:24 GMT
See <http://jenkins.sd-datasolutions.de/job/Lucene-Solr-trunk-Windows-Java6-64/93/>

------------------------------------------
[...truncated 10033 lines...]
   [junit4] Suite: org.apache.solr.handler.admin.LukeRequestHandlerTest
   [junit4] Completed in 2.91s, 3 tests
   [junit4]  
   [junit4] Suite: org.apache.solr.update.processor.SignatureUpdateProcessorFactoryTest
   [junit4] Completed in 1.37s, 6 tests
   [junit4]  
   [junit4] Suite: org.apache.solr.core.TestCoreContainer
   [junit4] Completed in 3.12s, 1 test
   [junit4]  
   [junit4] Suite: org.apache.solr.request.TestWriterPerf
   [junit4] Completed in 1.05s, 1 test
   [junit4]  
   [junit4] Suite: org.apache.solr.handler.component.TermsComponentTest
   [junit4] Completed in 1.10s, 13 tests
   [junit4]  
   [junit4] Suite: org.apache.solr.search.TestSurroundQueryParser
   [junit4] Completed in 0.85s, 1 test
   [junit4]  
   [junit4] Suite: org.apache.solr.spelling.DirectSolrSpellCheckerTest
   [junit4] Completed in 1.10s, 2 tests
   [junit4]  
   [junit4] Suite: org.apache.solr.update.processor.UniqFieldsUpdateProcessorFactoryTest
   [junit4] Completed in 0.88s, 1 test
   [junit4]  
   [junit4] Suite: org.apache.solr.spelling.SpellCheckCollatorTest
   [junit4] Completed in 1.38s, 5 tests
   [junit4]  
   [junit4] Suite: org.apache.solr.handler.XsltUpdateRequestHandlerTest
   [junit4] Completed in 0.97s, 1 test
   [junit4]  
   [junit4] Suite: org.apache.solr.spelling.suggest.SuggesterWFSTTest
   [junit4] Completed in 1.32s, 4 tests
   [junit4]  
   [junit4] Suite: org.apache.solr.core.TestPropInject
   [junit4] Completed in 1.47s, 2 tests
   [junit4]  
   [junit4] Suite: org.apache.solr.core.TestSolrDeletionPolicy1
   [junit4]    > (@BeforeClass output)
   [junit4]   2> Creating dataDir: <http://jenkins.sd-datasolutions.de/job/Lucene-Solr-trunk-Windows-Java6-64/ws/solr\build\solr-core\test\J0\.\solrtest-TestSolrDeletionPolicy1-1337494369600>
   [junit4]   2> 
   [junit4] FAILURE 0.22s | TestSolrDeletionPolicy1.testCommitAge
   [junit4]    > Throwable #1: java.lang.AssertionError
   [junit4]    > 	at __randomizedtesting.SeedInfo.seed([9E6716D37F058E2F:2BD9884F3E5CDB2F]:0)
   [junit4]    > 	at org.junit.Assert.fail(Assert.java:92)
   [junit4]    > 	at org.junit.Assert.assertTrue(Assert.java:43)
   [junit4]    > 	at org.junit.Assert.assertTrue(Assert.java:54)
   [junit4]    > 	at org.apache.solr.core.TestSolrDeletionPolicy1.testCommitAge(TestSolrDeletionPolicy1.java:129)
   [junit4]    > 	at sun.reflect.NativeMethodAccessorImpl.invoke0(Native Method)
   [junit4]    > 	at sun.reflect.NativeMethodAccessorImpl.invoke(NativeMethodAccessorImpl.java:39)
   [junit4]    > 	at sun.reflect.DelegatingMethodAccessorImpl.invoke(DelegatingMethodAccessorImpl.java:25)
   [junit4]    > 	at java.lang.reflect.Method.invoke(Method.java:597)
   [junit4]    > 	at com.carrotsearch.randomizedtesting.RandomizedRunner.invoke(RandomizedRunner.java:1969)
   [junit4]    > 	at com.carrotsearch.randomizedtesting.RandomizedRunner.access$1100(RandomizedRunner.java:132)
   [junit4]    > 	at com.carrotsearch.randomizedtesting.RandomizedRunner$6.evaluate(RandomizedRunner.java:814)
   [junit4]    > 	at com.carrotsearch.randomizedtesting.RandomizedRunner$7.evaluate(RandomizedRunner.java:875)
   [junit4]    > 	at com.carrotsearch.randomizedtesting.RandomizedRunner$8.evaluate(RandomizedRunner.java:889)
   [junit4]    > 	at com.carrotsearch.randomizedtesting.rules.SystemPropertiesRestoreRule$1.evaluate(SystemPropertiesRestoreRule.java:53)
   [junit4]    > 	at org.apache.lucene.util.TestRuleSetupTeardownChained$1.evaluate(TestRuleSetupTeardownChained.java:50)
   [junit4]    > 	at org.apache.lucene.util.TestRuleFieldCacheSanity$1.evaluate(TestRuleFieldCacheSanity.java:32)
   [junit4]    > 	at org.apache.lucene.util.AbstractBeforeAfterRule$1.evaluate(AbstractBeforeAfterRule.java:45)
   [junit4]    > 	at com.carrotsearch.randomizedtesting.rules.SystemPropertiesInvariantRule$1.evaluate(SystemPropertiesInvariantRule.java:55)
   [junit4]    > 	at org.apache.lucene.util.TestRuleReportUncaughtExceptions$1.evaluate(TestRuleReportUncaughtExceptions.java:68)
   [junit4]    > 	at org.apache.lucene.util.TestRuleThreadAndTestName$1.evaluate(TestRuleThreadAndTestName.java:48)
   [junit4]    > 	at org.apache.lucene.util.TestRuleMarkFailure$1.evaluate(TestRuleMarkFailure.java:48)
   [junit4]    > 	at com.carrotsearch.randomizedtesting.RandomizedRunner.runSingleTest(RandomizedRunner.java:821)
   [junit4]    > 	at com.carrotsearch.randomizedtesting.RandomizedRunner.access$700(RandomizedRunner.java:132)
   [junit4]    > 	at com.carrotsearch.randomizedtesting.RandomizedRunner$3$1.run(RandomizedRunner.java:669)
   [junit4]    > 	at com.carrotsearch.randomizedtesting.RandomizedRunner$3.evaluate(RandomizedRunner.java:695)
   [junit4]    > 	at com.carrotsearch.randomizedtesting.RandomizedRunner$4.evaluate(RandomizedRunner.java:734)
   [junit4]    > 	at com.carrotsearch.randomizedtesting.RandomizedRunner$5.evaluate(RandomizedRunner.java:745)
   [junit4]    > 	at com.carrotsearch.randomizedtesting.rules.SystemPropertiesRestoreRule$1.evaluate(SystemPropertiesRestoreRule.java:53)
   [junit4]    > 	at org.apache.lucene.util.AbstractBeforeAfterRule$1.evaluate(AbstractBeforeAfterRule.java:45)
   [junit4]    > 	at org.apache.lucene.util.TestRuleReportUncaughtExceptions$1.evaluate(TestRuleReportUncaughtExceptions.java:68)
   [junit4]    > 	at org.apache.lucene.util.TestRuleStoreClassName$1.evaluate(TestRuleStoreClassName.java:38)
   [junit4]    > 	at org.apache.lucene.util.TestRuleIcuHack$1.evaluate(TestRuleIcuHack.java:51)
   [junit4]    > 	at com.carrotsearch.randomizedtesting.rules.SystemPropertiesInvariantRule$1.evaluate(SystemPropertiesInvariantRule.java:55)
   [junit4]    > 	at org.apache.lucene.util.TestRuleNoInstanceHooksOverrides$1.evaluate(TestRuleNoInstanceHooksOverrides.java:53)
   [junit4]    > 	at org.apache.lucene.util.TestRuleNoStaticHooksShadowing$1.evaluate(TestRuleNoStaticHooksShadowing.java:52)
   [junit4]    > 	at org.apache.lucene.util.TestRuleAssertionsRequired$1.evaluate(TestRuleAssertionsRequired.java:36)
   [junit4]    > 	at org.apache.lucene.util.TestRuleMarkFailure$1.evaluate(TestRuleMarkFailure.java:48)
   [junit4]    > 	at org.apache.lucene.util.TestRuleIgnoreTestSuites$1.evaluate(TestRuleIgnoreTestSuites.java:56)
   [junit4]    > 	at com.carrotsearch.randomizedtesting.RandomizedRunner.runSuite(RandomizedRunner.java:605)
   [junit4]    > 	at com.carrotsearch.randomizedtesting.RandomizedRunner.access$400(RandomizedRunner.java:132)
   [junit4]    > 	at com.carrotsearch.randomizedtesting.RandomizedRunner$2.run(RandomizedRunner.java:551)
   [junit4]    > 
   [junit4]   2> NOTE: reproduce with: ant test -Dtestcase=TestSolrDeletionPolicy1 -Dtests.method=testCommitAge
-Dtests.seed=9E6716D37F058E2F -Dtests.locale=fr_BE -Dtests.timezone=Asia/Manila -Dargs="-Dfile.encoding=Cp1252"
   [junit4]   2>
   [junit4]    > (@AfterClass output)
   [junit4]   2> NOTE: test params are: codec=Lucene40, sim=RandomSimilarityProvider(queryNorm=true,coord=false):
{}, locale=fr_BE, timezone=Asia/Manila
   [junit4]   2> NOTE: Windows 7 6.1 amd64/Sun Microsystems Inc. 1.6.0_32 (64-bit)/cpus=2,threads=1,free=107668408,total=253362176
   [junit4]   2> NOTE: All tests run in this JVM: [TestHungarianLightStemFilterFactory,
TestCapitalizationFilterFactory, TestIndexingPerformance, TestFinnishLightStemFilterFactory,
FieldAnalysisRequestHandlerTest, TestDistributedSearch, TestPortugueseStemFilterFactory, TestIndexSearcher,
TestFrenchLightStemFilterFactory, CoreAdminHandlerTest, QueryElevationComponentTest, PolyFieldTest,
DateMathParserTest, RequestHandlersTest, TestElisionFilterFactory, TestQuerySenderNoQuery,
TestPhraseSuggestions, TestCollationField, OutputWriterTest, TestValueSourceCache, TestReversedWildcardFilterFactory,
TestReverseStringFilterFactory, TestBeiderMorseFilterFactory, TestCollationKeyFilterFactory,
DistributedQueryElevationComponentTest, TestFaceting, TestShingleFilterFactory, TestArabicFilters,
TestPortugueseLightStemFilterFactory, TestPhoneticFilterFactory, TestFoldingMultitermQuery,
FileUtilsTest, TestPersianNormalizationFilterFactory, TestGermanMinimalStemFilterFactory,
TestWikipediaTokenizerFactory, CloudStateUpdateTest, TestHashPartitioner, QueryParsingTest,
DirectUpdateHandlerOptimizeTest, TestRussianFilters, TestDocSet, TestJapanesePartOfSpeechStopFilterFactory,
TestBadConfig, OpenExchangeRatesOrgProviderTest, TestSolrQueryParser, OverseerTest, TestHunspellStemFilterFactory,
TestUAX29URLEmailTokenizerFactory, SOLR749Test, TestTrimFilterFactory, PingRequestHandlerTest,
TestOmitPositions, TestReplicationHandler, TestJapaneseTokenizerFactory, TestChineseTokenizerFactory,
DistributedTermsComponentTest, MultiTermTest, EchoParamsTest, SpellCheckComponentTest, TestCJKWidthFilterFactory,
TestRangeQuery, TestGroupingSearch, TestPropInjectDefaults, TestSpanishLightStemFilterFactory,
TestIBSimilarityFactory, SuggesterTSTTest, TestIndonesianStemFilterFactory, NoCacheHeaderTest,
SolrCmdDistributorTest, DistributedSpellCheckComponentTest, TestPorterStemFilterFactory, TestTurkishLowerCaseFilterFactory,
ResourceLoaderTest, SolrInfoMBeanTest, TestGermanLightStemFilterFactory, BinaryUpdateRequestHandlerTest,
TestBM25SimilarityFactory, BadComponentTest, TestSynonymMap, TestPseudoReturnFields, FileBasedSpellCheckerTest,
LengthFilterTest, TestFunctionQuery, SolrRequestParserTest, SuggesterFSTTest, TestSolrDeletionPolicy2,
DisMaxRequestHandlerTest, CommonGramsFilterFactoryTest, TestPatternReplaceCharFilterFactory,
TestArbitraryIndexDir, DebugComponentTest, TestFastLRUCache, StandardRequestHandlerTest, TestDelimitedPayloadTokenFilterFactory,
TestWordDelimiterFilterFactory, TestIrishLowerCaseFilterFactory, PluginInfoTest, AutoCommitTest,
TestLFUCache, TestPerFieldSimilarity, ZkControllerTest, TestBulgarianStemFilterFactory, TestFiltering,
TestDistributedGrouping, TestQuerySenderListener, TestMergePolicyConfig, TestEnglishMinimalStemFilterFactory,
TestCollationKeyRangeQueries, TestLRUCache, TestRealTimeGet, TestSuggestSpellingConverter,
SolrIndexConfigTest, TestRecovery, SpatialFilterTest, TestCSVResponseWriter, DateFieldTest,
TestDefaultSimilarityFactory, SolrCoreCheckLockOnStartupTest, LeaderElectionIntegrationTest,
TestUtils, TestPatternTokenizerFactory, DocumentBuilderTest, LeaderElectionTest, ReturnFieldsTest,
TestSearchPerf, TestTrie, TestNorwegianLightStemFilterFactory, TestSynonymFilterFactory, TestQueryUtils,
TestHTMLStripCharFilterFactory, CurrencyFieldTest, TestNGramFilters, LegacyHTMLStripCharFilterTest,
SimpleFacetsTest, TestCodecSupport, FullSolrCloudDistribCmdsTest, TestFrenchMinimalStemFilterFactory,
SortByFunctionTest, NotRequiredUniqueKeyTest, TestSystemIdResolver, TestLuceneMatchVersion,
TestSwedishLightStemFilterFactory, SolrCoreTest, TestSort, TestHindiFilters, TestJmxIntegration,
TestGermanNormalizationFilterFactory, TestDictionaryCompoundWordTokenFilterFactory, TestChineseFilterFactory,
TestBinaryField, HighlighterConfigTest, CSVRequestHandlerTest, ShowFileRequestHandlerTest,
ZkNodePropsTest, CommonGramsQueryFilterFactoryTest, IndexSchemaRuntimeFieldTest, DOMUtilTest,
TestBrazilianStemFilterFactory, SnowballPorterFilterFactoryTest, TestCSVLoader, TestMultiCoreConfBootstrap,
ZkSolrClientTest, RAMDirectoryFactoryTest, TestLatvianStemFilterFactory, TestPortugueseMinimalStemFilterFactory,
TestRemoteStreaming, XmlUpdateRequestHandlerTest, TestExtendedDismaxParser, TestThaiWordFilterFactory,
TestNorwegianMinimalStemFilterFactory, TestGreekLowerCaseFilterFactory, TestUpdate, TestJmxMonitoredMap,
TestLMDirichletSimilarityFactory, DistanceFunctionTest, TestPatternReplaceFilterFactory, CacheHeaderTest,
SearchHandlerTest, TestCJKTokenizerFactory, TestGreekStemFilterFactory, PeerSyncTest, TestBinaryResponseWriter,
SpellPossibilityIteratorTest, TestRandomFaceting, TestXIncludeConfig, IndexBasedSpellCheckerTest,
PrimitiveFieldTypeTest, CopyFieldTest, HighlighterTest, DocumentAnalysisRequestHandlerTest,
RequiredFieldsTest, UpdateParamsTest, TestRemoveDuplicatesTokenFilterFactory, TestJapaneseBaseFormFilterFactory,
TestMappingCharFilterFactory, MBeansHandlerTest, TestPHPSerializedResponseWriter, SampleTest,
BasicFunctionalityTest, BasicZkTest, TestMultiWordSynonyms, SystemInfoHandlerTest, RecoveryZkTest,
NodeStateWatcherTest, BasicDistributedZkTest, SoftAutoCommitTest, TestJoin, DirectUpdateHandlerTest,
MoreLikeThisHandlerTest, ConvertedLegacyTest, BadIndexSchemaTest, StatsComponentTest, SuggesterTest,
LukeRequestHandlerTest, SignatureUpdateProcessorFactoryTest, TestCoreContainer, TestWriterPerf,
TermsComponentTest, TestSurroundQueryParser, DirectSolrSpellCheckerTest, UniqFieldsUpdateProcessorFactoryTest,
SpellCheckCollatorTest, XsltUpdateRequestHandlerTest, SuggesterWFSTTest, TestPropInject, TestSolrDeletionPolicy1]
   [junit4]   2> 
   [junit4] Completed in 1.14s, 3 tests, 1 failure <<< FAILURES!
   [junit4]  
   [junit4] Suite: org.apache.solr.update.processor.FieldMutatingUpdateProcessorTest
   [junit4] Completed in 0.72s, 20 tests
   [junit4]  
   [junit4] Suite: org.apache.solr.highlight.FastVectorHighlighterTest
   [junit4] Completed in 0.91s, 2 tests
   [junit4]  
   [junit4] Suite: org.apache.solr.search.TestQueryTypes
   [junit4] Completed in 0.81s, 1 test
   [junit4]  
   [junit4] Suite: org.apache.solr.util.SolrPluginUtilsTest
   [junit4] Completed in 0.94s, 7 tests
   [junit4]  
   [junit4] Suite: org.apache.solr.handler.JsonLoaderTest
   [junit4] Completed in 0.81s, 5 tests
   [junit4]  
   [junit4] Suite: org.apache.solr.core.IndexReaderFactoryTest
   [junit4] Completed in 0.93s, 1 test
   [junit4]  
   [junit4] Suite: org.apache.solr.request.JSONWriterTest
   [junit4] Completed in 0.86s, 3 tests
   [junit4]  
   [junit4] Suite: org.apache.solr.schema.IndexSchemaTest
   [junit4] Completed in 1.06s, 3 tests
   [junit4]  
   [junit4] Suite: org.apache.solr.handler.component.TermVectorComponentTest
   [junit4] Completed in 1.01s, 4 tests
   [junit4]  
   [junit4] Suite: org.apache.solr.core.AlternateDirectoryTest
   [junit4] Completed in 0.81s, 1 test
   [junit4]  
   [junit4] Suite: org.apache.solr.update.processor.UpdateRequestProcessorFactoryTest
   [junit4] Completed in 0.78s, 1 test
   [junit4]  
   [junit4] Suite: org.apache.solr.schema.NumericFieldsTest
   [junit4] Completed in 0.65s, 1 test
   [junit4]  
   [junit4] Suite: org.apache.solr.schema.UUIDFieldTest
   [junit4] Completed in 0.01s, 1 test
   [junit4]  
   [junit4] Suite: org.apache.solr.util.TestNumberUtils
   [junit4] Completed in 0.22s, 1 test
   [junit4]  
   [junit4] Suite: org.apache.solr.TestSolrCoreProperties
   [junit4] Completed in 0.25s, 1 test
   [junit4]  
   [junit4] Suite: org.apache.solr.MinimalSchemaTest
   [junit4] Completed in 0.34s, 3 tests
   [junit4]  
   [junit4] Suite: org.apache.solr.servlet.DirectSolrConnectionTest
   [junit4] Completed in 0.37s, 2 tests
   [junit4]  
   [junit4] Suite: org.apache.solr.analysis.TestKStemFilterFactory
   [junit4] Completed in 0.15s, 1 test
   [junit4]  
   [junit4] Suite: org.apache.solr.core.TestConfig
   [junit4] Completed in 0.43s, 8 tests
   [junit4]  
   [junit4] Suite: org.apache.solr.search.similarities.TestDFRSimilarityFactory
   [junit4] Completed in 0.18s, 3 tests
   [junit4]  
   [junit4] Suite: org.apache.solr.analysis.TestHyphenationCompoundWordTokenFilterFactory
   [junit4] Completed in 0.17s, 2 tests
   [junit4]  
   [junit4] Suite: org.apache.solr.search.similarities.TestLMJelinekMercerSimilarityFactory
   [junit4] Completed in 0.17s, 2 tests
   [junit4]  
   [junit4] Suite: org.apache.solr.TestPluginEnable
   [junit4] Completed in 0.15s, 1 test
   [junit4]  
   [junit4] Suite: org.apache.solr.update.processor.URLClassifyProcessorTest
   [junit4] Completed in 0.04s, 7 tests
   [junit4]  
   [junit4] Suite: org.apache.solr.core.TestSolrXMLSerializer
   [junit4] Completed in 0.05s, 1 test
   [junit4]  
   [junit4] Suite: org.apache.solr.util.PrimUtilsTest
   [junit4] Completed in 0.08s, 2 tests
   [junit4]  
   [junit4] Suite: org.apache.solr.analysis.TestGalicianStemFilterFactory
   [junit4] Completed in 0.02s, 1 test
   [junit4]  
   [junit4] Suite: org.apache.solr.analysis.TestStandardFactories
   [junit4] Completed in 0.05s, 10 tests
   [junit4]  
   [junit4] Suite: org.apache.solr.analysis.TestSlowSynonymFilter
   [junit4] Completed in 0.03s, 7 tests
   [junit4]  
   [junit4] Suite: org.apache.solr.analysis.TestGalicianMinimalStemFilterFactory
   [junit4] Completed in 0.01s, 1 test
   [junit4]  
   [junit4] Suite: org.apache.solr.analysis.DoubleMetaphoneFilterFactoryTest
   [junit4] Completed in 0.01s, 3 tests
   [junit4]  
   [junit4] Suite: org.apache.solr.analysis.TestRussianLightStemFilterFactory
   [junit4] Completed in 0.02s, 1 test
   [junit4]  
   [junit4] Suite: org.apache.solr.analysis.TestTypeTokenFilterFactory
   [junit4] Completed in 0.03s, 4 tests
   [junit4]  
   [junit4] Suite: org.apache.solr.analysis.TestKeywordMarkerFilterFactory
   [junit4] Completed in 0.01s, 2 tests
   [junit4]  
   [junit4] Suite: org.apache.solr.analysis.TestStopFilterFactory
   [junit4] Completed in 0.01s, 1 test
   [junit4]  
   [junit4] Suite: org.apache.solr.spelling.SpellingQueryConverterTest
   [junit4] Completed in 0.02s, 4 tests
   [junit4]  
   [junit4] Suite: org.apache.solr.analysis.TestKeepFilterFactory
   [junit4] Completed in 0.02s, 1 test
   [junit4]  
   [junit4] Suite: org.apache.solr.analysis.TestStemmerOverrideFilterFactory
   [junit4] Completed in 0.01s, 2 tests
   [junit4]  
   [junit4] Suite: org.apache.solr.analysis.TestCJKBigramFilterFactory
   [junit4] Completed in 0.01s, 2 tests
   [junit4]  
   [junit4] Suite: org.apache.solr.analysis.TestCzechStemFilterFactory
   [junit4] Completed in 0.01s, 1 test
   [junit4]  
   [junit4] Suite: org.apache.solr.analysis.TestGermanStemFilterFactory
   [junit4] Completed in 0.01s, 1 test
   [junit4]  
   [junit4] Suite: org.apache.solr.cloud.CloudStateTest
   [junit4] Completed in 0.01s, 1 test
   [junit4]  
   [junit4] Suite: org.apache.solr.analysis.TestItalianLightStemFilterFactory
   [junit4] Completed in 0.01s, 1 test
   [junit4]  
   [junit4] Suite: org.apache.solr.cloud.ChaosMonkeySafeLeaderTest
   [junit4] Completed in 0.00s, 0 tests
   [junit4]  
   [junit4] Suite: org.apache.solr.cloud.FullSolrCloudTest
   [junit4] Completed in 0.00s, 0 tests
   [junit4]  
   [junit4] Suite: org.apache.solr.handler.admin.LoggingHandlerTest
   [junit4] Completed in 1.19s, 1 test
   [junit4]  
   [junit4] Suite: org.apache.solr.util.TimeZoneUtilsTest
   [junit4] Completed in 0.40s, 5 tests
   [junit4]  
   [junit4] JVM J0:     1.41 ..   982.97 =   981.57s
   [junit4] Execution time total: 16 minutes 23 seconds
   [junit4] Tests summary: 286 suites, 968 tests, 1 failure, 6 ignored (1 assumption)

BUILD FAILED
<http://jenkins.sd-datasolutions.de/job/Lucene-Solr-trunk-Windows-Java6-64/ws/build.xml>:29:
The following error occurred while executing this line:
<http://jenkins.sd-datasolutions.de/job/Lucene-Solr-trunk-Windows-Java6-64/ws/solr\build.xml>:144:
The following error occurred while executing this line:
<http://jenkins.sd-datasolutions.de/job/Lucene-Solr-trunk-Windows-Java6-64/ws/lucene\module-build.xml>:62:
The following error occurred while executing this line:
<http://jenkins.sd-datasolutions.de/job/Lucene-Solr-trunk-Windows-Java6-64/ws/lucene\common-build.xml>:1019:
The following error occurred while executing this line:
<http://jenkins.sd-datasolutions.de/job/Lucene-Solr-trunk-Windows-Java6-64/ws/lucene\common-build.xml>:745:
There were test failures: 286 suites, 968 tests, 1 failure, 6 ignored (1 assumption)

Total time: 37 minutes 10 seconds
Build step 'Invoke Ant' marked build as failure
Recording test results

---------------------------------------------------------------------
To unsubscribe, e-mail: dev-unsubscribe@lucene.apache.org
For additional commands, e-mail: dev-help@lucene.apache.org


Mime
View raw message