lucene-dev mailing list archives

Site index · List index
Message view « Date » · « Thread »
Top « Date » · « Thread »
From jenk...@sd-datasolutions.de
Subject Build failed in Jenkins: Windows-Lucene-Solr-tests-only-trunk #16
Date Wed, 16 May 2012 15:06:19 GMT
See <http://jenkins.sd-datasolutions.de/job/Windows-Lucene-Solr-tests-only-trunk/16/changes>

Changes:

[shaie] LUCENE-4061: improvements to DirectoryTaxonomyWriter

------------------------------------------
[...truncated 10945 lines...]
   [junit4]   2> 
   [junit4] ERROR   0.00s | BasicDistributedZkTest (suite)
   [junit4]    > Throwable #1: java.lang.AssertionError: ERROR: SolrIndexSearcher opens=79
closes=78
   [junit4]    > 	at __randomizedtesting.SeedInfo.seed([28AC1E0F19FC965A]:0)
   [junit4]    > 	at org.junit.Assert.fail(Assert.java:93)
   [junit4]    > 	at org.apache.solr.SolrTestCaseJ4.endTrackingSearchers(SolrTestCaseJ4.java:185)
   [junit4]    > 	at org.apache.solr.SolrTestCaseJ4.afterClass(SolrTestCaseJ4.java:82)
   [junit4]    > 	at sun.reflect.GeneratedMethodAccessor15.invoke(Unknown Source)
   [junit4]    > 	at sun.reflect.DelegatingMethodAccessorImpl.invoke(DelegatingMethodAccessorImpl.java:25)
   [junit4]    > 	at java.lang.reflect.Method.invoke(Method.java:597)
   [junit4]    > 	at com.carrotsearch.randomizedtesting.RandomizedRunner.invoke(RandomizedRunner.java:1969)
   [junit4]    > 	at com.carrotsearch.randomizedtesting.RandomizedRunner.access$1100(RandomizedRunner.java:132)
   [junit4]    > 	at com.carrotsearch.randomizedtesting.RandomizedRunner$5.evaluate(RandomizedRunner.java:752)
   [junit4]    > 	at com.carrotsearch.randomizedtesting.rules.SystemPropertiesRestoreRule$1.evaluate(SystemPropertiesRestoreRule.java:53)
   [junit4]    > 	at org.apache.lucene.util.AbstractBeforeAfterRule$1.evaluate(AbstractBeforeAfterRule.java:45)
   [junit4]    > 	at org.apache.lucene.util.TestRuleReportUncaughtExceptions$1.evaluate(TestRuleReportUncaughtExceptions.java:68)
   [junit4]    > 	at org.apache.lucene.util.TestRuleStoreClassName$1.evaluate(TestRuleStoreClassName.java:38)
   [junit4]    > 	at org.apache.lucene.util.TestRuleIcuHack$1.evaluate(TestRuleIcuHack.java:51)
   [junit4]    > 	at com.carrotsearch.randomizedtesting.rules.SystemPropertiesInvariantRule$1.evaluate(SystemPropertiesInvariantRule.java:55)
   [junit4]    > 	at org.apache.lucene.util.TestRuleNoInstanceHooksOverrides$1.evaluate(TestRuleNoInstanceHooksOverrides.java:53)
   [junit4]    > 	at org.apache.lucene.util.TestRuleNoStaticHooksShadowing$1.evaluate(TestRuleNoStaticHooksShadowing.java:52)
   [junit4]    > 	at org.apache.lucene.util.TestRuleAssertionsRequired$1.evaluate(TestRuleAssertionsRequired.java:36)
   [junit4]    > 	at org.apache.lucene.util.TestRuleMarkFailure$1.evaluate(TestRuleMarkFailure.java:48)
   [junit4]    > 	at com.carrotsearch.randomizedtesting.RandomizedRunner.runSuite(RandomizedRunner.java:605)
   [junit4]    > 	at com.carrotsearch.randomizedtesting.RandomizedRunner.access$400(RandomizedRunner.java:132)
   [junit4]    > 	at com.carrotsearch.randomizedtesting.RandomizedRunner$2.run(RandomizedRunner.java:551)
   [junit4]    >
   [junit4] Completed in 184.37s, 1 test, 1 failure <<< FAILURES!
   [junit4]  
   [junit4] Suite: org.apache.solr.analysis.TestPhoneticFilterFactory
   [junit4] Completed in 10.69s, 5 tests
   [junit4]  
   [junit4] Suite: org.apache.solr.TestDistributedGrouping
   [junit4] Completed in 28.89s, 1 test
   [junit4]  
   [junit4] Suite: org.apache.solr.cloud.CloudStateUpdateTest
   [junit4] Completed in 17.39s, 1 test
   [junit4]  
   [junit4] Suite: org.apache.solr.handler.component.DistributedSpellCheckComponentTest
   [junit4] Completed in 25.49s, 1 test
   [junit4]  
   [junit4] Suite: org.apache.solr.TestGroupingSearch
   [junit4] Completed in 13.82s, 11 tests
   [junit4]  
   [junit4] Suite: org.apache.solr.search.function.TestFunctionQuery
   [junit4] Completed in 6.19s, 14 tests
   [junit4]  
   [junit4] Suite: org.apache.solr.search.TestFiltering
   [junit4] Completed in 6.11s, 2 tests
   [junit4]  
   [junit4] Suite: org.apache.solr.spelling.IndexBasedSpellCheckerTest
   [junit4] Completed in 2.15s, 5 tests
   [junit4]  
   [junit4] Suite: org.apache.solr.core.TestCoreContainer
   [junit4] Completed in 5.53s, 1 test
   [junit4]  
   [junit4] Suite: org.apache.solr.search.similarities.TestLMDirichletSimilarityFactory
   [junit4] Completed in 0.24s, 2 tests
   [junit4]  
   [junit4] Suite: org.apache.solr.search.TestSurroundQueryParser
   [junit4] Completed in 2.57s, 1 test
   [junit4]  
   [junit4] Suite: org.apache.solr.spelling.DirectSolrSpellCheckerTest
   [junit4] Completed in 2.12s, 2 tests
   [junit4]  
   [junit4] Suite: org.apache.solr.handler.CSVRequestHandlerTest
   [junit4] Completed in 1.63s, 1 test
   [junit4]  
   [junit4] Suite: org.apache.solr.update.processor.UniqFieldsUpdateProcessorFactoryTest
   [junit4] Completed in 1.48s, 1 test
   [junit4]  
   [junit4] Suite: org.apache.solr.analysis.TestWordDelimiterFilterFactory
   [junit4] Completed in 2.23s, 7 tests
   [junit4]  
   [junit4] Suite: org.apache.solr.handler.XsltUpdateRequestHandlerTest
   [junit4] Completed in 1.63s, 1 test
   [junit4]  
   [junit4] Suite: org.apache.solr.servlet.CacheHeaderTest
   [junit4] Completed in 1.54s, 5 tests
   [junit4]  
   [junit4] Suite: org.apache.solr.search.TestDocSet
   [junit4] Completed in 1.11s, 2 tests
   [junit4]  
   [junit4] Suite: org.apache.solr.handler.component.DebugComponentTest
   [junit4] Completed in 1.58s, 2 tests
   [junit4]  
   [junit4] Suite: org.apache.solr.search.TestIndexSearcher
   [junit4] Completed in 2.45s, 2 tests
   [junit4]  
   [junit4] Suite: org.apache.solr.search.TestQueryUtils
   [junit4] Completed in 2.06s, 1 test
   [junit4]  
   [junit4] Suite: org.apache.solr.schema.RequiredFieldsTest
   [junit4] Completed in 1.38s, 3 tests
   [junit4]  
   [junit4] Suite: org.apache.solr.response.TestCSVResponseWriter
   [junit4] Completed in 1.58s, 1 test
   [junit4]  
   [junit4] Suite: org.apache.solr.highlight.HighlighterConfigTest
   [junit4] Completed in 1.35s, 1 test
   [junit4]  
   [junit4] Suite: org.apache.solr.request.JSONWriterTest
   [junit4] Completed in 1.40s, 3 tests
   [junit4]  
   [junit4] Suite: org.apache.solr.schema.TestCollationField
   [junit4] Completed in 0.57s, 8 tests
   [junit4]  
   [junit4] Suite: org.apache.solr.update.UpdateParamsTest
   [junit4] Completed in 1.49s, 1 test
   [junit4]  
   [junit4] Suite: org.apache.solr.analysis.TestBeiderMorseFilterFactory
   [junit4] Completed in 0.50s, 3 tests
   [junit4]  
   [junit4] Suite: org.apache.solr.schema.NumericFieldsTest
   [junit4] Completed in 0.76s, 1 test
   [junit4]  
   [junit4] Suite: org.apache.solr.util.TestNumberUtils
   [junit4] Completed in 0.30s, 1 test
   [junit4]  
   [junit4] Suite: org.apache.solr.search.TestSearchPerf
   [junit4] Completed in 0.68s, 1 test
   [junit4]  
   [junit4] Suite: org.apache.solr.analysis.TestJapaneseBaseFormFilterFactory
   [junit4] Completed in 0.01s, 1 test
   [junit4]  
   [junit4] Suite: org.apache.solr.analysis.LegacyHTMLStripCharFilterTest
   [junit4] IGNORED 0.00s | LegacyHTMLStripCharFilterTest.testRandom
   [junit4]    > Cause: Annotated @Ignore(broken offsets: see LUCENE-2208)
   [junit4] Completed in 0.25s, 13 tests, 1 skipped
   [junit4]  
   [junit4] Suite: org.apache.solr.analysis.TestKStemFilterFactory
   [junit4] Completed in 0.19s, 1 test
   [junit4]  
   [junit4] Suite: org.apache.solr.search.similarities.TestBM25SimilarityFactory
   [junit4] Completed in 0.23s, 2 tests
   [junit4]  
   [junit4] Suite: org.apache.solr.search.similarities.TestLMJelinekMercerSimilarityFactory
   [junit4] Completed in 0.21s, 2 tests
   [junit4]  
   [junit4] Suite: org.apache.solr.core.TestSolrXMLSerializer
   [junit4] Completed in 0.05s, 1 test
   [junit4]  
   [junit4] Suite: org.apache.solr.internal.csv.CSVParserTest
   [junit4] Completed in 0.04s, 23 tests
   [junit4]  
   [junit4] Suite: org.apache.solr.util.PrimUtilsTest
   [junit4] Completed in 0.04s, 2 tests
   [junit4]  
   [junit4] Suite: org.apache.solr.analysis.TestShingleFilterFactory
   [junit4] Completed in 0.04s, 13 tests
   [junit4]  
   [junit4] Suite: org.apache.solr.analysis.TestPortugueseMinimalStemFilterFactory
   [junit4] Completed in 0.02s, 1 test
   [junit4]  
   [junit4] Suite: org.apache.solr.analysis.TestStandardFactories
   [junit4] Completed in 0.13s, 10 tests
   [junit4]  
   [junit4] Suite: org.apache.solr.analysis.TestNGramFilters
   [junit4] Completed in 0.06s, 10 tests
   [junit4]  
   [junit4] Suite: org.apache.solr.internal.csv.CharBufferTest
   [junit4] Completed in 0.04s, 13 tests
   [junit4]  
   [junit4] Suite: org.apache.solr.analysis.TestPatternReplaceCharFilterFactory
   [junit4] Completed in 0.03s, 3 tests
   [junit4]  
   [junit4] Suite: org.apache.solr.analysis.TestSynonymFilterFactory
   [junit4] Completed in 0.02s, 4 tests
   [junit4]  
   [junit4] Suite: org.apache.solr.analysis.TestMultiWordSynonyms
   [junit4] Completed in 0.02s, 2 tests
   [junit4]  
   [junit4] Suite: org.apache.solr.internal.csv.CSVUtilsTest
   [junit4] Completed in 0.05s, 14 tests
   [junit4]  
   [junit4] Suite: org.apache.solr.internal.csv.ExtendedBufferedReaderTest
   [junit4] Completed in 0.02s, 8 tests
   [junit4]  
   [junit4] Suite: org.apache.solr.analysis.DoubleMetaphoneFilterFactoryTest
   [junit4] Completed in 0.02s, 3 tests
   [junit4]  
   [junit4] Suite: org.apache.solr.analysis.TestRussianLightStemFilterFactory
   [junit4] Completed in 0.01s, 1 test
   [junit4]  
   [junit4] Suite: org.apache.solr.analysis.TestElisionFilterFactory
   [junit4] Completed in 0.02s, 3 tests
   [junit4]  
   [junit4] Suite: org.apache.solr.analysis.TestFrenchLightStemFilterFactory
   [junit4] Completed in 0.03s, 1 test
   [junit4]  
   [junit4] Suite: org.apache.solr.analysis.TestTypeTokenFilterFactory
   [junit4] Completed in 0.03s, 4 tests
   [junit4]  
   [junit4] Suite: org.apache.solr.util.TestUtils
   [junit4] Completed in 0.02s, 3 tests
   [junit4]  
   [junit4] Suite: org.apache.solr.analysis.LengthFilterTest
   [junit4] Completed in 0.01s, 1 test
   [junit4]  
   [junit4] Suite: org.apache.solr.analysis.TestFinnishLightStemFilterFactory
   [junit4] Completed in 0.02s, 1 test
   [junit4]  
   [junit4] Suite: org.apache.solr.analysis.TestPatternReplaceFilterFactory
   [junit4] Completed in 0.02s, 1 test
   [junit4]  
   [junit4] Suite: org.apache.solr.analysis.TestPorterStemFilterFactory
   [junit4] Completed in 0.01s, 1 test
   [junit4]  
   [junit4] Suite: org.apache.solr.analysis.TestTrimFilterFactory
   [junit4] Completed in 0.01s, 1 test
   [junit4]  
   [junit4] Suite: org.apache.solr.internal.csv.writer.CSVConfigTest
   [junit4] Completed in 0.03s, 7 tests
   [junit4]  
   [junit4] Suite: org.apache.solr.analysis.TestGermanMinimalStemFilterFactory
   [junit4] Completed in 0.02s, 1 test
   [junit4]  
   [junit4] Suite: org.apache.solr.analysis.TestChineseFilterFactory
   [junit4] Completed in 0.01s, 1 test
   [junit4]  
   [junit4] Suite: org.apache.solr.analysis.TestGermanNormalizationFilterFactory
   [junit4] Completed in 0.01s, 1 test
   [junit4]  
   [junit4] Suite: org.apache.solr.analysis.TestMappingCharFilterFactory
   [junit4] Completed in 0.01s, 1 test
   [junit4]  
   [junit4] Suite: org.apache.solr.analysis.TestReverseStringFilterFactory
   [junit4] Completed in 0.01s, 1 test
   [junit4]  
   [junit4] Suite: org.apache.solr.cloud.ChaosMonkeyNothingIsSafeTest
   [junit4] Completed in 0.00s, 0 tests
   [junit4]  
   [junit4] Suite: org.apache.solr.cloud.ChaosMonkeySafeLeaderTest
   [junit4] Completed in 0.00s, 0 tests
   [junit4]  
   [junit4] JVM J0:     1.42 ..  1384.18 =  1382.76s
   [junit4] Execution time total: 23 minutes 4 seconds
   [junit4] Tests summary: 286 suites, 967 tests, 1 suite-level error, 2 failures, 5 ignored

BUILD FAILED
<http://jenkins.sd-datasolutions.de/job/Windows-Lucene-Solr-tests-only-trunk/ws/build.xml>:29:
The following error occurred while executing this line:
<http://jenkins.sd-datasolutions.de/job/Windows-Lucene-Solr-tests-only-trunk/ws/solr\build.xml>:144:
The following error occurred while executing this line:
<http://jenkins.sd-datasolutions.de/job/Windows-Lucene-Solr-tests-only-trunk/ws/lucene\module-build.xml>:62:
The following error occurred while executing this line:
<http://jenkins.sd-datasolutions.de/job/Windows-Lucene-Solr-tests-only-trunk/ws/lucene\common-build.xml>:1019:
The following error occurred while executing this line:
<http://jenkins.sd-datasolutions.de/job/Windows-Lucene-Solr-tests-only-trunk/ws/lucene\common-build.xml>:745:
There were test failures: 286 suites, 967 tests, 1 suite-level error, 2 failures, 5 ignored

Total time: 43 minutes 11 seconds
Build step 'Invoke Ant' marked build as failure
Recording test results

---------------------------------------------------------------------
To unsubscribe, e-mail: dev-unsubscribe@lucene.apache.org
For additional commands, e-mail: dev-help@lucene.apache.org


Mime
View raw message