lucene-dev mailing list archives

Site index · List index
Message view « Date » · « Thread »
Top « Date » · « Thread »
From jenk...@sd-datasolutions.de
Subject Build failed in Jenkins: Lucene-Solr-trunk-Windows-Java7-64 #63
Date Sun, 20 May 2012 15:34:29 GMT
See <http://jenkins.sd-datasolutions.de/job/Lucene-Solr-trunk-Windows-Java7-64/63/changes>

Changes:

[mikemccand] don't excessively call RateLimiter in tests

------------------------------------------
[...truncated 11686 lines...]
   [junit4]   2> 	at java.lang.Thread.run(Thread.java:722)
   [junit4]   2> 
   [junit4]   2> 49521 T2564 oash.SnapPuller.copyAFile SEVERE Unable to move index file
from: .\org.apache.solr.handler.TestReplicationHandler$SolrInstance-1337527806657\slave\data\index.20120520173055\_3_nrm.cfe
to: <http://jenkins.sd-datasolutions.de/job/Lucene-Solr-trunk-Windows-Java7-64/ws/solr\build\solr-core\test\J0\org.apache.solr.handler.TestReplicationHandler$SolrInstance-1337527806657\slave\data\index.20120520173014\_3_nrm.cfeTrying>
to do a copy
   [junit4]   2> 49521 T2564 oash.SnapPuller.copyAFile SEVERE Unable to copy index file
from: .\org.apache.solr.handler.TestReplicationHandler$SolrInstance-1337527806657\slave\data\index.20120520173055\_3_nrm.cfe
to: <http://jenkins.sd-datasolutions.de/job/Lucene-Solr-trunk-Windows-Java7-64/ws/solr\build\solr-core\test\J0\org.apache.solr.handler.TestReplicationHandler$SolrInstance-1337527806657\slave\data\index.20120520173014\_3_nrm.cfe>
java.io.FileNotFoundException: <http://jenkins.sd-datasolutions.de/job/Lucene-Solr-trunk-Windows-Java7-64/ws/solr\build\solr-core\test\J0\org.apache.solr.handler.TestReplicationHandler$SolrInstance-1337527806657\slave\data\index.20120520173014\_3_nrm.cfe>
(The system cannot find the path specified)
   [junit4]   2> 	at java.io.FileOutputStream.open(Native Method)
   [junit4]   2> 	at java.io.FileOutputStream.<init>(FileOutputStream.java:212)
   [junit4]   2> 	at java.io.FileOutputStream.<init>(FileOutputStream.java:165)
   [junit4]   2> 	at org.apache.solr.util.FileUtils.copyFile(FileUtils.java:48)
   [junit4]   2> 	at org.apache.solr.handler.SnapPuller.copyAFile(SnapPuller.java:661)
   [junit4]   2> 	at org.apache.solr.handler.SnapPuller.copyIndexFiles(SnapPuller.java:698)
   [junit4]   2> 	at org.apache.solr.handler.SnapPuller.fetchLatestIndex(SnapPuller.java:378)
   [junit4]   2> 	at org.apache.solr.handler.ReplicationHandler.doFetch(ReplicationHandler.java:298)
   [junit4]   2> 	at org.apache.solr.handler.SnapPuller$1.run(SnapPuller.java:176)
   [junit4]   2> 	at java.util.concurrent.Executors$RunnableAdapter.call(Executors.java:471)
   [junit4]   2> 	at java.util.concurrent.FutureTask$Sync.innerRunAndReset(FutureTask.java:351)
   [junit4]   2> 	at java.util.concurrent.FutureTask.runAndReset(FutureTask.java:178)
   [junit4]   2> 	at java.util.concurrent.ScheduledThreadPoolExecutor$ScheduledFutureTask.access$301(ScheduledThreadPoolExecutor.java:178)
   [junit4]   2> 	at java.util.concurrent.ScheduledThreadPoolExecutor$ScheduledFutureTask.run(ScheduledThreadPoolExecutor.java:293)
   [junit4]   2> 	at java.util.concurrent.ThreadPoolExecutor.runWorker(ThreadPoolExecutor.java:1110)
   [junit4]   2> 	at java.util.concurrent.ThreadPoolExecutor$Worker.run(ThreadPoolExecutor.java:603)
   [junit4]   2> 	at java.lang.Thread.run(Thread.java:722)
   [junit4]   2> 
   [junit4]   2> NOTE: reproduce with: ant test -Dtestcase=TestReplicationHandler -Dtests.method=test
-Dtests.seed=68641486B60615FF -Dtests.locale=ar_BH -Dtests.timezone=Europe/Warsaw -Dargs="-Dfile.encoding=Cp1252"
   [junit4]   2>
   [junit4]    > (@AfterClass output)
   [junit4]   2> NOTE: test params are: codec=Lucene40, sim=RandomSimilarityProvider(queryNorm=true,coord=false):
{}, locale=ar_BH, timezone=Europe/Warsaw
   [junit4]   2> NOTE: Windows 7 6.1 amd64/Oracle Corporation 1.7.0_04 (64-bit)/cpus=2,threads=1,free=51233544,total=295960576
   [junit4]   2> NOTE: All tests run in this JVM: [TestCoreContainer, TestCJKTokenizerFactory,
TestIndexingPerformance, TestCapitalizationFilterFactory, StatsComponentTest, TestShingleFilterFactory,
TestDictionaryCompoundWordTokenFilterFactory, TestGermanMinimalStemFilterFactory, SolrCoreCheckLockOnStartupTest,
TestCSVLoader, TestSuggestSpellingConverter, UpdateRequestProcessorFactoryTest, DirectSolrSpellCheckerTest,
TestStemmerOverrideFilterFactory, TestLuceneMatchVersion, EchoParamsTest, DistributedSpellCheckComponentTest,
TestCollationKeyRangeQueries, TestGalicianStemFilterFactory, TestDefaultSimilarityFactory,
TestItalianLightStemFilterFactory, DistanceFunctionTest, XmlUpdateRequestHandlerTest, SolrPluginUtilsTest,
SolrRequestParserTest, TestPatternReplaceFilterFactory, DirectUpdateHandlerOptimizeTest, CopyFieldTest,
TestUpdate, TestSolrXMLSerializer, SpellingQueryConverterTest, HighlighterConfigTest, TestSystemIdResolver,
TestFunctionQuery, TestLMJelinekMercerSimilarityFactory, NotRequiredUniqueKeyTest, DateFieldTest,
TestJmxIntegration, TestPhoneticFilterFactory, CSVRequestHandlerTest, TestFoldingMultitermQuery,
TestPortugueseStemFilterFactory, TestDistributedSearch, TestSwedishLightStemFilterFactory,
TestSurroundQueryParser, BasicDistributedZkTest, LengthFilterTest, DisMaxRequestHandlerTest,
AlternateDirectoryTest, TestIndonesianStemFilterFactory, TestGermanLightStemFilterFactory,
SpellCheckCollatorTest, TestCollationKeyFilterFactory, TestFastLRUCache, LukeRequestHandlerTest,
DebugComponentTest, TestQueryTypes, TestGermanStemFilterFactory, TestDocSet, TestWordDelimiterFilterFactory,
LoggingHandlerTest, TestMappingCharFilterFactory, BasicZkTest, TestBM25SimilarityFactory,
MBeansHandlerTest, TestPersianNormalizationFilterFactory, TestNGramFilters, SuggesterTest,
TestBeiderMorseFilterFactory, TestHTMLStripCharFilterFactory, TestSearchPerf, TestValueSourceCache,
TestHashPartitioner, DistributedTermsComponentTest, ShowFileRequestHandlerTest, CoreAdminHandlerTest,
LegacyHTMLStripCharFilterTest, TestHindiFilters, XsltUpdateRequestHandlerTest, SystemInfoHandlerTest,
TestQuerySenderNoQuery, RequiredFieldsTest, TestHyphenationCompoundWordTokenFilterFactory,
TestIrishLowerCaseFilterFactory, NoCacheHeaderTest, FieldMutatingUpdateProcessorTest, URLClassifyProcessorTest,
TestSynonymFilterFactory, HighlighterTest, SuggesterWFSTTest, TestChineseFilterFactory, SpellPossibilityIteratorTest,
BadIndexSchemaTest, TestRussianLightStemFilterFactory, TestXIncludeConfig, SolrCmdDistributorTest,
TestDFRSimilarityFactory, TestRussianFilters, ResourceLoaderTest, TestRangeQuery, TestGreekStemFilterFactory,
QueryElevationComponentTest, TestQuerySenderListener, TestElisionFilterFactory, LeaderElectionIntegrationTest,
NodeStateWatcherTest, SuggesterFSTTest, NumericFieldsTest, SortByFunctionTest, TimeZoneUtilsTest,
RecoveryZkTest, TestSpanishLightStemFilterFactory, TestTypeTokenFilterFactory, TestWriterPerf,
TestTurkishLowerCaseFilterFactory, RequestHandlersTest, SimpleFacetsTest, TestMergePolicyConfig,
TestPorterStemFilterFactory, TestStandardFactories, StandardRequestHandlerTest, TestPropInject,
SuggesterTSTTest, TestPatternTokenizerFactory, DirectUpdateHandlerTest, TestWikipediaTokenizerFactory,
TestPhraseSuggestions, TestJapaneseBaseFormFilterFactory, JsonLoaderTest, TestGermanNormalizationFilterFactory,
TestArabicFilters, SoftAutoCommitTest, SampleTest, TestSynonymMap, TestSolrCoreProperties,
SolrInfoMBeanTest, MultiTermTest, TestIBSimilarityFactory, TestThaiWordFilterFactory, ZkNodePropsTest,
JSONWriterTest, TestBrazilianStemFilterFactory, IndexBasedSpellCheckerTest, FieldAnalysisRequestHandlerTest,
PeerSyncTest, TestConfig, TestBadConfig, ConvertedLegacyTest, TestQueryUtils, OutputWriterTest,
BadComponentTest, TestGroupingSearch, TestFaceting, CurrencyFieldTest, TestSort, TestIndexSearcher,
TestLFUCache, TestFrenchLightStemFilterFactory, UniqFieldsUpdateProcessorFactoryTest, TestPortugueseLightStemFilterFactory,
FullSolrCloudDistribCmdsTest, PolyFieldTest, TestSolrDeletionPolicy1, TestHunspellStemFilterFactory,
TestPerFieldSimilarity, TestMultiCoreConfBootstrap, TestHungarianLightStemFilterFactory, SearchHandlerTest,
FastVectorHighlighterTest, TestSlowSynonymFilter, IndexReaderFactoryTest, TestNumberUtils,
TestCzechStemFilterFactory, IndexSchemaRuntimeFieldTest, TestBulgarianStemFilterFactory, TestBinaryField,
DateMathParserTest, TestStopFilterFactory, TestEnglishMinimalStemFilterFactory, BasicFunctionalityTest,
TestUAX29URLEmailTokenizerFactory, DOMUtilTest, PrimitiveFieldTypeTest, TestPropInjectDefaults,
SpellCheckComponentTest, BinaryUpdateRequestHandlerTest, TestPHPSerializedResponseWriter,
TestOmitPositions, SpatialFilterTest, DirectSolrConnectionTest, MoreLikeThisHandlerTest, OverseerTest,
TestKStemFilterFactory, DocumentBuilderTest, TestLatvianStemFilterFactory, TestLMDirichletSimilarityFactory,
CommonGramsQueryFilterFactoryTest, DoubleMetaphoneFilterFactoryTest, TestSolrQueryParser,
TestJapanesePartOfSpeechStopFilterFactory, TestBinaryResponseWriter, CloudStateUpdateTest,
SolrIndexConfigTest, RAMDirectoryFactoryTest, TestRealTimeGet, LeaderElectionTest, TestReplicationHandler]
   [junit4]   2> 
   [junit4] Completed in 49.75s, 1 test, 1 failure <<< FAILURES!
   [junit4]  
   [junit4] Suite: org.apache.solr.cloud.ZkSolrClientTest
   [junit4] Completed in 23.33s, 4 tests
   [junit4]  
   [junit4] Suite: org.apache.solr.TestDistributedGrouping
   [junit4] Completed in 33.03s, 1 test
   [junit4]  
   [junit4] Suite: org.apache.solr.search.TestRecovery
   [junit4] Completed in 12.61s, 8 tests
   [junit4]  
   [junit4] Suite: org.apache.solr.update.AutoCommitTest
   [junit4] Completed in 7.82s, 3 tests
   [junit4]  
   [junit4] Suite: org.apache.solr.TestJoin
   [junit4] Completed in 6.97s, 2 tests
   [junit4]  
   [junit4] Suite: org.apache.solr.cloud.ZkControllerTest
   [junit4] Completed in 12.50s, 3 tests
   [junit4]  
   [junit4] Suite: org.apache.solr.handler.component.DistributedQueryElevationComponentTest
   [junit4] Completed in 4.01s, 1 test
   [junit4]  
   [junit4] Suite: org.apache.solr.search.TestFiltering
   [junit4] Completed in 2.64s, 2 tests
   [junit4]  
   [junit4] Suite: org.apache.solr.TestTrie
   [junit4] Completed in 1.49s, 8 tests
   [junit4]  
   [junit4] Suite: org.apache.solr.core.SolrCoreTest
   [junit4] Completed in 6.67s, 5 tests
   [junit4]  
   [junit4] Suite: org.apache.solr.update.processor.SignatureUpdateProcessorFactoryTest
   [junit4] Completed in 1.84s, 6 tests
   [junit4]  
   [junit4] Suite: org.apache.solr.core.TestSolrDeletionPolicy2
   [junit4] Completed in 1.44s, 1 test
   [junit4]  
   [junit4] Suite: org.apache.solr.search.TestPseudoReturnFields
   [junit4] Completed in 2.24s, 13 tests
   [junit4]  
   [junit4] Suite: org.apache.solr.handler.component.TermsComponentTest
   [junit4] Completed in 1.57s, 13 tests
   [junit4]  
   [junit4] Suite: org.apache.solr.request.TestRemoteStreaming
   [junit4] Completed in 1.24s, 4 tests
   [junit4]  
   [junit4] Suite: org.apache.solr.handler.DocumentAnalysisRequestHandlerTest
   [junit4] Completed in 0.96s, 4 tests
   [junit4]  
   [junit4] Suite: org.apache.solr.servlet.CacheHeaderTest
   [junit4] Completed in 1.24s, 5 tests
   [junit4]  
   [junit4] Suite: org.apache.solr.analysis.TestReversedWildcardFilterFactory
   [junit4] Completed in 0.87s, 4 tests
   [junit4]  
   [junit4] Suite: org.apache.solr.spelling.FileBasedSpellCheckerTest
   [junit4] Completed in 1.16s, 3 tests
   [junit4]  
   [junit4] Suite: org.apache.solr.response.TestCSVResponseWriter
   [junit4] Completed in 1.18s, 1 test
   [junit4]  
   [junit4] Suite: org.apache.solr.search.TestExtendedDismaxParser
   [junit4] Completed in 10.60s, 8 tests
   [junit4]  
   [junit4] Suite: org.apache.solr.core.TestArbitraryIndexDir
   [junit4] Completed in 1.89s, 1 test
   [junit4]  
   [junit4] Suite: org.apache.solr.schema.IndexSchemaTest
   [junit4] Completed in 1.41s, 3 tests
   [junit4]  
   [junit4] Suite: org.apache.solr.schema.TestCollationField
   [junit4] Completed in 0.65s, 8 tests
   [junit4]  
   [junit4] Suite: org.apache.solr.search.QueryParsingTest
   [junit4] Completed in 1.44s, 3 tests
   [junit4]  
   [junit4] Suite: org.apache.solr.handler.component.TermVectorComponentTest
   [junit4] Completed in 1.58s, 4 tests
   [junit4]  
   [junit4] Suite: org.apache.solr.update.UpdateParamsTest
   [junit4] Completed in 1.20s, 1 test
   [junit4]  
   [junit4] Suite: org.apache.solr.search.ReturnFieldsTest
   [junit4] Completed in 1.39s, 10 tests
   [junit4]  
   [junit4] Suite: org.apache.solr.core.SOLR749Test
   [junit4] Completed in 2.14s, 1 test
   [junit4]  
   [junit4] Suite: org.apache.solr.schema.UUIDFieldTest
   [junit4] Completed in 0.02s, 1 test
   [junit4]  
   [junit4] Suite: org.apache.solr.analysis.TestJapaneseTokenizerFactory
   [junit4] Completed in 0.04s, 4 tests
   [junit4]  
   [junit4] Suite: org.apache.solr.core.TestJmxMonitoredMap
   [junit4] Completed in 0.48s, 2 tests
   [junit4]  
   [junit4] Suite: org.apache.solr.MinimalSchemaTest
   [junit4] Completed in 0.54s, 3 tests
   [junit4]  
   [junit4] Suite: org.apache.solr.core.TestCodecSupport
   [junit4] Completed in 0.33s, 3 tests
   [junit4]  
   [junit4] Suite: org.apache.solr.TestPluginEnable
   [junit4] Completed in 0.22s, 1 test
   [junit4]  
   [junit4] Suite: org.apache.solr.core.PluginInfoTest
   [junit4] Completed in 0.14s, 9 tests
   [junit4]  
   [junit4] Suite: org.apache.solr.util.PrimUtilsTest
   [junit4] Completed in 0.16s, 2 tests
   [junit4]  
   [junit4] Suite: org.apache.solr.schema.OpenExchangeRatesOrgProviderTest
   [junit4] Completed in 0.04s, 5 tests
   [junit4]  
   [junit4] Suite: org.apache.solr.analysis.TestPortugueseMinimalStemFilterFactory
   [junit4] Completed in 0.03s, 1 test
   [junit4]  
   [junit4] Suite: org.apache.solr.analysis.TestPatternReplaceCharFilterFactory
   [junit4] Completed in 0.04s, 3 tests
   [junit4]  
   [junit4] Suite: org.apache.solr.analysis.TestGalicianMinimalStemFilterFactory
   [junit4] Completed in 0.04s, 1 test
   [junit4]  
   [junit4] Suite: org.apache.solr.analysis.CommonGramsFilterFactoryTest
   [junit4] Completed in 0.03s, 2 tests
   [junit4]  
   [junit4] Suite: org.apache.solr.analysis.SnowballPorterFilterFactoryTest
   [junit4] Completed in 0.04s, 2 tests
   [junit4]  
   [junit4] Suite: org.apache.solr.analysis.TestMultiWordSynonyms
   [junit4] Completed in 0.02s, 2 tests
   [junit4]  
   [junit4] Suite: org.apache.solr.internal.csv.CSVUtilsTest
   [junit4] Completed in 0.04s, 14 tests
   [junit4]  
   [junit4] Suite: org.apache.solr.analysis.TestNorwegianLightStemFilterFactory
   [junit4] Completed in 0.02s, 1 test
   [junit4]  
   [junit4] Suite: org.apache.solr.util.TestUtils
   [junit4] Completed in 0.03s, 3 tests
   [junit4]  
   [junit4] Suite: org.apache.solr.analysis.TestKeywordMarkerFilterFactory
   [junit4] Completed in 0.07s, 2 tests
   [junit4]  
   [junit4] Suite: org.apache.solr.analysis.TestNorwegianMinimalStemFilterFactory
   [junit4] Completed in 0.02s, 1 test
   [junit4]  
   [junit4] Suite: org.apache.solr.analysis.TestChineseTokenizerFactory
   [junit4] Completed in 0.01s, 1 test
   [junit4]  
   [junit4] Suite: org.apache.solr.analysis.TestFinnishLightStemFilterFactory
   [junit4] Completed in 0.02s, 1 test
   [junit4]  
   [junit4] Suite: org.apache.solr.analysis.TestKeepFilterFactory
   [junit4] Completed in 0.02s, 1 test
   [junit4]  
   [junit4] Suite: org.apache.solr.internal.csv.writer.CSVWriterTest
   [junit4] Completed in 0.01s, 2 tests
   [junit4]  
   [junit4] Suite: org.apache.solr.search.TestLRUCache
   [junit4] Completed in 0.02s, 3 tests
   [junit4]  
   [junit4] Suite: org.apache.solr.analysis.TestFrenchMinimalStemFilterFactory
   [junit4] Completed in 0.03s, 1 test
   [junit4]  
   [junit4] Suite: org.apache.solr.analysis.TestTrimFilterFactory
   [junit4] Completed in 0.01s, 1 test
   [junit4]  
   [junit4] Suite: org.apache.solr.internal.csv.writer.CSVConfigGuesserTest
   [junit4] Completed in 0.02s, 3 tests
   [junit4]  
   [junit4] Suite: org.apache.solr.internal.csv.writer.CSVConfigTest
   [junit4] Completed in 0.03s, 7 tests
   [junit4]  
   [junit4] Suite: org.apache.solr.analysis.TestCJKBigramFilterFactory
   [junit4] Completed in 0.02s, 2 tests
   [junit4]  
   [junit4] Suite: org.apache.solr.analysis.TestCJKWidthFilterFactory
   [junit4] Completed in 0.02s, 1 test
   [junit4]  
   [junit4] Suite: org.apache.solr.analysis.TestDelimitedPayloadTokenFilterFactory
   [junit4] Completed in 0.02s, 2 tests
   [junit4]  
   [junit4] Suite: org.apache.solr.cloud.CloudStateTest
   [junit4] Completed in 0.01s, 1 test
   [junit4]  
   [junit4] Suite: org.apache.solr.analysis.TestGreekLowerCaseFilterFactory
   [junit4] Completed in 0.01s, 1 test
   [junit4]  
   [junit4] Suite: org.apache.solr.analysis.TestReverseStringFilterFactory
   [junit4] Completed in 0.02s, 1 test
   [junit4]  
   [junit4] Suite: org.apache.solr.util.FileUtilsTest
   [junit4] Completed in 0.01s, 1 test
   [junit4]  
   [junit4] Suite: org.apache.solr.analysis.TestRemoveDuplicatesTokenFilterFactory
   [junit4] Completed in 0.01s, 1 test
   [junit4]  
   [junit4] Suite: org.apache.solr.TestRandomFaceting
   [junit4] Completed in 45.06s, 1 test
   [junit4]  
   [junit4] Suite: org.apache.solr.handler.PingRequestHandlerTest
   [junit4] Completed in 1.87s, 5 tests
   [junit4]  
   [junit4] JVM J0:     0.89 ..   950.19 =   949.31s
   [junit4] Execution time total: 15 minutes 50 seconds
   [junit4] Tests summary: 286 suites, 968 tests, 1 failure, 10 ignored (5 assumptions)

BUILD FAILED
<http://jenkins.sd-datasolutions.de/job/Lucene-Solr-trunk-Windows-Java7-64/ws/build.xml>:29:
The following error occurred while executing this line:
<http://jenkins.sd-datasolutions.de/job/Lucene-Solr-trunk-Windows-Java7-64/ws/solr\build.xml>:144:
The following error occurred while executing this line:
<http://jenkins.sd-datasolutions.de/job/Lucene-Solr-trunk-Windows-Java7-64/ws/lucene\module-build.xml>:62:
The following error occurred while executing this line:
<http://jenkins.sd-datasolutions.de/job/Lucene-Solr-trunk-Windows-Java7-64/ws/lucene\common-build.xml>:1019:
The following error occurred while executing this line:
<http://jenkins.sd-datasolutions.de/job/Lucene-Solr-trunk-Windows-Java7-64/ws/lucene\common-build.xml>:745:
There were test failures: 286 suites, 968 tests, 1 failure, 10 ignored (5 assumptions)

Total time: 37 minutes 7 seconds
Build step 'Invoke Ant' marked build as failure
Recording test results

---------------------------------------------------------------------
To unsubscribe, e-mail: dev-unsubscribe@lucene.apache.org
For additional commands, e-mail: dev-help@lucene.apache.org


Mime
View raw message