lucene-dev mailing list archives

Site index · List index
Message view « Date » · « Thread »
Top « Date » · « Thread »
From jenk...@sd-datasolutions.de
Subject Build failed in Jenkins: Windows-Lucene-Solr-tests-only-trunk #44
Date Thu, 17 May 2012 22:03:05 GMT
See <http://jenkins.sd-datasolutions.de/job/Windows-Lucene-Solr-tests-only-trunk/44/changes>

Changes:

[ehatcher] DeHossification

------------------------------------------
[...truncated 10148 lines...]
   [junit4]    > 	at com.carrotsearch.randomizedtesting.RandomizedRunner.access$700(RandomizedRunner.java:132)
   [junit4]    > 	at com.carrotsearch.randomizedtesting.RandomizedRunner$3$1.run(RandomizedRunner.java:669)
   [junit4]    > 	at com.carrotsearch.randomizedtesting.RandomizedRunner$3.evaluate(RandomizedRunner.java:695)
   [junit4]    > 	at com.carrotsearch.randomizedtesting.RandomizedRunner$4.evaluate(RandomizedRunner.java:734)
   [junit4]    > 	at com.carrotsearch.randomizedtesting.RandomizedRunner$5.evaluate(RandomizedRunner.java:745)
   [junit4]    > 	at com.carrotsearch.randomizedtesting.rules.SystemPropertiesRestoreRule$1.evaluate(SystemPropertiesRestoreRule.java:53)
   [junit4]    > 	at org.apache.lucene.util.AbstractBeforeAfterRule$1.evaluate(AbstractBeforeAfterRule.java:45)
   [junit4]    > 	at org.apache.lucene.util.TestRuleReportUncaughtExceptions$1.evaluate(TestRuleReportUncaughtExceptions.java:68)
   [junit4]    > 	at org.apache.lucene.util.TestRuleStoreClassName$1.evaluate(TestRuleStoreClassName.java:38)
   [junit4]    > 	at org.apache.lucene.util.TestRuleIcuHack$1.evaluate(TestRuleIcuHack.java:51)
   [junit4]    > 	at com.carrotsearch.randomizedtesting.rules.SystemPropertiesInvariantRule$1.evaluate(SystemPropertiesInvariantRule.java:55)
   [junit4]    > 	at org.apache.lucene.util.TestRuleNoInstanceHooksOverrides$1.evaluate(TestRuleNoInstanceHooksOverrides.java:53)
   [junit4]    > 	at org.apache.lucene.util.TestRuleNoStaticHooksShadowing$1.evaluate(TestRuleNoStaticHooksShadowing.java:52)
   [junit4]    > 	at org.apache.lucene.util.TestRuleAssertionsRequired$1.evaluate(TestRuleAssertionsRequired.java:36)
   [junit4]    > 	at org.apache.lucene.util.TestRuleMarkFailure$1.evaluate(TestRuleMarkFailure.java:48)
   [junit4]    > 	at com.carrotsearch.randomizedtesting.RandomizedRunner.runSuite(RandomizedRunner.java:605)
   [junit4]    > 	at com.carrotsearch.randomizedtesting.RandomizedRunner.access$400(RandomizedRunner.java:132)
   [junit4]    > 	at com.carrotsearch.randomizedtesting.RandomizedRunner$2.run(RandomizedRunner.java:551)
   [junit4]    > 
   [junit4]   2> NOTE: reproduce with: ant test -Dtestcase=ShowFileRequestHandlerTest -Dtests.method=testDirList
-Dtests.seed=768F71BFA94AA97 -Dtests.locale=tr -Dtests.timezone=Asia/Vladivostok -Dargs="-Dfile.encoding=Cp1252"
   [junit4]   2>
   [junit4] ERROR   0.01s | ShowFileRequestHandlerTest.testGetRawFile
   [junit4]    > Throwable #1: org.apache.solr.client.solrj.SolrServerException: Server
at http://localhost:56170/solr was not found (404).
   [junit4]    > 	at __randomizedtesting.SeedInfo.seed([768F71BFA94AA97:D9655FF13049CEAE]:0)
   [junit4]    > 	at org.apache.solr.client.solrj.impl.HttpSolrServer.request(HttpSolrServer.java:400)
   [junit4]    > 	at org.apache.solr.client.solrj.impl.HttpSolrServer.request(HttpSolrServer.java:209)
   [junit4]    > 	at org.apache.solr.handler.admin.ShowFileRequestHandlerTest.testGetRawFile(ShowFileRequestHandlerTest.java:85)
   [junit4]    > 	at sun.reflect.NativeMethodAccessorImpl.invoke0(Native Method)
   [junit4]    > 	at sun.reflect.NativeMethodAccessorImpl.invoke(NativeMethodAccessorImpl.java:39)
   [junit4]    > 	at sun.reflect.DelegatingMethodAccessorImpl.invoke(DelegatingMethodAccessorImpl.java:25)
   [junit4]    > 	at java.lang.reflect.Method.invoke(Method.java:597)
   [junit4]    > 	at com.carrotsearch.randomizedtesting.RandomizedRunner.invoke(RandomizedRunner.java:1969)
   [junit4]    > 	at com.carrotsearch.randomizedtesting.RandomizedRunner.access$1100(RandomizedRunner.java:132)
   [junit4]    > 	at com.carrotsearch.randomizedtesting.RandomizedRunner$6.evaluate(RandomizedRunner.java:814)
   [junit4]    > 	at com.carrotsearch.randomizedtesting.RandomizedRunner$7.evaluate(RandomizedRunner.java:875)
   [junit4]    > 	at com.carrotsearch.randomizedtesting.RandomizedRunner$8.evaluate(RandomizedRunner.java:889)
   [junit4]    > 	at com.carrotsearch.randomizedtesting.rules.SystemPropertiesRestoreRule$1.evaluate(SystemPropertiesRestoreRule.java:53)
   [junit4]    > 	at org.apache.lucene.util.TestRuleSetupTeardownChained$1.evaluate(TestRuleSetupTeardownChained.java:50)
   [junit4]    > 	at org.apache.lucene.util.TestRuleFieldCacheSanity$1.evaluate(TestRuleFieldCacheSanity.java:32)
   [junit4]    > 	at org.apache.lucene.util.AbstractBeforeAfterRule$1.evaluate(AbstractBeforeAfterRule.java:45)
   [junit4]    > 	at com.carrotsearch.randomizedtesting.rules.SystemPropertiesInvariantRule$1.evaluate(SystemPropertiesInvariantRule.java:55)
   [junit4]    > 	at org.apache.lucene.util.TestRuleReportUncaughtExceptions$1.evaluate(TestRuleReportUncaughtExceptions.java:68)
   [junit4]    > 	at org.apache.lucene.util.TestRuleThreadAndTestName$1.evaluate(TestRuleThreadAndTestName.java:48)
   [junit4]    > 	at org.apache.lucene.util.TestRuleMarkFailure$1.evaluate(TestRuleMarkFailure.java:48)
   [junit4]    > 	at com.carrotsearch.randomizedtesting.RandomizedRunner.runSingleTest(RandomizedRunner.java:821)
   [junit4]    > 	at com.carrotsearch.randomizedtesting.RandomizedRunner.access$700(RandomizedRunner.java:132)
   [junit4]    > 	at com.carrotsearch.randomizedtesting.RandomizedRunner$3$1.run(RandomizedRunner.java:669)
   [junit4]    > 	at com.carrotsearch.randomizedtesting.RandomizedRunner$3.evaluate(RandomizedRunner.java:695)
   [junit4]    > 	at com.carrotsearch.randomizedtesting.RandomizedRunner$4.evaluate(RandomizedRunner.java:734)
   [junit4]    > 	at com.carrotsearch.randomizedtesting.RandomizedRunner$5.evaluate(RandomizedRunner.java:745)
   [junit4]    > 	at com.carrotsearch.randomizedtesting.rules.SystemPropertiesRestoreRule$1.evaluate(SystemPropertiesRestoreRule.java:53)
   [junit4]    > 	at org.apache.lucene.util.AbstractBeforeAfterRule$1.evaluate(AbstractBeforeAfterRule.java:45)
   [junit4]    > 	at org.apache.lucene.util.TestRuleReportUncaughtExceptions$1.evaluate(TestRuleReportUncaughtExceptions.java:68)
   [junit4]    > 	at org.apache.lucene.util.TestRuleStoreClassName$1.evaluate(TestRuleStoreClassName.java:38)
   [junit4]    > 	at org.apache.lucene.util.TestRuleIcuHack$1.evaluate(TestRuleIcuHack.java:51)
   [junit4]    > 	at com.carrotsearch.randomizedtesting.rules.SystemPropertiesInvariantRule$1.evaluate(SystemPropertiesInvariantRule.java:55)
   [junit4]    > 	at org.apache.lucene.util.TestRuleNoInstanceHooksOverrides$1.evaluate(TestRuleNoInstanceHooksOverrides.java:53)
   [junit4]    > 	at org.apache.lucene.util.TestRuleNoStaticHooksShadowing$1.evaluate(TestRuleNoStaticHooksShadowing.java:52)
   [junit4]    > 	at org.apache.lucene.util.TestRuleAssertionsRequired$1.evaluate(TestRuleAssertionsRequired.java:36)
   [junit4]    > 	at org.apache.lucene.util.TestRuleMarkFailure$1.evaluate(TestRuleMarkFailure.java:48)
   [junit4]    > 	at com.carrotsearch.randomizedtesting.RandomizedRunner.runSuite(RandomizedRunner.java:605)
   [junit4]    > 	at com.carrotsearch.randomizedtesting.RandomizedRunner.access$400(RandomizedRunner.java:132)
   [junit4]    > 	at com.carrotsearch.randomizedtesting.RandomizedRunner$2.run(RandomizedRunner.java:551)
   [junit4]    > 
   [junit4]   2> NOTE: reproduce with: ant test -Dtestcase=ShowFileRequestHandlerTest -Dtests.method=testGetRawFile
-Dtests.seed=768F71BFA94AA97 -Dtests.locale=tr -Dtests.timezone=Asia/Vladivostok -Dargs="-Dfile.encoding=Cp1252"
   [junit4]   2>
   [junit4]    > (@AfterClass output)
   [junit4]   2> NOTE: test params are: codec=Lucene40, sim=DefaultSimilarity, locale=tr,
timezone=Asia/Vladivostok
   [junit4]   2> NOTE: Windows 7 6.1 amd64/Sun Microsystems Inc. 1.6.0_32 (64-bit)/cpus=2,threads=1,free=174196408,total=262930432
   [junit4]   2> NOTE: All tests run in this JVM: [TimeZoneUtilsTest, TestIndonesianStemFilterFactory,
BasicZkTest, UpdateRequestProcessorFactoryTest, TestSolrXMLSerializer, TestGermanLightStemFilterFactory,
MultiTermTest, TestSolrCoreProperties, DirectUpdateHandlerOptimizeTest, TestDFRSimilarityFactory,
FieldAnalysisRequestHandlerTest, TestLFUCache, TestArbitraryIndexDir, TestSynonymMap, TestDistributedGrouping,
TestSwedishLightStemFilterFactory, DistributedTermsComponentTest, TestBinaryResponseWriter,
TestTrimFilterFactory, TestPersianNormalizationFilterFactory, TestJmxMonitoredMap, XsltUpdateRequestHandlerTest,
DistanceFunctionTest, TestPropInjectDefaults, TestNumberUtils, DocumentBuilderTest, TestGermanNormalizationFilterFactory,
TestLMDirichletSimilarityFactory, TestGreekLowerCaseFilterFactory, CoreAdminHandlerTest, TestRangeQuery,
PolyFieldTest, TestCzechStemFilterFactory, TestSolrQueryParser, TestPHPSerializedResponseWriter,
SearchHandlerTest, NumericFieldsTest, TestPortugueseStemFilterFactory, LegacyHTMLStripCharFilterTest,
QueryElevationComponentTest, TestOmitPositions, TestGermanMinimalStemFilterFactory, TestGermanStemFilterFactory,
OverseerTest, CopyFieldTest, TestGalicianMinimalStemFilterFactory, TestJapanesePartOfSpeechStopFilterFactory,
TestLuceneMatchVersion, SampleTest, TestCollationKeyRangeQueries, CSVRequestHandlerTest, TestConfig,
BadIndexSchemaTest, TestPseudoReturnFields, TestUAX29URLEmailTokenizerFactory, JSONWriterTest,
TestStemmerOverrideFilterFactory, TestSpanishLightStemFilterFactory, TestSlowSynonymFilter,
TestTurkishLowerCaseFilterFactory, TestPhoneticFilterFactory, ResourceLoaderTest, TestQuerySenderListener,
TestFastLRUCache, HighlighterTest, TestGalicianStemFilterFactory, TestXIncludeConfig, TestValueSourceCache,
TestFrenchMinimalStemFilterFactory, TestNGramFilters, SolrCoreCheckLockOnStartupTest, TestRussianLightStemFilterFactory,
TestBeiderMorseFilterFactory, IndexBasedSpellCheckerTest, TestBadConfig, SOLR749Test, TestCollationKeyFilterFactory,
TestWriterPerf, TestMultiCoreConfBootstrap, TestSystemIdResolver, TestBinaryField, PrimUtilsTest,
IndexReaderFactoryTest, TestGreekStemFilterFactory, SolrPluginUtilsTest, TestStandardFactories,
SortByFunctionTest, TestTypeTokenFilterFactory, TestFoldingMultitermQuery, TestPortugueseLightStemFilterFactory,
SpellCheckComponentTest, TestCoreContainer, TestHyphenationCompoundWordTokenFilterFactory,
MBeansHandlerTest, SolrIndexConfigTest, PingRequestHandlerTest, TestCJKBigramFilterFactory,
TestTrie, SpellingQueryConverterTest, TestFaceting, TestThaiWordFilterFactory, TestNorwegianMinimalStemFilterFactory,
CacheHeaderTest, TestSort, TestJoin, TestCollationField, DateFieldTest, TestHindiFilters,
DirectSolrSpellCheckerTest, DirectUpdateHandlerTest, TestPortugueseMinimalStemFilterFactory,
TestCSVResponseWriter, TestFiltering, TestNorwegianLightStemFilterFactory, TestDelimitedPayloadTokenFilterFactory,
StatsComponentTest, TestPluginEnable, TestPorterStemFilterFactory, TestCapitalizationFilterFactory,
OpenExchangeRatesOrgProviderTest, TestJapaneseTokenizerFactory, DisMaxRequestHandlerTest,
TestSurroundQueryParser, TestPatternTokenizerFactory, TestHunspellStemFilterFactory, LeaderElectionIntegrationTest,
TestDistributedSearch, TestHTMLStripCharFilterFactory, TestWikipediaTokenizerFactory, TestRemoveDuplicatesTokenFilterFactory,
ReturnFieldsTest, SignatureUpdateProcessorFactoryTest, TestHashPartitioner, TestCSVLoader,
DebugComponentTest, EchoParamsTest, AutoCommitTest, SystemInfoHandlerTest, TestIndexingPerformance,
TestRemoteStreaming, SolrCoreTest, TestReverseStringFilterFactory, TestJmxIntegration, DistributedSpellCheckComponentTest,
TestIndexSearcher, TestRandomFaceting, BasicDistributedZkTest, LoggingHandlerTest, TestMappingCharFilterFactory,
UpdateParamsTest, FileBasedSpellCheckerTest, XmlUpdateRequestHandlerTest, TestDocSet, TestStopFilterFactory,
TestFrenchLightStemFilterFactory, TestIBSimilarityFactory, IndexSchemaTest, BinaryUpdateRequestHandlerTest,
TestCJKTokenizerFactory, SolrRequestParserTest, FileUtilsTest, SuggesterWFSTTest, TestSuggestSpellingConverter,
SolrCmdDistributorTest, SnowballPorterFilterFactoryTest, TestPatternReplaceCharFilterFactory,
TestIrishLowerCaseFilterFactory, PluginInfoTest, TestPerFieldSimilarity, URLClassifyProcessorTest,
IndexSchemaRuntimeFieldTest, TestCJKWidthFilterFactory, FieldMutatingUpdateProcessorTest,
TestBulgarianStemFilterFactory, TestMergePolicyConfig, TermsComponentTest, SuggesterTest,
CloudStateTest, TestRealTimeGet, TestPatternReplaceFilterFactory, TestLatvianStemFilterFactory,
UUIDFieldTest, TestDefaultSimilarityFactory, TestWordDelimiterFilterFactory, TestGroupingSearch,
TestKStemFilterFactory, TestQuerySenderNoQuery, TestFinnishLightStemFilterFactory, TestSearchPerf,
TestPropInject, CommonGramsQueryFilterFactoryTest, TestReplicationHandler, TestSolrDeletionPolicy2,
RAMDirectoryFactoryTest, CurrencyFieldTest, TermVectorComponentTest, TestPhraseSuggestions,
LeaderElectionTest, TestChineseTokenizerFactory, MoreLikeThisHandlerTest, TestRecovery, SimpleFacetsTest,
TestShingleFilterFactory, SpellCheckCollatorTest, FullSolrCloudDistribCmdsTest, RecoveryZkTest,
NodeStateWatcherTest, ZkSolrClientTest, CloudStateUpdateTest, SoftAutoCommitTest, ZkControllerTest,
PeerSyncTest, TestFunctionQuery, DistributedQueryElevationComponentTest, SuggesterFSTTest,
ConvertedLegacyTest, StandardRequestHandlerTest, BasicFunctionalityTest, SolrInfoMBeanTest,
LukeRequestHandlerTest, ShowFileRequestHandlerTest]
   [junit4]   2> 
   [junit4] Completed in 1.53s, 2 tests, 2 errors <<< FAILURES!
   [junit4]  
   [junit4] Suite: org.apache.solr.update.processor.UniqFieldsUpdateProcessorFactoryTest
   [junit4] Completed in 1.06s, 1 test
   [junit4]  
   [junit4] Suite: org.apache.solr.spelling.suggest.SuggesterTSTTest
   [junit4] Completed in 1.78s, 4 tests
   [junit4]  
   [junit4] Suite: org.apache.solr.search.SpatialFilterTest
   [junit4] Completed in 2.52s, 3 tests
   [junit4]  
   [junit4] Suite: org.apache.solr.servlet.NoCacheHeaderTest
   [junit4] Completed in 1.40s, 3 tests
   [junit4]  
   [junit4] Suite: org.apache.solr.handler.DocumentAnalysisRequestHandlerTest
   [junit4] Completed in 1.61s, 4 tests
   [junit4]  
   [junit4] Suite: org.apache.solr.core.TestSolrDeletionPolicy1
   [junit4] Completed in 1.71s, 3 tests
   [junit4]  
   [junit4] Suite: org.apache.solr.core.RequestHandlersTest
   [junit4] Completed in 1.36s, 3 tests
   [junit4]  
   [junit4] Suite: org.apache.solr.highlight.FastVectorHighlighterTest
   [junit4] Completed in 1.39s, 2 tests
   [junit4]  
   [junit4] Suite: org.apache.solr.search.TestQueryTypes
   [junit4] Completed in 1.14s, 1 test
   [junit4]  
   [junit4] Suite: org.apache.solr.analysis.TestReversedWildcardFilterFactory
   [junit4] Completed in 0.96s, 4 tests
   [junit4]  
   [junit4] Suite: org.apache.solr.schema.PrimitiveFieldTypeTest
   [junit4] Completed in 1.74s, 1 test
   [junit4]  
   [junit4] Suite: org.apache.solr.search.TestQueryUtils
   [junit4] Completed in 1.40s, 1 test
   [junit4]  
   [junit4] Suite: org.apache.solr.handler.component.BadComponentTest
   [junit4] Completed in 0.91s, 1 test
   [junit4]  
   [junit4] Suite: org.apache.solr.handler.JsonLoaderTest
   [junit4] Completed in 1.07s, 5 tests
   [junit4]  
   [junit4] Suite: org.apache.solr.schema.RequiredFieldsTest
   [junit4] Completed in 0.84s, 3 tests
   [junit4]  
   [junit4] Suite: org.apache.solr.highlight.HighlighterConfigTest
   [junit4] Completed in 1.06s, 1 test
   [junit4]  
   [junit4] Suite: org.apache.solr.search.TestExtendedDismaxParser
   [junit4] Completed in 8.54s, 8 tests
   [junit4]  
   [junit4] Suite: org.apache.solr.search.QueryParsingTest
   [junit4] Completed in 0.95s, 3 tests
   [junit4]  
   [junit4] Suite: org.apache.solr.core.AlternateDirectoryTest
   [junit4] Completed in 1.07s, 1 test
   [junit4]  
   [junit4] Suite: org.apache.solr.analysis.TestJapaneseBaseFormFilterFactory
   [junit4] Completed in 0.01s, 1 test
   [junit4]  
   [junit4] Suite: org.apache.solr.OutputWriterTest
   [junit4] Completed in 0.33s, 5 tests
   [junit4]  
   [junit4] Suite: org.apache.solr.MinimalSchemaTest
   [junit4] Completed in 0.38s, 3 tests
   [junit4]  
   [junit4] Suite: org.apache.solr.servlet.DirectSolrConnectionTest
   [junit4] Completed in 0.40s, 2 tests
   [junit4]  
   [junit4] Suite: org.apache.solr.schema.NotRequiredUniqueKeyTest
   [junit4] Completed in 0.29s, 1 test
   [junit4]  
   [junit4] Suite: org.apache.solr.search.similarities.TestBM25SimilarityFactory
   [junit4] Completed in 0.14s, 2 tests
   [junit4]  
   [junit4] Suite: org.apache.solr.core.TestCodecSupport
   [junit4] Completed in 0.17s, 3 tests
   [junit4]  
   [junit4] Suite: org.apache.solr.search.similarities.TestLMJelinekMercerSimilarityFactory
   [junit4] Completed in 0.17s, 2 tests
   [junit4]  
   [junit4] Suite: org.apache.solr.util.DateMathParserTest
   [junit4] Completed in 0.05s, 8 tests
   [junit4]  
   [junit4] Suite: org.apache.solr.spelling.SpellPossibilityIteratorTest
   [junit4] Completed in 0.07s, 2 tests
   [junit4]  
   [junit4] Suite: org.apache.solr.internal.csv.CharBufferTest
   [junit4] Completed in 0.02s, 13 tests
   [junit4]  
   [junit4] Suite: org.apache.solr.analysis.TestSynonymFilterFactory
   [junit4] Completed in 0.02s, 4 tests
   [junit4]  
   [junit4] Suite: org.apache.solr.analysis.CommonGramsFilterFactoryTest
   [junit4] Completed in 0.02s, 2 tests
   [junit4]  
   [junit4] Suite: org.apache.solr.analysis.TestMultiWordSynonyms
   [junit4] Completed in 0.01s, 2 tests
   [junit4]  
   [junit4] Suite: org.apache.solr.cloud.ZkNodePropsTest
   [junit4] Completed in 0.01s, 1 test
   [junit4]  
   [junit4] Suite: org.apache.solr.analysis.DoubleMetaphoneFilterFactoryTest
   [junit4] Completed in 0.04s, 3 tests
   [junit4]  
   [junit4] Suite: org.apache.solr.analysis.TestArabicFilters
   [junit4] Completed in 0.02s, 4 tests
   [junit4]  
   [junit4] Suite: org.apache.solr.util.DOMUtilTest
   [junit4] Completed in 0.04s, 1 test
   [junit4]  
   [junit4] Suite: org.apache.solr.analysis.TestElisionFilterFactory
   [junit4] Completed in 0.02s, 3 tests
   [junit4]  
   [junit4] Suite: org.apache.solr.util.TestUtils
   [junit4] Completed in 0.02s, 3 tests
   [junit4]  
   [junit4] Suite: org.apache.solr.analysis.TestDictionaryCompoundWordTokenFilterFactory
   [junit4] Completed in 0.02s, 1 test
   [junit4]  
   [junit4] Suite: org.apache.solr.analysis.TestHungarianLightStemFilterFactory
   [junit4] Completed in 0.02s, 1 test
   [junit4]  
   [junit4] Suite: org.apache.solr.analysis.TestKeywordMarkerFilterFactory
   [junit4] Completed in 0.01s, 2 tests
   [junit4]  
   [junit4] Suite: org.apache.solr.analysis.LengthFilterTest
   [junit4] Completed in 0.01s, 1 test
   [junit4]  
   [junit4] Suite: org.apache.solr.analysis.TestBrazilianStemFilterFactory
   [junit4] Completed in 0.01s, 1 test
   [junit4]  
   [junit4] Suite: org.apache.solr.analysis.TestKeepFilterFactory
   [junit4] Completed in 0.02s, 1 test
   [junit4]  
   [junit4] Suite: org.apache.solr.search.TestLRUCache
   [junit4] Completed in 0.01s, 3 tests
   [junit4]  
   [junit4] Suite: org.apache.solr.internal.csv.writer.CSVConfigTest
   [junit4] Completed in 0.01s, 7 tests
   [junit4]  
   [junit4] Suite: org.apache.solr.analysis.TestRussianFilters
   [junit4] Completed in 0.01s, 1 test
   [junit4]  
   [junit4] Suite: org.apache.solr.analysis.TestChineseFilterFactory
   [junit4] Completed in 0.01s, 1 test
   [junit4]  
   [junit4] Suite: org.apache.solr.analysis.TestEnglishMinimalStemFilterFactory
   [junit4] Completed in 0.01s, 1 test
   [junit4]  
   [junit4] Suite: org.apache.solr.analysis.TestItalianLightStemFilterFactory
   [junit4] Completed in 0.01s, 1 test
   [junit4]  
   [junit4] Suite: org.apache.solr.cloud.ChaosMonkeySafeLeaderTest
   [junit4] Completed in 0.00s, 0 tests
   [junit4]  
   [junit4] Suite: org.apache.solr.update.TestUpdate
   [junit4] Completed in 0.90s, 1 test
   [junit4]  
   [junit4] Suite: org.apache.solr.util.CircularListTest
   [junit4] Completed in 0.00s, 1 test
   [junit4]  
   [junit4] JVM J0:     1.23 ..   944.41 =   943.18s
   [junit4] Execution time total: 15 minutes 44 seconds
   [junit4] Tests summary: 286 suites, 967 tests, 2 errors, 6 ignored (1 assumption)

BUILD FAILED
<http://jenkins.sd-datasolutions.de/job/Windows-Lucene-Solr-tests-only-trunk/ws/build.xml>:29:
The following error occurred while executing this line:
<http://jenkins.sd-datasolutions.de/job/Windows-Lucene-Solr-tests-only-trunk/ws/solr\build.xml>:144:
The following error occurred while executing this line:
<http://jenkins.sd-datasolutions.de/job/Windows-Lucene-Solr-tests-only-trunk/ws/lucene\module-build.xml>:62:
The following error occurred while executing this line:
<http://jenkins.sd-datasolutions.de/job/Windows-Lucene-Solr-tests-only-trunk/ws/lucene\common-build.xml>:1019:
The following error occurred while executing this line:
<http://jenkins.sd-datasolutions.de/job/Windows-Lucene-Solr-tests-only-trunk/ws/lucene\common-build.xml>:745:
There were test failures: 286 suites, 967 tests, 2 errors, 6 ignored (1 assumption)

Total time: 38 minutes 1 second
Build step 'Invoke Ant' marked build as failure
Recording test results

---------------------------------------------------------------------
To unsubscribe, e-mail: dev-unsubscribe@lucene.apache.org
For additional commands, e-mail: dev-help@lucene.apache.org


Mime
View raw message