lucene-dev mailing list archives

Site index · List index
Message view « Date » · « Thread »
Top « Date » · « Thread »
From jenk...@sd-datasolutions.de
Subject Build failed in Jenkins: Lucene-Solr-trunk-Windows-Java6-64 #146
Date Tue, 22 May 2012 12:22:13 GMT
See <http://jenkins.sd-datasolutions.de/job/Lucene-Solr-trunk-Windows-Java6-64/146/>

------------------------------------------
[...truncated 10886 lines...]
   [junit4] ERROR   0.00s | BasicDistributedZkTest (suite)
   [junit4]    > Throwable #1: java.lang.AssertionError: ERROR: SolrIndexSearcher opens=78
closes=77
   [junit4]    > 	at __randomizedtesting.SeedInfo.seed([C6B7A0596B7946E3]:0)
   [junit4]    > 	at org.junit.Assert.fail(Assert.java:93)
   [junit4]    > 	at org.apache.solr.SolrTestCaseJ4.endTrackingSearchers(SolrTestCaseJ4.java:185)
   [junit4]    > 	at org.apache.solr.SolrTestCaseJ4.afterClass(SolrTestCaseJ4.java:82)
   [junit4]    > 	at sun.reflect.GeneratedMethodAccessor16.invoke(Unknown Source)
   [junit4]    > 	at sun.reflect.DelegatingMethodAccessorImpl.invoke(DelegatingMethodAccessorImpl.java:25)
   [junit4]    > 	at java.lang.reflect.Method.invoke(Method.java:597)
   [junit4]    > 	at com.carrotsearch.randomizedtesting.RandomizedRunner.invoke(RandomizedRunner.java:1969)
   [junit4]    > 	at com.carrotsearch.randomizedtesting.RandomizedRunner.access$1100(RandomizedRunner.java:132)
   [junit4]    > 	at com.carrotsearch.randomizedtesting.RandomizedRunner$5.evaluate(RandomizedRunner.java:752)
   [junit4]    > 	at com.carrotsearch.randomizedtesting.rules.SystemPropertiesRestoreRule$1.evaluate(SystemPropertiesRestoreRule.java:53)
   [junit4]    > 	at org.apache.lucene.util.AbstractBeforeAfterRule$1.evaluate(AbstractBeforeAfterRule.java:45)
   [junit4]    > 	at org.apache.lucene.util.TestRuleReportUncaughtExceptions$1.evaluate(TestRuleReportUncaughtExceptions.java:68)
   [junit4]    > 	at org.apache.lucene.util.TestRuleStoreClassName$1.evaluate(TestRuleStoreClassName.java:38)
   [junit4]    > 	at org.apache.lucene.util.TestRuleIcuHack$1.evaluate(TestRuleIcuHack.java:51)
   [junit4]    > 	at com.carrotsearch.randomizedtesting.rules.SystemPropertiesInvariantRule$1.evaluate(SystemPropertiesInvariantRule.java:55)
   [junit4]    > 	at org.apache.lucene.util.TestRuleNoInstanceHooksOverrides$1.evaluate(TestRuleNoInstanceHooksOverrides.java:53)
   [junit4]    > 	at org.apache.lucene.util.TestRuleNoStaticHooksShadowing$1.evaluate(TestRuleNoStaticHooksShadowing.java:52)
   [junit4]    > 	at org.apache.lucene.util.TestRuleAssertionsRequired$1.evaluate(TestRuleAssertionsRequired.java:36)
   [junit4]    > 	at org.apache.lucene.util.TestRuleMarkFailure$1.evaluate(TestRuleMarkFailure.java:48)
   [junit4]    > 	at org.apache.lucene.util.TestRuleIgnoreTestSuites$1.evaluate(TestRuleIgnoreTestSuites.java:56)
   [junit4]    > 	at com.carrotsearch.randomizedtesting.RandomizedRunner.runSuite(RandomizedRunner.java:605)
   [junit4]    > 	at com.carrotsearch.randomizedtesting.RandomizedRunner.access$400(RandomizedRunner.java:132)
   [junit4]    > 	at com.carrotsearch.randomizedtesting.RandomizedRunner$2.run(RandomizedRunner.java:551)
   [junit4]    >
   [junit4] Completed in 187.08s, 1 test, 1 failure <<< FAILURES!
   [junit4]  
   [junit4] Suite: org.apache.solr.handler.TestReplicationHandler
   [junit4] Completed in 29.60s, 1 test
   [junit4]  
   [junit4] Suite: org.apache.solr.handler.component.DistributedTermsComponentTest
   [junit4] Completed in 13.96s, 1 test
   [junit4]  
   [junit4] Suite: org.apache.solr.cloud.ZkControllerTest
   [junit4] Completed in 13.32s, 3 tests
   [junit4]  
   [junit4] Suite: org.apache.solr.handler.component.SpellCheckComponentTest
   [junit4] Completed in 9.94s, 9 tests
   [junit4]  
   [junit4] Suite: org.apache.solr.update.PeerSyncTest
   [junit4] Completed in 5.78s, 1 test
   [junit4]  
   [junit4] Suite: org.apache.solr.handler.component.DistributedQueryElevationComponentTest
   [junit4] Completed in 5.05s, 1 test
   [junit4]  
   [junit4] Suite: org.apache.solr.spelling.suggest.SuggesterFSTTest
   [junit4] Completed in 1.73s, 4 tests
   [junit4]  
   [junit4] Suite: org.apache.solr.TestTrie
   [junit4] Completed in 2.03s, 8 tests
   [junit4]  
   [junit4] Suite: org.apache.solr.handler.component.StatsComponentTest
   [junit4] Completed in 7.58s, 6 tests
   [junit4]  
   [junit4] Suite: org.apache.solr.handler.StandardRequestHandlerTest
   [junit4] Completed in 1.45s, 1 test
   [junit4]  
   [junit4] Suite: org.apache.solr.update.processor.SignatureUpdateProcessorFactoryTest
   [junit4] Completed in 2.06s, 6 tests
   [junit4]  
   [junit4] Suite: org.apache.solr.handler.CSVRequestHandlerTest
   [junit4] Completed in 1.54s, 1 test
   [junit4]  
   [junit4] Suite: org.apache.solr.spelling.SpellCheckCollatorTest
   [junit4] Completed in 2.29s, 5 tests
   [junit4]  
   [junit4] Suite: org.apache.solr.spelling.suggest.SuggesterTSTTest
   [junit4] Completed in 2.09s, 4 tests
   [junit4]  
   [junit4] Suite: org.apache.solr.request.TestBinaryResponseWriter
   [junit4] Completed in 3.04s, 2 tests
   [junit4]  
   [junit4] Suite: org.apache.solr.servlet.CacheHeaderTest
   [junit4] Completed in 1.88s, 5 tests
   [junit4]  
   [junit4] Suite: org.apache.solr.schema.CurrencyFieldTest
   [junit4] IGNORED 0.00s | CurrencyFieldTest.testPerformance
   [junit4]    > Cause: Annotated @Ignore()
   [junit4] Completed in 1.96s, 8 tests, 1 skipped
   [junit4]  
   [junit4] Suite: org.apache.solr.schema.TestOmitPositions
   [junit4] Completed in 1.84s, 2 tests
   [junit4]  
   [junit4] Suite: org.apache.solr.internal.csv.CSVPrinterTest
   [junit4] Completed in 1.00s, 6 tests
   [junit4]  
   [junit4] Suite: org.apache.solr.handler.JsonLoaderTest
   [junit4] Completed in 1.61s, 5 tests
   [junit4]  
   [junit4] Suite: org.apache.solr.core.TestArbitraryIndexDir
   [junit4] Completed in 1.53s, 1 test
   [junit4]  
   [junit4] Suite: org.apache.solr.handler.admin.MBeansHandlerTest
   [junit4] Completed in 1.49s, 1 test
   [junit4]  
   [junit4] Suite: org.apache.solr.search.TestLFUCache
   [junit4] Completed in 1.95s, 5 tests
   [junit4]  
   [junit4] Suite: org.apache.solr.core.TestQuerySenderNoQuery
   [junit4] Completed in 1.50s, 3 tests
   [junit4]  
   [junit4] Suite: org.apache.solr.OutputWriterTest
   [junit4] Completed in 0.32s, 5 tests
   [junit4]  
   [junit4] Suite: org.apache.solr.core.TestJmxMonitoredMap
   [junit4] Completed in 0.24s, 2 tests
   [junit4]  
   [junit4] Suite: org.apache.solr.MinimalSchemaTest
   [junit4] Completed in 0.65s, 3 tests
   [junit4]  
   [junit4] Suite: org.apache.solr.analysis.TestCollationKeyRangeQueries
   [junit4] Completed in 0.57s, 3 tests
   [junit4]  
   [junit4] Suite: org.apache.solr.schema.NotRequiredUniqueKeyTest
   [junit4] Completed in 0.43s, 1 test
   [junit4]  
   [junit4] Suite: org.apache.solr.analysis.TestCollationKeyFilterFactory
   [junit4] Completed in 0.08s, 5 tests
   [junit4]  
   [junit4] Suite: org.apache.solr.search.similarities.TestDFRSimilarityFactory
   [junit4] Completed in 0.26s, 3 tests
   [junit4]  
   [junit4] Suite: org.apache.solr.util.DateMathParserTest
   [junit4] Completed in 0.12s, 8 tests
   [junit4]  
   [junit4] Suite: org.apache.solr.analysis.TestHTMLStripCharFilterFactory
   [junit4] Completed in 0.20s, 6 tests
   [junit4]  
   [junit4] Suite: org.apache.solr.spelling.SpellPossibilityIteratorTest
   [junit4] Completed in 0.20s, 2 tests
   [junit4]  
   [junit4] Suite: org.apache.solr.core.PluginInfoTest
   [junit4] Completed in 0.18s, 9 tests
   [junit4]  
   [junit4] Suite: org.apache.solr.internal.csv.CSVParserTest
   [junit4] Completed in 0.26s, 23 tests
   [junit4]  
   [junit4] Suite: org.apache.solr.analysis.TestGalicianStemFilterFactory
   [junit4] Completed in 0.07s, 1 test
   [junit4]  
   [junit4] Suite: org.apache.solr.analysis.TestShingleFilterFactory
   [junit4] Completed in 0.21s, 13 tests
   [junit4]  
   [junit4] Suite: org.apache.solr.schema.OpenExchangeRatesOrgProviderTest
   [junit4] Completed in 0.14s, 5 tests
   [junit4]  
   [junit4] Suite: org.apache.solr.analysis.TestPortugueseMinimalStemFilterFactory
   [junit4] Completed in 0.06s, 1 test
   [junit4]  
   [junit4] Suite: org.apache.solr.analysis.TestNGramFilters
   [junit4] Completed in 0.08s, 10 tests
   [junit4]  
   [junit4] Suite: org.apache.solr.analysis.TestSlowSynonymFilter
   [junit4] Completed in 0.08s, 7 tests
   [junit4]  
   [junit4] Suite: org.apache.solr.analysis.TestPatternReplaceCharFilterFactory
   [junit4] Completed in 0.04s, 3 tests
   [junit4]  
   [junit4] Suite: org.apache.solr.analysis.TestSynonymFilterFactory
   [junit4] Completed in 0.07s, 4 tests
   [junit4]  
   [junit4] Suite: org.apache.solr.analysis.TestMultiWordSynonyms
   [junit4] Completed in 0.08s, 2 tests
   [junit4]  
   [junit4] Suite: org.apache.solr.internal.csv.CSVUtilsTest
   [junit4] Completed in 0.22s, 14 tests
   [junit4]  
   [junit4] Suite: org.apache.solr.analysis.DoubleMetaphoneFilterFactoryTest
   [junit4] Completed in 0.09s, 3 tests
   [junit4]  
   [junit4] Suite: org.apache.solr.analysis.TestRussianLightStemFilterFactory
   [junit4] Completed in 0.07s, 1 test
   [junit4]  
   [junit4] Suite: org.apache.solr.analysis.TestNorwegianLightStemFilterFactory
   [junit4] Completed in 0.01s, 1 test
   [junit4]  
   [junit4] Suite: org.apache.solr.analysis.TestFrenchLightStemFilterFactory
   [junit4] Completed in 0.03s, 1 test
   [junit4]  
   [junit4] Suite: org.apache.solr.analysis.TestHunspellStemFilterFactory
   [junit4] Completed in 0.08s, 1 test
   [junit4]  
   [junit4] Suite: org.apache.solr.analysis.CommonGramsQueryFilterFactoryTest
   [junit4] Completed in 0.05s, 2 tests
   [junit4]  
   [junit4] Suite: org.apache.solr.analysis.TestDictionaryCompoundWordTokenFilterFactory
   [junit4] Completed in 0.04s, 1 test
   [junit4]  
   [junit4] Suite: org.apache.solr.analysis.TestNorwegianMinimalStemFilterFactory
   [junit4] Completed in 0.29s, 1 test
   [junit4]  
   [junit4] Suite: org.apache.solr.analysis.TestStopFilterFactory
   [junit4] Completed in 0.32s, 1 test
   [junit4]  
   [junit4] Suite: org.apache.solr.analysis.TestWikipediaTokenizerFactory
   [junit4] Completed in 0.18s, 1 test
   [junit4]  
   [junit4] Suite: org.apache.solr.analysis.LengthFilterTest
   [junit4] Completed in 0.03s, 1 test
   [junit4]  
   [junit4] Suite: org.apache.solr.analysis.TestFinnishLightStemFilterFactory
   [junit4] Completed in 0.05s, 1 test
   [junit4]  
   [junit4] Suite: org.apache.solr.analysis.TestIndonesianStemFilterFactory
   [junit4] Completed in 0.05s, 2 tests
   [junit4]  
   [junit4] Suite: org.apache.solr.internal.csv.writer.CSVWriterTest
   [junit4] Completed in 0.05s, 2 tests
   [junit4]  
   [junit4] Suite: org.apache.solr.analysis.TestGermanLightStemFilterFactory
   [junit4] Completed in 0.03s, 1 test
   [junit4]  
   [junit4] Suite: org.apache.solr.analysis.TestSpanishLightStemFilterFactory
   [junit4] Completed in 0.04s, 1 test
   [junit4]  
   [junit4] Suite: org.apache.solr.analysis.TestStemmerOverrideFilterFactory
   [junit4] Completed in 0.03s, 2 tests
   [junit4]  
   [junit4] Suite: org.apache.solr.analysis.TestCzechStemFilterFactory
   [junit4] Completed in 0.02s, 1 test
   [junit4]  
   [junit4] Suite: org.apache.solr.analysis.TestDelimitedPayloadTokenFilterFactory
   [junit4] Completed in 0.02s, 2 tests
   [junit4]  
   [junit4] Suite: org.apache.solr.analysis.TestGermanStemFilterFactory
   [junit4] Completed in 0.04s, 1 test
   [junit4]  
   [junit4] Suite: org.apache.solr.cloud.FullSolrCloudTest
   [junit4] Completed in 0.02s, 0 tests
   [junit4]  
   [junit4] Suite: org.apache.solr.update.TestUpdate
   [junit4] Completed in 2.26s, 1 test
   [junit4]  
   [junit4] JVM J0:     1.22 ..  1073.23 =  1072.01s
   [junit4] Execution time total: 17 minutes 53 seconds
   [junit4] Tests summary: 286 suites, 969 tests, 1 suite-level error, 10 ignored (5 assumptions)

BUILD FAILED
<http://jenkins.sd-datasolutions.de/job/Lucene-Solr-trunk-Windows-Java6-64/ws/build.xml>:29:
The following error occurred while executing this line:
<http://jenkins.sd-datasolutions.de/job/Lucene-Solr-trunk-Windows-Java6-64/ws/solr\build.xml>:144:
The following error occurred while executing this line:
<http://jenkins.sd-datasolutions.de/job/Lucene-Solr-trunk-Windows-Java6-64/ws/lucene\module-build.xml>:62:
The following error occurred while executing this line:
<http://jenkins.sd-datasolutions.de/job/Lucene-Solr-trunk-Windows-Java6-64/ws/lucene\common-build.xml>:1019:
The following error occurred while executing this line:
<http://jenkins.sd-datasolutions.de/job/Lucene-Solr-trunk-Windows-Java6-64/ws/lucene\common-build.xml>:745:
There were test failures: 286 suites, 969 tests, 1 suite-level error, 10 ignored (5 assumptions)

Total time: 38 minutes 22 seconds
Build step 'Invoke Ant' marked build as failure
Recording test results

---------------------------------------------------------------------
To unsubscribe, e-mail: dev-unsubscribe@lucene.apache.org
For additional commands, e-mail: dev-help@lucene.apache.org


Mime
View raw message